{"text_format":"1","workbook":"xlsx","n_sheets":4,"sheets":["General","Data Entry","Lookup Codes","Conversion"],"not_rendered":{"charts":0,"images":1,"macros":1,"external_links":0,"defined_names":31,"comments":1,"pivot_tables":0},"unopened":[],"bounds":{"document_bytes":16777216,"sheet_cells":100000,"rows_first":2000,"rows_last":500,"rows_between":2000,"halvings":0,"cell_chars":16384,"cell_head_chars":4096},"cells_cut":0,"cells_raw":0,"read":"whole","date_system":"1900"}

{"sheet":"General","index":0,"n_rows":96,"n_cols":2,"rows_kept":96,"cut":false,"hidden":false,"merged":[]}
[null,"Permittee Entry Template (PET) Tool"]
[null,"   Key: Red Outline = Required"]
[null,"           Blue Outline = Optional"]
[]
[null,"Agency Name:"]
[]
[]
[null,"Facility Name:"]
[]
[]
{"$rows_left_out":87}
{"sheet":"Data Entry","index":1,"n_rows":9126,"n_cols":18,"rows_kept":9126,"cut":false,"hidden":false,"merged":[]}
["Monitoring Point","Parameter","Data Type","Sample Medium","Analytical Method","Collection \nDate","Collection Time","Analysis \nDate","Qualifier","Result","Units","MDL","ML","RL","Scenario ID","QA Code","Priority Review","Comment"]
["EFF-001","1,1,1,2-Tetrachloroethane","Single",null,"Data Unavailable [DU]","2024-05-01","10:00:00","2024-05-01","=",1,"mg/L",null,null,null,null,"Analytes analyzed at a secondary dilution [D]"]
["EFF-001","1,1,1-Trichloroethane","Single",null,"Data Unavailable [DU]","2024-05-01","10:00:00","2024-05-01","=",1,"mg/L",null,null,null,null,"Estimated maximum possible concentration (EMPC) [FO]"]
[]
[]
[]
[]
[]
[]
[]
{"$rows_left_out":9117}
{"sheet":"Lookup Codes","index":2,"n_rows":981,"n_cols":33,"rows_kept":981,"cut":false,"hidden":false,"merged":[]}
["Sample Medium Code",null,null,"Analytical Method Code",null,null,null,null,"Sample Code",null,"Parameter Code",null,null,null,"Analytical Result Qualifier",null,"Parameter Units",null,null,null,null,"Modified Code",null,null,null,"QA Codes",null,null,"Priority Review"]
["MATRIX","Definition",null,"ANMCODE","Definition",null,"Modified Methods",null,"PVCCODE",null,"BASIS","PARLABEL","Definition",null,"PARVQ",null,"UNITS","Definition",null,"Modified Units",null,"PARAM","UNITS","Methods",null,"QA_CODE","Definition",null,"PRIORITY_REVIEW_CODE","Definition",null,"Concentration","kg/L,g/L,mg/L,ppth,ug/L,ng/L,pg/L,mg/cm2"]
["W","Water",null,"SRL524M","1,2,3-TCP in Drinking Water by GC/MS - CA DHS [SRL524M]",null,"Inductively Coupled Plasma Emission [E200.7]",null,"PR",null,null,"TC1112","1,1,1,2-Tetrachloroethane",null,"=",null,"PERCENT","%",null,"kg/L",null,"1,1,1,2-Tetrachloroethane",{"$f":"$AG$8","v":"kg/L,g/L,mg/L,ppth,ug/L,ng/L,pg/L,mg/cm2,g/day,g/year,kg/day,kg/month,kg/year,lb/day,lbs/week,lbs/month,lbs/year,mg/day,mg/kg,ug/kg,ng/g,ulbs/day,ug/day,t/day"},"GC/MS SIM Method [SIM];HISTORICAL: Volatile Organic Compounds by GC/MS [SW8260];Semivolatile Organic Compounds by GC/MS [SW8270C];Volatile Organic Compounds by GC/MS [SW8260B];Volatile Organic Compounds EPA Method 624 [E624];Data Unavailable [DU]",null,"B","Analyte present in the blank and the sample [B]",null,"N","No"]
[null,null,null,"ISOPU","1990 EML Procedures Manual, Pu-11, HASL-300 [ISOPU]",null,"Data Unavailable [DU]",null,null,null,null,"TCA111","1,1,1-Trichloroethane",null,"<",null,"PEREFF","% effect",null,"g/L",null,"1,1,1-Trichloroethane","kg/L,g/L,mg/L,ppth,ug/L,ng/L,pg/L,mg/cm2,g/day,g/year,kg/day,kg/month,kg/year,lb/day,lbs/week,lbs/month,lbs/year,mg/day,mg/kg,ug/kg,ng/g,ulbs/day,ug/day,t/day","Extractable Priority Pollutants [E625];Extractable Priority Pollutants by GC/MS SIM [E625SIM];GC/MS SIM Method [SIM];HISTORICAL: Volatile Organic Compounds by GC/MS [SW8260];Organochlorine Pesticides and PCBs [E608];Semivolatile Organic Compounds by GC/MS [SW8270C];VOCs by GC/MS Fuel Additives Plus BTEX [8260FAB];Volatile Organic Compounds by GC/MS - Open Scan [8260BOS];Volatile Organic Compounds by GC/MS [SW8260B];Volatile Organic Compounds by GC/MS SIM [8260SIM];Volatile Organic Compounds by Purge and Trap [E524.2];Volatile Organic Compounds EPA Method 624 [E624];Purgeables by GC/MS [E624.1];Data Unavailable [DU]",null,"D","Analytes analyzed at a secondary dilution [D]",null,"Y","Yes",null,"Loading","g/day,g/year,kg/day,kg/month,kg/year,lb/day,lbs/week,lbs/month,lbs/year,mg/day"]
[null,null,null,"ISOU","34th ORNL-DOE Conf.: Measure of Isotopic Uranium [ISOU]",null,null,null,null,null,null,"PCA","1,1,2,2-Tetrachloroethane",null,"<=",null,"%V/V","% effluent",null,"mg/L",null,"1,1,2,2-Tetrachloroethane","kg/L,g/L,mg/L,ppth,ug/L,ng/L,pg/L,mg/cm2,g/day,g/year,kg/day,kg/month,kg/year,lb/day,lbs/week,lbs/month,lbs/year,mg/day,mg/kg,ug/kg,ng/g,ulbs/day,ug/day,t/day","Extractable Priority Pollutants [E625];Extractable Priority Pollutants by GC/MS SIM [E625SIM];GC/MS SIM Method [SIM];HISTORICAL: Volatile Organic Compounds by GC/MS [SW8260];Organochlorine Pesticides and PCBs [E608];Organochlorine Pesticides by Gas Chromatography [SW8081A];Semivolatile Organic Compounds by GC/MS [SW8270C];VOCs by GC/MS Fuel Additives Plus BTEX [8260FAB];Volatile Organic Compounds by GC/MS - Open Scan [8260BOS];Volatile Organic Compounds by GC/MS [SW8260B];Volatile Organic Compounds by GC/MS SIM [8260SIM];Volatile Organic Compounds by Purge and Trap [E524.2];Volatile Organic Compounds EPA Method 624 [E624];Purgeables by GC/MS [E624.1];Data Unavailable [DU]",null,"U","Compound was analyzed for, but was not detected [U]"]
[null,null,null,"A01RCMA","A-01-R - Isotopic Curium and Americium (Alpha Spectrometry -EML HASL-300)",null,null,null,null,null,null,"FC113","1,1,2-Trichloro-1,2,2-Trifluoroethane",null,">",null,"PERPASS","% survival",null,"ppth",null,"1,1,2-Trichloro-1,2,2-Trifluoroethane","kg/L,g/L,mg/L,ppth,ug/L,ng/L,pg/L,mg/cm2,g/day,g/year,kg/day,kg/month,kg/year,lb/day,lbs/week,lbs/month,lbs/year,mg/day,mg/kg,ug/kg,ng/g,ulbs/day,ug/day,t/day","Semivolatile Organic Compounds by GC/MS [SW8270C];Volatile Organic Compounds by GC/MS [SW8260B];Volatile Organic Compounds by Purge and Trap [E524.2];Volatile Organic Compounds EPA Method 624 [E624];Data Unavailable [DU]",null,"R","Data rejected [R]",null,null,null,null,"Mass","mg/kg,ug/kg,ng/g,ulbs/day,ug/day,t/day"]
[null,null,null,"A01RPUN","A-01-R - Isotopic Plutonium and Neptunium (Alpha Spectrometry - EML HASL-300)",null,null,null,null,null,null,"TCA112","1,1,2-Trichloroethane",null,">=",null,"ACRES","Acre",null,"ug/L",null,"1,1,2-Trichloroethane","kg/L,g/L,mg/L,ppth,ug/L,ng/L,pg/L,mg/cm2,g/day,g/year,kg/day,kg/month,kg/year,lb/day,lbs/week,lbs/month,lbs/year,mg/day,mg/kg,ug/kg,ng/g,ulbs/day,ug/day,t/day","Extractable Priority Pollutants [E625];Extractable Priority Pollutants by GC/MS SIM [E625SIM];GC/MS SIM Method [SIM];HISTORICAL: Volatile Organic Compounds by GC/MS [SW8260];Organochlorine Pesticides and PCBs [E608];Organochlorine Pesticides by Gas Chromatography [SW8081A];Semivolatile Organic Compounds by GC/MS [SW8270C];VOCs by GC/MS Fuel Additives Plus BTEX [8260FAB];Volatile Organic Compounds by GC/MS - Open Scan [8260BOS];Volatile Organic Compounds by GC/MS [SW8260B];Volatile Organic Compounds by GC/MS SIM [8260SIM];Volatile Organic Compounds by Purge and Trap [E524.2];Volatile Organic Compounds EPA Method 624 [E624];Purgeables by GC/MS [E624.1];Data Unavailable [DU]",null,"FO","Estimated maximum possible concentration (EMPC) [FO]"]
[null,null,null,"A01RPO","A-01-R - Isotopic Polonium (Alpha Spectrometry - EML HASL-300)",null,null,null,null,null,null,"DCA11","1,1-Dichloroethane",null,"ND",null,"ACRE FT","Acre-feet",null,"ng/L",null,"1,1-Dichloroethane","kg/L,g/L,mg/L,ppth,ug/L,ng/L,pg/L,mg/cm2,g/day,g/year,kg/day,kg/month,kg/year,lb/day,lbs/week,lbs/month,lbs/year,mg/day,mg/kg,ug/kg,ng/g,ulbs/day,ug/day,t/day","Extractable Priority Pollutants [E625];Extractable Priority Pollutants by GC/MS SIM [E625SIM];GC/MS SIM Method [SIM];HISTORICAL: Volatile Organic Compounds by GC/MS [SW8260];Semivolatile Organic Compounds by GC/MS [SW8270C];VOCs by GC/MS Fuel Additives Plus BTEX [8260FAB];Volatile Organic Compounds by GC/MS - Open Scan [8260BOS];Volatile Organic Compounds by GC/MS [SW8260B];Volatile Organic Compounds by Purge and Trap [E524.2];Volatile Organic Compounds EPA Method 624 [E624];Purgeables by GC/MS [E624.1];Data Unavailable [DU]",null,"J","Estimated value [J]",null,null,null,null,"All",{"$f":"CONCATENATE(AG2,\",\",AG4,\",\",AG6)","v":"kg/L,g/L,mg/L,ppth,ug/L,ng/L,pg/L,mg/cm2,g/day,g/year,kg/day,kg/month,kg/year,lb/day,lbs/week,lbs/month,lbs/year,mg/day,mg/kg,ug/kg,ng/g,ulbs/day,ug/day,t/day"}]
[null,null,null,"SW9030A","Acid Soluble and Acid Insoluble Sulfides [SW9030A]",null,null,null,null,null,null,"DCE11","1,1-Dichloroethylene",null,"DNQ",null,"ADMI COLOR","ADMI Color Unit",null,"pg/L",null,"1,1-Dichloroethylene","kg/L,g/L,mg/L,ppth,ug/L,ng/L,pg/L,mg/cm2,g/day,g/year,kg/day,kg/month,kg/year,lb/day,lbs/week,lbs/month,lbs/year,mg/day,mg/kg,ug/kg,ng/g,ulbs/day,ug/day,t/day","Extractable Priority Pollutants [E625];Extractable Priority Pollutants by GC/MS SIM [E625SIM];GC/MS SIM Method [SIM];HISTORICAL: Volatile Organic Compounds by GC/MS [SW8260];Organochlorine Pesticides and PCBs [E608];Organochlorine Pesticides by Gas Chromatography [SW8081A];Semivolatile Organic Compounds by GC/MS [SW8270C];Tetra-through Octa-Chlorinated Dioxins and Furans by HRGC/HRMS [E1613B];VOCs by GC/MS Fuel Additives Plus BTEX [8260FAB];Volatile Organic Compounds by GC/MS - Open Scan [8260BOS];Volatile Organic Compounds by GC/MS [SW8260B];Volatile Organic Compounds by GC/MS SIM [8260SIM];Volatile Organic Compounds by Purge and Trap [E524.2];Volatile Organic Compounds EPA Method 624 [E624];Purgeables by GC/MS [E624.1];Data Unavailable [DU]",null,"BS","Insufficient sample available to follow standard QC procedures [BS]"]
["Sample Type",null,null,"SACIDSL","Acid Soluble Sulfide (EPA Draft 1991) [SACIDSL]",null,null,null,null,null,null,"DCP11","1,1-Dichloropropene",null,null,null,"BANKS","banks",null,"mg/cm2",null,"1,1-Dichloropropene","kg/L,g/L,mg/L,ppth,ug/L,ng/L,pg/L,mg/cm2,g/day,g/year,kg/day,kg/month,kg/year,lb/day,lbs/week,lbs/month,lbs/year,mg/day,mg/kg,ug/kg,ng/g,ulbs/day,ug/day,t/day","GC/MS SIM Method [SIM];HISTORICAL: Volatile Organic Compounds by GC/MS [SW8260];Semivolatile Organic Compounds by GC/MS [SW8270C];Volatile Organic Compounds by GC/MS [SW8260B];Volatile Organic Compounds EPA Method 624 [E624];Data Unavailable [DU]",null,"GB","Matrix spike recovery not within control limits [GB]"]
{"$rows_left_out":972}
{"sheet":"Conversion","index":3,"n_rows":9,"n_cols":59,"rows_kept":9,"cut":false,"hidden":false,"merged":[]}
["FIELD_PT_NAME","LOGDATE","LOGTIME","LOGCODE","SAMPID","MATRIX","PROJNAME","LABWO","GLOBAL_ID","LABCODE","LABSAMPID","QCCODE","ANMCODE","MODPARTLIS","EXMCODE","LABLOTCTL","LABMETH","ANADATE","EXTDATE","RUN_NUMBER","RECDATE","COCNUM","BASIS","PRESCODE","SUB","REP_DATE","LAB_REPNO","APPRVD","TLNOTE","PVCCODE","PARLABEL","PARVAL","PARVQ","LABDL","REPDL","REPDLVQ","PARUN","UNITS","RT","DILFAC","CLREVDATE","SRM","LABREFID","EXPECTED","RLNOTE","USER_ADMIN_ID","COC_MATRIX","DQO_ID","REQ_METHOD_GRP","PROCEDURE_NAME","METH_DESIGN_ID","LAB_METH_GRP","CLEANUP","RES_FF_1","RES_FF_2","RES_FF_3","RES_FF_4","RES_FF_5","TMP_PK_FIELD_OPTIONAL"]
[{"$f":"'Data Entry'!A1","v":"Monitoring Point"},{"$f":"IF('Data Entry'!F1<>\"\",TEXT('Data Entry'!F1,\"YYYYMMDD\"),\"\")","v":"Collection \nDate"},{"$f":"TEXT('Data Entry'!G1,\"HHMM\")","v":"Collection Time"},"N/A","N/A","W",null,null,null,null,null,null,{"$f":"LOOKUP('Data Entry'!E1,ANMDESC,ANMCODE)","v":"CSGAS"},null,null,null,null,{"$f":"IF('Data Entry'!H1<>\"\",TEXT('Data Entry'!H1,\"YYYYMMDD\"),\"\")","v":"Analysis \nDate"},null,{"$f":"COUNTIF(BG2:$BG$2,BG2)","v":1},null,null,{"$f":"IF(LOOKUP('Data Entry'!B1,PARDESC,BASISCODE)=0,\"\",LOOKUP('Data Entry'!B1,PARDESC,BASISCODE))","v":""},null,null,null,null,null,null,{"$f":"'Lookup Codes'!$I$3","v":"PR"},{"$f":"LOOKUP('Data Entry'!B1,PARDESC,PARCODE)","v":"O3RES"},{"$f":"'Data Entry'!J1","v":"Result"},{"$f":"IF('Data Entry'!I1<>\"\",'Data Entry'!I1,\"\")","v":"Qualifier"},{"$f":"IF('Data Entry'!L1<>\"\",'Data Entry'!L1,\"\")","v":"MDL"},{"$f":"IF('Data Entry'!M1<>\"\",'Data Entry'!M1,\"\")","v":"ML"},{"$f":"IF(AI2<>\"\",\"MRL\",\"\")","v":"MRL"},null,{"$f":"LOOKUP('Data Entry'!K1,UNITDESC,UNITCODE)","v":"UMHOS/CM"},null,null,null,null,null,null,{"$f":"IF(ISNA(LOOKUP('Data Entry'!P1,QA_DESC,QA_CODE)),\"\",LOOKUP('Data Entry'!P1,QA_DESC,QA_CODE))","v":"HR"},{"$f":"IF(LEN('Data Entry'!O1)>0,'Data Entry'!O1,\"\")","v":"Scenario ID"},null,null,null,null,null,null,null,{"$f":"IF('Data Entry'!N1<>\"\",'Data Entry'!N1,\"\")","v":"RL"},{"$f":"IF('Data Entry'!R1<>\"\",'Data Entry'!R1,\"\")","v":"Comment"},{"$f":"IF('Data Entry'!C1<>\"\",'Data Entry'!C1,\"\")","v":"Data Type"},{"$f":"IF(ISNA(LOOKUP('Data Entry'!Q1,PRIORITY_REVIEW_DESC,PRIORITY_REVIEW_CODE)),\"\",LOOKUP('Data Entry'!Q1,PRIORITY_REVIEW_DESC,PRIORITY_REVIEW_CODE))","v":"N"},null,{"$f":"A2&AE2&BD2&B2&C2&R2&AF2&AL2","v":"Monitoring PointO3RESData TypeCollection \nDateCollection TimeAnalysis \nDateResultUMHOS/CM"}]
[{"$f":"'Data Entry'!A2","v":"EFF-001"},{"$f":"IF('Data Entry'!F2<>\"\",TEXT('Data Entry'!F2,\"YYYYMMDD\"),\"\")","v":"20240501"},{"$f":"TEXT('Data Entry'!G2,\"HHMM\")","v":"1000"},"N/A","N/A","W",null,null,null,null,null,null,{"$f":"LOOKUP('Data Entry'!E2,ANMDESC,ANMCODE)","v":"DU"},null,null,null,null,{"$f":"IF('Data Entry'!H2<>\"\",TEXT('Data Entry'!H2,\"YYYYMMDD\"),\"\")","v":"20240501"},null,{"$f":"COUNTIF(BG$2:$BG3,BG3)","v":1},null,null,{"$f":"IF(LOOKUP('Data Entry'!B2,PARDESC,BASISCODE)=0,\"\",LOOKUP('Data Entry'!B2,PARDESC,BASISCODE))","v":""},null,null,null,null,null,null,{"$f":"'Lookup Codes'!$I$3","v":"PR"},{"$f":"LOOKUP('Data Entry'!B2,PARDESC,PARCODE)","v":"TC1112"},{"$f":"'Data Entry'!J2","v":1},{"$f":"IF('Data Entry'!I2<>\"\",'Data Entry'!I2,\"\")","v":"="},{"$f":"IF('Data Entry'!L2<>\"\",'Data Entry'!L2,\"\")","v":""},{"$f":"IF('Data Entry'!M2<>\"\",'Data Entry'!M2,\"\")","v":""},{"$f":"IF(AI3<>\"\",\"MRL\",\"\")","v":""},null,{"$f":"LOOKUP('Data Entry'!K2,UNITDESC,UNITCODE)","v":"MG/L"},null,null,null,null,null,null,{"$f":"IF(ISNA(LOOKUP('Data Entry'!P2,QA_DESC,QA_CODE)),\"\",LOOKUP('Data Entry'!P2,QA_DESC,QA_CODE))","v":"D"},{"$f":"IF(LEN('Data Entry'!O2)>0,'Data Entry'!O2,\"\")","v":""},null,null,null,null,null,null,null,{"$f":"IF('Data Entry'!N2<>\"\",'Data Entry'!N2,\"\")","v":""},{"$f":"IF('Data Entry'!R2<>\"\",'Data Entry'!R2,\"\")","v":""},{"$f":"IF('Data Entry'!C2<>\"\",'Data Entry'!C2,\"\")","v":"Single"},{"$f":"IF(ISNA(LOOKUP('Data Entry'!Q2,PRIORITY_REVIEW_DESC,PRIORITY_REVIEW_CODE)),\"\",LOOKUP('Data Entry'!Q2,PRIORITY_REVIEW_DESC,PRIORITY_REVIEW_CODE))","v":""},null,{"$f":"A3&AE3&BD3&B3&C3&R3&AF3&AL3","v":"EFF-001TC1112Single202405011000202405011MG/L"}]
[{"$f":"'Data Entry'!A3","v":"EFF-001"},{"$f":"IF('Data Entry'!F3<>\"\",TEXT('Data Entry'!F3,\"YYYYMMDD\"),\"\")","v":"20240501"},{"$f":"TEXT('Data Entry'!G3,\"HHMM\")","v":"1000"},"N/A","N/A","W",null,null,null,null,null,null,{"$f":"LOOKUP('Data Entry'!E3,ANMDESC,ANMCODE)","v":"DU"},null,null,null,null,{"$f":"IF('Data Entry'!H3<>\"\",TEXT('Data Entry'!H3,\"YYYYMMDD\"),\"\")","v":"20240501"},null,{"$f":"COUNTIF(BG$2:$BG4,BG4)","v":1},null,null,{"$f":"IF(LOOKUP('Data Entry'!B3,PARDESC,BASISCODE)=0,\"\",LOOKUP('Data Entry'!B3,PARDESC,BASISCODE))","v":""},null,null,null,null,null,null,{"$f":"'Lookup Codes'!$I$3","v":"PR"},{"$f":"LOOKUP('Data Entry'!B3,PARDESC,PARCODE)","v":"TCA111"},{"$f":"'Data Entry'!J3","v":1},{"$f":"IF('Data Entry'!I3<>\"\",'Data Entry'!I3,\"\")","v":"="},{"$f":"IF('Data Entry'!L3<>\"\",'Data Entry'!L3,\"\")","v":""},{"$f":"IF('Data Entry'!M3<>\"\",'Data Entry'!M3,\"\")","v":""},"",null,{"$f":"LOOKUP('Data Entry'!K3,UNITDESC,UNITCODE)","v":"MG/L"},null,null,null,null,null,null,{"$f":"IF(ISNA(LOOKUP('Data Entry'!P3,QA_DESC,QA_CODE)),\"\",LOOKUP('Data Entry'!P3,QA_DESC,QA_CODE))","v":"FO"},{"$f":"IF(LEN('Data Entry'!O3)>0,'Data Entry'!O3,\"\")","v":""},null,null,null,null,null,null,null,{"$f":"IF('Data Entry'!N3<>\"\",'Data Entry'!N3,\"\")","v":""},{"$f":"IF('Data Entry'!R3<>\"\",'Data Entry'!R3,\"\")","v":""},{"$f":"IF('Data Entry'!C3<>\"\",'Data Entry'!C3,\"\")","v":"Single"},{"$f":"IF(ISNA(LOOKUP('Data Entry'!Q3,PRIORITY_REVIEW_DESC,PRIORITY_REVIEW_CODE)),\"\",LOOKUP('Data Entry'!Q3,PRIORITY_REVIEW_DESC,PRIORITY_REVIEW_CODE))","v":""},null,"EFF-001TCA111Single202405011000202405011MG/L"]
[{"$f":"'Data Entry'!A4","v":0},{"$f":"IF('Data Entry'!F4<>\"\",TEXT('Data Entry'!F4,\"YYYYMMDD\"),\"\")","v":""},{"$f":"TEXT('Data Entry'!G4,\"HHMM\")","v":"0000"},"N/A","N/A","W",null,null,null,null,null,null,{"$f":"LOOKUP('Data Entry'!E4,ANMDESC,ANMCODE)","v":{"$error":"#N/A"}},null,null,null,null,{"$f":"IF('Data Entry'!H4<>\"\",TEXT('Data Entry'!H4,\"YYYYMMDD\"),\"\")","v":""},null,{"$f":"COUNTIF(BG$2:$BG5,BG5)","v":1},null,null,{"$f":"IF(LOOKUP('Data Entry'!B4,PARDESC,BASISCODE)=0,\"\",LOOKUP('Data Entry'!B4,PARDESC,BASISCODE))","v":{"$error":"#N/A"}},null,null,null,null,null,null,{"$f":"'Lookup Codes'!$I$3","v":"PR"},{"$f":"LOOKUP('Data Entry'!B4,PARDESC,PARCODE)","v":{"$error":"#N/A"}},{"$f":"'Data Entry'!J4","v":0},{"$f":"IF('Data Entry'!I4<>\"\",'Data Entry'!I4,\"\")","v":""},{"$f":"IF('Data Entry'!L4<>\"\",'Data Entry'!L4,\"\")","v":""},{"$f":"IF('Data Entry'!M4<>\"\",'Data Entry'!M4,\"\")","v":""},"",null,{"$f":"LOOKUP('Data Entry'!K4,UNITDESC,UNITCODE)","v":{"$error":"#N/A"}},null,null,null,null,null,null,{"$f":"IF(ISNA(LOOKUP('Data Entry'!P4,QA_DESC,QA_CODE)),\"\",LOOKUP('Data Entry'!P4,QA_DESC,QA_CODE))","v":""},{"$f":"IF(LEN('Data Entry'!O4)>0,'Data Entry'!O4,\"\")","v":""},null,null,null,null,null,null,null,{"$f":"IF('Data Entry'!N4<>\"\",'Data Entry'!N4,\"\")","v":""},{"$f":"IF('Data Entry'!R4<>\"\",'Data Entry'!R4,\"\")","v":""},{"$f":"IF('Data Entry'!C4<>\"\",'Data Entry'!C4,\"\")","v":""},{"$f":"IF(ISNA(LOOKUP('Data Entry'!Q4,PRIORITY_REVIEW_DESC,PRIORITY_REVIEW_CODE)),\"\",LOOKUP('Data Entry'!Q4,PRIORITY_REVIEW_DESC,PRIORITY_REVIEW_CODE))","v":""},null,{"$error":"#N/A"}]
[{"$f":"'Data Entry'!A5","v":0},{"$f":"IF('Data Entry'!F5<>\"\",TEXT('Data Entry'!F5,\"YYYYMMDD\"),\"\")","v":""},{"$f":"TEXT('Data Entry'!G5,\"HHMM\")","v":"0000"},"N/A","N/A","W",null,null,null,null,null,null,{"$f":"LOOKUP('Data Entry'!E5,ANMDESC,ANMCODE)","v":{"$error":"#N/A"}},null,null,null,null,{"$f":"IF('Data Entry'!H5<>\"\",TEXT('Data Entry'!H5,\"YYYYMMDD\"),\"\")","v":""},null,{"$f":"COUNTIF(BG$2:$BG6,BG6)","v":2},null,null,{"$f":"IF(LOOKUP('Data Entry'!B5,PARDESC,BASISCODE)=0,\"\",LOOKUP('Data Entry'!B5,PARDESC,BASISCODE))","v":{"$error":"#N/A"}},null,null,null,null,null,null,{"$f":"'Lookup Codes'!$I$3","v":"PR"},{"$f":"LOOKUP('Data Entry'!B5,PARDESC,PARCODE)","v":{"$error":"#N/A"}},{"$f":"'Data Entry'!J5","v":0},{"$f":"IF('Data Entry'!I5<>\"\",'Data Entry'!I5,\"\")","v":""},{"$f":"IF('Data Entry'!L5<>\"\",'Data Entry'!L5,\"\")","v":""},{"$f":"IF('Data Entry'!M5<>\"\",'Data Entry'!M5,\"\")","v":""},"",null,{"$f":"LOOKUP('Data Entry'!K5,UNITDESC,UNITCODE)","v":{"$error":"#N/A"}},null,null,null,null,null,null,{"$f":"IF(ISNA(LOOKUP('Data Entry'!P5,QA_DESC,QA_CODE)),\"\",LOOKUP('Data Entry'!P5,QA_DESC,QA_CODE))","v":""},{"$f":"IF(LEN('Data Entry'!O5)>0,'Data Entry'!O5,\"\")","v":""},null,null,null,null,null,null,null,{"$f":"IF('Data Entry'!N5<>\"\",'Data Entry'!N5,\"\")","v":""},{"$f":"IF('Data Entry'!R5<>\"\",'Data Entry'!R5,\"\")","v":""},{"$f":"IF('Data Entry'!C5<>\"\",'Data Entry'!C5,\"\")","v":""},{"$f":"IF(ISNA(LOOKUP('Data Entry'!Q5,PRIORITY_REVIEW_DESC,PRIORITY_REVIEW_CODE)),\"\",LOOKUP('Data Entry'!Q5,PRIORITY_REVIEW_DESC,PRIORITY_REVIEW_CODE))","v":""},null,{"$error":"#N/A"}]
[{"$f":"'Data Entry'!A6","v":0},{"$f":"IF('Data Entry'!F6<>\"\",TEXT('Data Entry'!F6,\"YYYYMMDD\"),\"\")","v":""},{"$f":"TEXT('Data Entry'!G6,\"HHMM\")","v":"0000"},"N/A","N/A","W",null,null,null,null,null,null,{"$f":"LOOKUP('Data Entry'!E6,ANMDESC,ANMCODE)","v":{"$error":"#N/A"}},null,null,null,null,{"$f":"IF('Data Entry'!H6<>\"\",TEXT('Data Entry'!H6,\"YYYYMMDD\"),\"\")","v":""},null,{"$f":"COUNTIF(BG$2:$BG7,BG7)","v":3},null,null,{"$f":"IF(LOOKUP('Data Entry'!B6,PARDESC,BASISCODE)=0,\"\",LOOKUP('Data Entry'!B6,PARDESC,BASISCODE))","v":{"$error":"#N/A"}},null,null,null,null,null,null,{"$f":"'Lookup Codes'!$I$3","v":"PR"},{"$f":"LOOKUP('Data Entry'!B6,PARDESC,PARCODE)","v":{"$error":"#N/A"}},{"$f":"'Data Entry'!J6","v":0},{"$f":"IF('Data Entry'!I6<>\"\",'Data Entry'!I6,\"\")","v":""},{"$f":"IF('Data Entry'!L6<>\"\",'Data Entry'!L6,\"\")","v":""},{"$f":"IF('Data Entry'!M6<>\"\",'Data Entry'!M6,\"\")","v":""},"",null,{"$f":"LOOKUP('Data Entry'!K6,UNITDESC,UNITCODE)","v":{"$error":"#N/A"}},null,null,null,null,null,null,{"$f":"IF(ISNA(LOOKUP('Data Entry'!P6,QA_DESC,QA_CODE)),\"\",LOOKUP('Data Entry'!P6,QA_DESC,QA_CODE))","v":""},{"$f":"IF(LEN('Data Entry'!O6)>0,'Data Entry'!O6,\"\")","v":""},null,null,null,null,null,null,null,{"$f":"IF('Data Entry'!N6<>\"\",'Data Entry'!N6,\"\")","v":""},{"$f":"IF('Data Entry'!R6<>\"\",'Data Entry'!R6,\"\")","v":""},{"$f":"IF('Data Entry'!C6<>\"\",'Data Entry'!C6,\"\")","v":""},{"$f":"IF(ISNA(LOOKUP('Data Entry'!Q6,PRIORITY_REVIEW_DESC,PRIORITY_REVIEW_CODE)),\"\",LOOKUP('Data Entry'!Q6,PRIORITY_REVIEW_DESC,PRIORITY_REVIEW_CODE))","v":""},null,{"$error":"#N/A"}]
[{"$f":"'Data Entry'!A7","v":0},{"$f":"IF('Data Entry'!F7<>\"\",TEXT('Data Entry'!F7,\"YYYYMMDD\"),\"\")","v":""},{"$f":"TEXT('Data Entry'!G7,\"HHMM\")","v":"0000"},"N/A","N/A","W",null,null,null,null,null,null,{"$f":"LOOKUP('Data Entry'!E7,ANMDESC,ANMCODE)","v":{"$error":"#N/A"}},null,null,null,null,{"$f":"IF('Data Entry'!H7<>\"\",TEXT('Data Entry'!H7,\"YYYYMMDD\"),\"\")","v":""},null,{"$f":"COUNTIF(BG$2:$BG8,BG8)","v":4},null,null,{"$f":"IF(LOOKUP('Data Entry'!B7,PARDESC,BASISCODE)=0,\"\",LOOKUP('Data Entry'!B7,PARDESC,BASISCODE))","v":{"$error":"#N/A"}},null,null,null,null,null,null,{"$f":"'Lookup Codes'!$I$3","v":"PR"},{"$f":"LOOKUP('Data Entry'!B7,PARDESC,PARCODE)","v":{"$error":"#N/A"}},{"$f":"'Data Entry'!J7","v":0},{"$f":"IF('Data Entry'!I7<>\"\",'Data Entry'!I7,\"\")","v":""},{"$f":"IF('Data Entry'!L7<>\"\",'Data Entry'!L7,\"\")","v":""},{"$f":"IF('Data Entry'!M7<>\"\",'Data Entry'!M7,\"\")","v":""},"",null,{"$f":"LOOKUP('Data Entry'!K7,UNITDESC,UNITCODE)","v":{"$error":"#N/A"}},null,null,null,null,null,null,{"$f":"IF(ISNA(LOOKUP('Data Entry'!P7,QA_DESC,QA_CODE)),\"\",LOOKUP('Data Entry'!P7,QA_DESC,QA_CODE))","v":""},{"$f":"IF(LEN('Data Entry'!O7)>0,'Data Entry'!O7,\"\")","v":""},null,null,null,null,null,null,null,{"$f":"IF('Data Entry'!N7<>\"\",'Data Entry'!N7,\"\")","v":""},{"$f":"IF('Data Entry'!R7<>\"\",'Data Entry'!R7,\"\")","v":""},{"$f":"IF('Data Entry'!C7<>\"\",'Data Entry'!C7,\"\")","v":""},{"$f":"IF(ISNA(LOOKUP('Data Entry'!Q7,PRIORITY_REVIEW_DESC,PRIORITY_REVIEW_CODE)),\"\",LOOKUP('Data Entry'!Q7,PRIORITY_REVIEW_DESC,PRIORITY_REVIEW_CODE))","v":""},null,{"$error":"#N/A"}]
[{"$f":"'Data Entry'!A8","v":0},{"$f":"IF('Data Entry'!F8<>\"\",TEXT('Data Entry'!F8,\"YYYYMMDD\"),\"\")","v":""},{"$f":"TEXT('Data Entry'!G8,\"HHMM\")","v":"0000"},"N/A","N/A","W",null,null,null,null,null,null,{"$f":"LOOKUP('Data Entry'!E8,ANMDESC,ANMCODE)","v":{"$error":"#N/A"}},null,null,null,null,{"$f":"IF('Data Entry'!H8<>\"\",TEXT('Data Entry'!H8,\"YYYYMMDD\"),\"\")","v":""},null,{"$f":"COUNTIF(BG$2:$BG9,BG9)","v":5},null,null,{"$f":"IF(LOOKUP('Data Entry'!B8,PARDESC,BASISCODE)=0,\"\",LOOKUP('Data Entry'!B8,PARDESC,BASISCODE))","v":{"$error":"#N/A"}},null,null,null,null,null,null,{"$f":"'Lookup Codes'!$I$3","v":"PR"},{"$f":"LOOKUP('Data Entry'!B8,PARDESC,PARCODE)","v":{"$error":"#N/A"}},{"$f":"'Data Entry'!J8","v":0},{"$f":"IF('Data Entry'!I8<>\"\",'Data Entry'!I8,\"\")","v":""},{"$f":"IF('Data Entry'!L8<>\"\",'Data Entry'!L8,\"\")","v":""},{"$f":"IF('Data Entry'!M8<>\"\",'Data Entry'!M8,\"\")","v":""},"",null,{"$f":"LOOKUP('Data Entry'!K8,UNITDESC,UNITCODE)","v":{"$error":"#N/A"}},null,null,null,null,null,null,{"$f":"IF(ISNA(LOOKUP('Data Entry'!P8,QA_DESC,QA_CODE)),\"\",LOOKUP('Data Entry'!P8,QA_DESC,QA_CODE))","v":""},{"$f":"IF(LEN('Data Entry'!O8)>0,'Data Entry'!O8,\"\")","v":""},null,null,null,null,null,null,null,{"$f":"IF('Data Entry'!N8<>\"\",'Data Entry'!N8,\"\")","v":""},{"$f":"IF('Data Entry'!R8<>\"\",'Data Entry'!R8,\"\")","v":""},{"$f":"IF('Data Entry'!C8<>\"\",'Data Entry'!C8,\"\")","v":""},{"$f":"IF(ISNA(LOOKUP('Data Entry'!Q8,PRIORITY_REVIEW_DESC,PRIORITY_REVIEW_CODE)),\"\",LOOKUP('Data Entry'!Q8,PRIORITY_REVIEW_DESC,PRIORITY_REVIEW_CODE))","v":""},null,{"$error":"#N/A"}]