{"text_format":"1","workbook":"xlsx","n_sheets":4,"sheets":["General","Data Entry","Lookup Codes","Conversion"],"not_rendered":{"charts":0,"images":1,"macros":1,"external_links":0,"defined_names":31,"comments":1,"pivot_tables":0},"unopened":[],"bounds":{"document_bytes":16777216,"sheet_cells":100000,"rows_first":2000,"rows_last":500,"rows_between":2000,"halvings":0,"cell_chars":16384,"cell_head_chars":4096},"cells_cut":0,"cells_raw":0,"read":"whole","date_system":"1900"}

{"sheet":"General","index":0,"n_rows":96,"n_cols":2,"rows_kept":96,"cut":false,"hidden":false,"merged":[]}
[null,"Permittee Entry Template (PET) Tool"]
[null,"   Key: Red Outline = Required"]
[null,"           Blue Outline = Optional"]
[]
[null,"Agency Name:"]
[]
[]
[null,"Facility Name:"]
[]
[]
[null,"Order No. (RX-XXXX-XXXX)"]
[]
[]
[null,"Reporting Period Start Date"]
[]
[]
[null,"Data Entered By:"]
[]
[]
[null,"QA Performed By:"]
[]
[]
[null,"Analytical Lab Contact Information"]
[null,"Analytical Lab Name"]
[]
[null,"Analytical Lab Location"]
[]
[null,"Analytical Lab Contact & Phone Number"]
[]
[]
[null,"Additional Notes:"]
[]
[]
[null,"           "]
[]
[]
[null,"Version 4.2 (updated 03/04/2025)"]
[]
[]
[]
[]
[]
[]
[]
[]
[]
[]
[]
[]
[]
[]
[]
[]
[]
[]
[]
[]
[]
[]
[]
[]
[]
[]
[]
[]
[]
[]
[]
[]
[]
[]
[]
[]
[]
[]
[]
[]
[]
[]
[]
[]
[]
[]
[]
[]
[]
[]
[]
[]
[]
[]
[]
[]
[]
[null,"Feb 2025-corrected Nitrogen, Nitrate  (as N) [E352.1] to Nitrogen, Nitrate (as N) [E352.1]\n Dec 2024 - added 3 params: d-Decane, m,p cresol, n-octadecane; updated BIPHENTHRIN to BIFENTRHIN \nadded new sample type: Not to exceed a specific limit in more than 10% of samples within any 30-day period.\nOctober 2024- added TOTPFOAPFAS and E1633-D, removed DNQ/ND check from 2022 \nMay 2024 - parameter request and new anmethod SW8260B; add new QA codes D and FO; add Sum of 41 Congeners, Filtered options\nApril 2024 - updated typos in analytical methods: IDEXX Enterolert Test for Enterococci[IENTENT], Standard Method 9230 D: Fluorogenic Substrate Enterococcus Test[A9230D]\nFeb 2024 - added method H10206\nAugust 2023 - corrected mapping to analytical method 4500PF \nJuly - added Plastics\nJune 2023 - 6/2- added method E1600; 6/12 - added Ammonium as Nitrogen and Dissolved Inroganic Carbon; 6/22 added Acid Volatile Sulfides and method E821100 \nMay 2023 - added PAHs and PFAs \nFeb 2023 - added Chronic Toxicity Sheepshead Minnow Growth and Survival, Duration Discharge, Units:gallons\nDec 2022 - added Million gallons to Flow\nOctober 2022 - added parameters\nJuly 2022 - added logic to DNQ values\n"]
[null,"July - 7/7 added Plastics, units - mg and count\nJune 2023 - 6/2- added method E1600; 6/12 - added Ammonium as Nitrogen and Dissolved Inroganic Carbon; 6/22 added Acid Volatile Sulfides and method E821100 \nMay 2023 - added PAHs and PFAs \nFeb 2023 - added Chronic Toxicity Sheepshead Minnow Growth and Sur"]

{"sheet":"Data Entry","index":1,"n_rows":9126,"n_cols":18,"rows_kept":9126,"cut":false,"hidden":false,"merged":[]}
["Monitoring Point","Parameter","Data Type","Sample Medium","Analytical Method","Collection \nDate","Collection Time","Analysis \nDate","Qualifier","Result","Units","MDL","ML","RL","Scenario ID","QA Code","Priority Review","Comment"]
["EFF-001","1,1,1,2-Tetrachloroethane","Single",null,"Data Unavailable [DU]","2024-05-01","10:00:00","2024-05-01","=",1,"mg/L",null,null,null,null,"Analytes analyzed at a secondary dilution [D]"]
["EFF-001","1,1,1-Trichloroethane","Single",null,"Data Unavailable [DU]","2024-05-01","10:00:00","2024-05-01","=",1,"mg/L",null,null,null,null,"Estimated maximum possible concentration (EMPC) [FO]"]
[]
[]
[]
[]
[]
[]
[]
[]
[]
[]
[]
[]
[]
[]
[]
[]
[]
[]
[]
[]
[]
[]
[]
[]
[]
[]
[]
[]
[]
[]
[]
[]
[]
[]
[]
[]
[]
[]
[]
[]
[]
[]
[]
[]
[]
[]
[]
[]
[]
[]
[]
[]
[]
[]
[]
[]
[]
[]
[]
[]
[]
[]
[]
[]
[]
[]
[]
[]
[]
[]
[]
[]
[]
[]
[]
[]
[]
[]
[]
[]
[]
[]
[]
[]
[]
[]
[]
[]
[]
[]
[]
[]
[]
[]
[]
[]
[]
[]
[]
[]
[]
[]
[]
[]
[]
[]
[]
[]
[]
[]
[]
[]
[]
[]
[]
[]
[]
[]
[]
[]
[]
[]
[]
[]
[]
[]
[]
[]
[]
[]
[]
[]
[]
[]
[]
[]
[]
[]
[]
[]
[]
[]
[]
[]
[]
[]
[]
[]
[]
[]
[]
[]
[]
[]
[]
[]
[]
[]
[]
[]
[]
[]
[]
[]
[]
[]
[]
[]
[]
[]
[]
[]
[]
[]
[]
[]
[]
[]
[]
[]
[]
[]
[]
[]
[]
[]
[]
[]
[]
[]
[]
[]
[]
[]
[]
[]
[]
[]
[]
[]
[]
[]
[]
[]
[]
[]
[]
[]
[]
[]
[]
[]
[]
[]
[]
[]
[]
[]
[]
[]
[]
[]
[]
[]
[]
[]
[]
[]
[]
[]
[]
[]
[]
[]
[]
[]
[]
[]
[]
[]
[]
[]
[]
[]
[]
[]
[]
[]
[]
[]
[]
[]
[]
[]
[]
[]
[]
[]
[]
[]
[]
[]
[]
[]
[]
[]
[]
[]
[]
[]
[]
[]
[]
[]
[]
[]
[]
[]
[]
[]
[]
[]
[]
[]
[]
[]
[]
[]
[]
[]
[]
[]
[]
[]
[]
[]
[]
[]
[]
[]
[]
[]
[]
[]
[]
[]
[]
[]
[]
[]
[]
[]
[]
[]
[]
[]
[]
[]
[]
[]
[]
[]
[]
[]
[]
[]
[]
[]
[]
[]
[]
[]
[]
[]
[]
[]
[]
[]
[]
[]
[]
[]
[]
[]
[]
[]
[]
[]
[]
[]
[]
[]
[]
[]
[]
[]
[]
[]
[]
[]
[]
[]
[]
[]
[]
[]
[]
[]
[]
[]
[]
[]
[]
[]
[]
[]
[]
[]
[]
[]
[]
[]
[]
[]
[]
[]
[]
[]
[]
[]
[]
[]
[]
[]
[]
[]
[]
[]
[]
[]
[]
[]
[]
[]
[]
[]
[]
[]
[]
[]
[]
[]
[]
[]
[]
[]
[]
[]
[]
[]
[]
[]
[]
[]
[]
[]
[]
[]
[]
[]
[]
[]
[]
[]
[]
[]
[]
[]
[]
[]
[]
[]
[]
[]
[]
[]
[]
[]
[]
[]
[]
[]
[]
[]
[]
[]
[]
[]
[]
[]
[]
[]
[]
[]
[]
[]
[]
[]
[]
[]
[]
[]
[]
[]
[]
[]
[]
[]
[]
[]
[]
[]
[]
[]
[]
[]
[]
[]
[]
[]
[]
[]
[]
[]
[]
[]
[]
[]
[]
[]
[]
[]
[]
[]
[]
[]
[]
[]
[]
[]
[]
[]
[]
[]
[]
[]
[]
[]
[]
[]
[]
[]
[]
[]
[]
[]
[]
[]
[]
[]
[]
[]
[]
[]
[]
[]
[]
[]
[]
[]
[]
[]
[]
[]
[]
[]
[]
[]
[]
[]
[]
[]
[]
[]
[]
[]
[]
[]
[]
[]
[]
[]
[]
[]
[]
[]
[]
[]
[]
[]
[]
[]
[]
[]
[]
[]
[]
[]
[]
[]
[]
[]
[]
[]
[]
[]
[]
[]
[]
[]
[]
[]
[]
[]
[]
[]
[]
[]
[]
[]
[]
[]
[]
[]
[]
[]
[]
[]
[]
[]
[]
[]
[]
[]
[]
[]
[]
[]
[]
[]
[]
[]
[]
[]
[]
[]
[]
[]
[]
[]
[]
[]
[]
[]
[]
[]
[]
[]
[]
[]
[]
[]
[]
[]
[]
[]
[]
[]
[]
[]
[]
[]
[]
[]
[]
[]
[]
[]
[]
[]
[]
[]
[]
[]
[]
[]
[]
[]
[]
[]
[]
[]
[]
[]
[]
[]
[]
[]
[]
[]
[]
[]
[]
[]
[]
[]
[]
[]
[]
[]
[]
[]
[]
[]
[]
[]
[]
[]
[]
[]
[]
[]
[]
[]
[]
[]
[]
[]
[]
[]
[]
[]
[]
[]
[]
[]
[]
[]
[]
[]
[]
[]
[]
[]
[]
[]
[]
[]
[]
[]
[]
[]
[]
[]
[]
[]
[]
[]
[]
[]
[]
[]
[]
[]
[]
[]
[]
[]
[]
[]
[]
[]
[]
[]
[]
[]
[]
[]
[]
[]
[]
[]
[]
[]
[]
[]
[]
[]
[]
[]
[]
[]
[]
[]
[]
[]
[]
[]
[]
[]
[]
[]
[]
[]
[]
[]
[]
[]
[]
[]
[]
[]
[]
[]
[]
[]
[]
[]
[]
[]
[]
[]
[]
[]
[]
[]
[]
[]
[]
[]
[]
[]
[]
[]
[]
[]
[]
[]
[]
[]
[]
[]
[]
[]
[]
[]
[]
[]
[]
[]
[]
[]
[]
[]
[]
[]
[]
[]
[]
[]
[]
[]
[]
[]
[]
[]
[]
[]
[]
[]
[]
[]
[]
[]
[]
[]
[]
[]
[]
[]
[]
[]
[]
[]
[]
[]
[]
[]
[]
[]
[]
[]
[]
[]
[]
[]
[]
[]
[]
[]
[]
[]
[]
[]
[]
[]
[]
[]
[]
[]
[]
[]
[]
[]
[]
[]
[]
[]
[]
[]
[]
[]
[]
[]
[]
[]
[]
[]
[]
[]
[]
[]
[]
[]
[]
[]
[]
[]
[]
[]
[]
[]
[]
[]
[]
[]
[]
[]
[]
[]
[]
[]
[]
[]
[]
[]
[]
[]
[]
[]
[]
[]
[]
[]
[]
[]
[]
[]
[]
[]
[]
[]
[]
[]
[]
[]
[]
[]
[]
[]
[]
[]
[]
[]
[]
[]
[]
[]
[]
[]
[]
[]
[]
[]
[]
[]
[]
[]
[]
[]
[]
[]
[]
[]
[]
[]
[]
[]
[]
[]
[]
[]
[]
[]
[]
[]
[]
[]
[]
[]
[]
[]
[]
[]
[]
[]
[]
[]
[]
[]
[]
[]
[]
[]
[]
[]
[]
[]
[]
[]
[]
[]
[]
[]
[]
[]
[]
[]
[]
[]
[]
[]
[]
[]
[]
[]
[]
[]
[]
[]
[]
[]
[]
[]
[]
[]
[]
[]
[]
[]
[]
[]
[]
[]
[]
[]
[]
[]
[]
[]
[]
[]
[]
[]
[]
[]
[]
[]
[]
[]
[]
[]
[]
[]
[]
[]
[]
[]
[]
[]
[]
[]
[]
[]
[]
[]
[]
[]
[]
[]
[]
[]
[]
[]
[]
[]
[]
[]
[]
[]
[]
[]
[]
[]
[]
[]
[]
[]
[]
[]
[]
[]
[]
[]
[]
[]
[]
[]
[]
[]
[]
[]
[]
[]
[]
[]
[]
[]
[]
[]
[]
[]
[]
[]
[]
[]
[]
[]
[]
[]
[]
[]
[]
[]
[]
[]
[]
[]
[]
[]
[]
[]
[]
[]
[]
[]
[]
[]
[]
[]
[]
[]
[]
[]
[]
[]
[]
[]
[]
[]
[]
[]
[]
[]
[]
[]
[]
[]
[]
[]
[]
[]
[]
[]
[]
[]
[]
[]
[]
[]
[]
[]
[]
[]
[]
[]
[]
[]
[]
[]
[]
[]
[]
[]
[]
[]
[]
[]
[]
[]
[]
[]
[]
[]
[]
[]
[]
[]
[]
[]
[]
[]
[]
[]
[]
[]
[]
[]
[]
[]
[]
[]
[]
[]
[]
[]
[]
[]
[]
[]
[]
[]
[]
[]
[]
[]
[]
[]
[]
[]
[]
[]
[]
[]
[]
[]
[]
[]
[]
[]
[]
[]
[]
[]
[]
[]
[]
[]
[]
[]
[]
[]
[]
[]
[]
[]
[]
[]
[]
[]
[]
[]
[]
[]
[]
[]
[]
[]
[]
[]
[]
[]
[]
[]
[]
[]
[]
[]
[]
[]
[]
[]
[]
[]
[]
[]
[]
[]
[]
[]
[]
[]
[]
[]
[]
[]
[]
[]
[]
[]
[]
[]
[]
[]
[]
[]
[]
[]
[]
[]
[]
[]
[]
[]
[]
[]
[]
[]
[]
[]
[]
[]
[]
[]
[]
[]
[]
[]
[]
[]
[]
[]
[]
[]
[]
[]
[]
[]
[]
[]
[]
[]
[]
[]
[]
[]
[]
[]
[]
[]
[]
[]
[]
[]
[]
[]
[]
[]
[]
[]
[]
[]
[]
[]
[]
[]
[]
[]
[]
[]
[]
[]
[]
[]
[]
[]
[]
[]
[]
[]
[]
[]
[]
[]
[]
[]
[]
[]
[]
[]
[]
[]
[]
[]
[]
[]
[]
[]
[]
[]
[]
[]
[]
[]
[]
[]
[]
[]
[]
[]
[]
[]
[]
[]
[]
[]
[]
[]
[]
[]
[]
[]
[]
[]
[]
[]
[]
[]
[]
[]
[]
[]
[]
[]
[]
[]
[]
[]
[]
[]
[]
[]
[]
[]
[]
[]
[]
[]
[]
[]
[]
[]
[]
[]
[]
[]
[]
[]
[]
[]
[]
[]
[]
[]
[]
[]
[]
[]
[]
[]
[]
[]
[]
[]
[]
[]
[]
[]
[]
[]
[]
[]
[]
[]
[]
[]
[]
[]
[]
[]
[]
[]
[]
[]
[]
[]
[]
[]
[]
[]
[]
[]
[]
[]
[]
[]
[]
[]
[]
[]
[]
[]
[]
[]
[]
[]
[]
[]
[]
[]
[]
[]
[]
[]
[]
[]
[]
[]
[]
[]
[]
[]
[]
[]
[]
[]
[]
[]
[]
[]
[]
[]
[]
[]
[]
[]
[]
[]
[]
[]
[]
[]
[]
[]
[]
[]
[]
[]
[]
[]
[]
[]
[]
[]
[]
[]
[]
[]
[]
[]
[]
[]
[]
[]
[]
[]
[]
[]
[]
[]
[]
[]
[]
[]
[]
[]
[]
[]
[]
[]
[]
[]
[]
[]
[]
[]
[]
[]
[]
[]
[]
[]
[]
[]
[]
[]
[]
[]
[]
[]
[]
[]
[]
[]
[]
[]
[]
[]
[]
[]
[]
[]
[]
[]
[]
[]
[]
[]
[]
[]
[]
[]
[]
[]
[]
[]
[]
[]
[]
[]
[]
[]
[]
[]
[]
[]
[]
[]
[]
[]
[]
[]
[]
[]
[]
[]
[]
[]
[]
[]
[]
[]
[]
[]
[]
[]
[]
[]
[]
[]
[]
[]
[]
[]
[]
[]
[]
[]
[]
[]
[]
[]
[]
[]
[]
[]
[]
[]
[]
[]
[]
[]
[]
[]
[]
[]
[]
[]
[]
[]
[]
[]
[]
[]
[]
[]
[]
[]
[]
[]
[]
[]
[]
[]
[]
[]
[]
[]
[]
[]
[]
[]
[]
[]
[]
[]
[]
[]
[]
[]
[]
[]
[]
[]
[]
[]
[]
[]
[]
[]
[]
[]
[]
[]
[]
[]
[]
[]
[]
[]
[]
[]
[]
[]
[]
[]
[]
[]
[]
[]
[]
[]
[]
[]
[]
[]
[]
[]
[]
[]
[]
[]
[]
[]
[]
[]
[]
[]
[]
[]
[]
[]
[]
[]
[]
[]
[]
[]
[]
[]
[]
[]
[]
[]
[]
[]
[]
[]
[]
[]
[]
[]
[]
[]
[]
[]
[]
[]
[]
[]
[]
[]
[]
[]
[]
[]
[]
[]
[]
[]
[]
[]
[]
[]
[]
[]
[]
[]
[]
[]
[]
[]
[]
[]
[]
[]
[]
[]
[]
[]
[]
[]
[]
[]
[]
[]
[]
[]
[]
[]
[]
[]
[]
[]
[]
[]
[]
[]
[]
[]
[]
[]
[]
[]
[]
[]
[]
[]
[]
[]
[]
[]
[]
[]
[]
[]
[]
[]
[]
[]
[]
[]
[]
[]
[]
[]
[]
[]
[]
[]
[]
[]
[]
[]
[]
[]
[]
[]
[]
[]
[]
[]
[]
[]
[]
[]
[]
[]
[]
[]
[]
[]
[]
[]
[]
[]
[]
[]
[]
[]
[]
[]
[]
[]
[]
[]
[]
[]
[]
[]
[]
[]
[]
[]
[]
[]
[]
[]
[]
[]
[]
[]
[]
[]
[]
[]
[]
[]
[]
[]
[]
[]
[]
[]
[]
[]
[]
[]
[]
[]
[]
[]
[]
[]
[]
[]
[]
[]
[]
[]
[]
[]
[]
[]
[]
[]
[]
[]
[]
[]
[]
[]
[]
[]
[]
[]
[]
[]
[]
[]
[]
[]
[]
[]
[]
[]
[]
[]
[]
[]
[]
[]
[]
[]
[]
[]
[]
[]
[]
[]
[]
[]
[]
[]
[]
[]
[]
[]
[]
[]
[]
[]
[]
[]
[]
[]
[]
[]
[]
[]
[]
[]
[]
[]
[]
[]
[]
[]
[]
[]
[]
[]
[]
[]
[]
[]
[]
[]
[]
[]
[]
[]
[]
[]
[]
[]
[]
[]
[]
[]
[]
[]
[]
[]
[]
[]
[]
[]
[]
[]
[]
[]
[]
[]
[]
[]
[]
[]
[]
[]
[]
[]
[]
[]
[]
[]
[]
[]
[]
[]
[]
[]
[]
[]
[]
[]
[]
[]
[]
[]
[]
[]
[]
[]
[]
[]
[]
[]
[]
[]
[]
[]
[]
[]
[]
[]
[]
[]
[]
[]
[]
[]
[]
[]
[]
[]
[]
[]
[]
[]
[]
[]
[]
[]
[]
[]
[]
[]
[]
[]
[]
[]
[]
[]
[]
[]
[]
[]
[]
[]
[]
[]
[]
[]
[]
[]
[]
[]
[]
[]
[]
[]
[]
[]
[]
[]
[]
[]
[]
[]
[]
[]
[]
[]
[]
[]
[]
[]
[]
[]
[]
[]
[]
[]
[]
[]
[]
[]
[]
[]
[]
[]
[]
[]
[]
[]
[]
[]
[]
[]
[]
[]
[]
[]
[]
[]
[]
[]
[]
[]
[]
[]
[]
[]
[]
[]
[]
[]
[]
[]
[]
[]
[]
[]
[]
[]
[]
[]
[]
[]
[]
[]
[]
[]
[]
[]
[]
[]
[]
[]
[]
[]
[]
[]
[]
[]
[]
[]
[]
[]
[]
[]
[]
[]
[]
[]
[]
[]
[]
[]
[]
[]
[]
[]
[]
[]
[]
[]
[]
[]
[]
[]
[]
[]
[]
[]
[]
[]
[]
[]
[]
[]
[]
[]
[]
[]
[]
[]
[]
[]
[]
[]
[]
[]
[]
[]
[]
[]
[]
[]
[]
[]
[]
[]
[]
[]
[]
[]
[]
[]
[]
[]
[]
[]
[]
[]
[]
[]
[]
[]
[]
[]
[]
[]
[]
[]
[]
[]
[]
[]
[]
[]
[]
[]
[]
[]
[]
[]
[]
[]
[]
[]
[]
[]
[]
[]
[]
[]
[]
[]
[]
[]
[]
[]
[]
[]
[]
[]
[]
[]
[]
[]
[]
[]
[]
[]
[]
[]
[]
[]
[]
[]
[]
[]
[]
[]
[]
[]
[]
[]
[]
[]
[]
[]
[]
[]
[]
[]
[]
[]
[]
[]
[]
[]
[]
[]
[]
[]
[]
[]
[]
[]
[]
[]
[]
[]
[]
[]
[]
[]
[]
[]
[]
[]
[]
[]
[]
[]
[]
[]
[]
[]
[]
[]
[]
[]
[]
[]
[]
[]
[]
[]
[]
[]
[]
[]
[]
[]
[]
[]
[]
[]
[]
[]
[]
[]
[]
[]
[]
[]
[]
[]
[]
[]
[]
[]
[]
[]
[]
[]
[]
[]
[]
[]
[]
[]
[]
[]
[]
[]
[]
[]
[]
[]
[]
[]
[]
[]
[]
[]
[]
[]
[]
[]
[]
[]
[]
[]
[]
[]
[]
[]
[]
[]
[]
[]
[]
[]
[]
[]
[]
[]
[]
[]
[]
[]
[]
[]
[]
[]
[]
[]
[]
[]
[]
[]
[]
[]
[]
[]
[]
[]
[]
[]
[]
[]
[]
[]
[]
[]
[]
[]
[]
[]
[]
[]
[]
[]
[]
[]
[]
[]
[]
[]
[]
[]
[]
[]
[]
[]
[]
[]
[]
[]
[]
[]
[]
[]
[]
[]
[]
[]
[]
[]
[]
[]
[]
[]
[]
[]
[]
[]
[]
[]
[]
[]
[]
[]
[]
[]
[]
[]
[]
[]
[]
[]
[]
[]
[]
[]
[]
[]
[]
[]
[]
[]
[]
[]
[]
[]
[]
[]
[]
[]
[]
[]
[]
[]
[]
[]
[]
[]
[]
[]
[]
[]
[]
[]
[]
[]
[]
[]
[]
[]
[]
[]
[]
[]
[]
[]
[]
[]
[]
[]
[]
[]
[]
[]
[]
[]
[]
[]
[]
[]
[]
[]
[]
[]
[]
[]
[]
[]
[]
[]
[]
[]
[]
[]
[]
[]
[]
[]
[]
[]
[]
[]
[]
[]
[]
[]
[]
[]
[]
[]
[]
[]
[]
[]
[]
[]
[]
[]
[]
[]
[]
[]
[]
[]
[]
[]
[]
[]
[]
[]
[]
[]
[]
[]
[]
[]
[]
[]
[]
[]
[]
[]
[]
[]
[]
[]
[]
[]
[]
[]
[]
[]
[]
[]
[]
[]
[]
[]
[]
[]
[]
[]
[]
[]
[]
[]
[]
[]
[]
[]
[]
[]
[]
[]
[]
[]
[]
[]
[]
[]
[]
[]
[]
[]
[]
[]
[]
[]
[]
[]
[]
[]
[]
[]
[]
[]
[]
[]
[]
[]
[]
[]
[]
[]
[]
[]
[]
[]
[]
[]
[]
[]
[]
[]
[]
[]
[]
[]
[]
[]
[]
[]
[]
[]
[]
[]
[]
[]
[]
[]
[]
[]
[]
[]
[]
[]
[]
[]
[]
[]
[]
[]
[]
[]
[]
[]
[]
[]
[]
[]
[]
[]
[]
[]
[]
[]
[]
[]
[]
[]
[]
[]
[]
[]
[]
[]
[]
[]
[]
[]
[]
[]
[]
[]
[]
[]
[]
[]
[]
[]
[]
[]
[]
[]
[]
[]
[]
[]
[]
[]
[]
[]
[]
[]
[]
[]
[]
[]
[]
[]
[]
[]
[]
[]
[]
[]
[]
[]
[]
[]
[]
[]
[]
[]
[]
[]
[]
[]
[]
[]
[]
[]
[]
[]
[]
[]
[]
[]
[]
[]
[]
[]
[]
[]
[]
[]
[]
[]
[]
[]
[]
[]
[]
[]
[]
[]
[]
[]
[]
[]
[]
[]
[]
[]
[]
[]
[]
[]
[]
[]
[]
[]
[]
[]
[]
[]
[]
[]
[]
[]
[]
[]
[]
[]
[]
[]
[]
[]
[]
[]
[]
[]
[]
[]
[]
[]
[]
[]
[]
[]
[]
[]
[]
[]
[]
[]
[]
[]
[]
[]
[]
[]
[]
[]
[]
[]
[]
[]
[]
[]
[]
[]
[]
[]
[]
[]
[]
[]
[]
[]
[]
[]
[]
[]
[]
[]
[]
[]
[]
[]
[]
[]
[]
[]
[]
[]
[]
[]
[]
[]
[]
[]
[]
[]
[]
[]
[]
[]
[]
[]
[]
[]
[]
[]
[]
[]
[]
[]
[]
[]
[]
[]
[]
[]
[]
[]
[]
[]
[]
[]
[]
[]
[]
[]
[]
[]
[]
[]
[]
[]
[]
[]
[]
[]
[]
[]
[]
[]
[]
[]
[]
[]
[]
[]
[]
[]
[]
[]
[]
[]
[]
[]
[]
[]
[]
[]
[]
[]
[]
[]
[]
[]
[]
[]
[]
[]
[]
[]
[]
[]
[]
[]
[]
[]
[]
[]
[]
[]
[]
[]
[]
[]
[]
[]
[]
[]
[]
[]
[]
[]
[]
[]
[]
[]
[]
[]
[]
[]
[]
[]
[]
[]
[]
[]
[]
[]
[]
[]
[]
[]
[]
[]
[]
[]
[]
[]
[]
[]
[]
[]
[]
[]
[]
[]
[]
[]
[]
[]
[]
[]
[]
[]
[]
[]
[]
[]
[]
[]
[]
[]
[]
[]
[]
[]
[]
[]
[]
[]
[]
[]
[]
[]
[]
[]
[]
[]
[]
[]
[]
[]
[]
[]
[]
[]
[]
[]
[]
[]
[]
[]
[]
[]
[]
[]
[]
[]
[]
[]
[]
[]
[]
[]
[]
[]
[]
[]
[]
[]
[]
[]
[]
[]
[]
[]
[]
[]
[]
[]
[]
[]
[]
[]
[]
[]
[]
[]
[]
[]
[]
[]
[]
[]
[]
[]
[]
[]
[]
[]
[]
[]
[]
[]
[]
[]
[]
[]
[]
[]
[]
[]
[]
[]
[]
[]
[]
[]
[]
[]
[]
[]
[]
[]
[]
[]
[]
[]
[]
[]
[]
[]
[]
[]
[]
[]
[]
[]
[]
[]
[]
[]
[]
[]
[]
[]
[]
[]
[]
[]
[]
[]
[]
[]
[]
[]
[]
[]
[]
[]
[]
[]
[]
[]
[]
[]
[]
[]
[]
[]
[]
[]
[]
[]
[]
[]
[]
[]
[]
[]
[]
[]
[]
[]
[]
[]
[]
[]
[]
[]
[]
[]
[]
[]
[]
[]
[]
[]
[]
[]
[]
[]
[]
[]
[]
[]
[]
[]
[]
[]
[]
[]
[]
[]
[]
[]
[]
[]
[]
[]
[]
[]
[]
[]
[]
[]
[]
[]
[]
[]
[]
[]
[]
[]
[]
[]
[]
[]
[]
[]
[]
[]
[]
[]
[]
[]
[]
[]
[]
[]
[]
[]
[]
[]
[]
[]
[]
[]
[]
[]
[]
[]
[]
[]
[]
[]
[]
[]
[]
[]
[]
[]
[]
[]
[]
[]
[]
[]
[]
[]
[]
[]
[]
[]
[]
[]
[]
[]
[]
[]
[]
[]
[]
[]
[]
[]
[]
[]
[]
[]
[]
[]
[]
[]
[]
[]
[]
[]
[]
[]
[]
[]
[]
[]
[]
[]
[]
[]
[]
[]
[]
[]
[]
[]
[]
[]
[]
[]
[]
[]
[]
[]
[]
[]
[]
[]
[]
[]
[]
[]
[]
[]
[]
[]
[]
[]
[]
[]
[]
[]
[]
[]
[]
[]
[]
[]
[]
[]
[]
[]
[]
[]
[]
[]
[]
[]
[]
[]
[]
[]
[]
[]
[]
[]
[]
[]
[]
[]
[]
[]
[]
[]
[]
[]
[]
[]
[]
[]
[]
[]
[]
[]
[]
[]
[]
[]
[]
[]
[]
[]
[]
[]
[]
[]
[]
[]
[]
[]
[]
[]
[]
[]
[]
[]
[]
[]
[]
[]
[]
[]
[]
[]
[]
[]
[]
[]
[]
[]
[]
[]
[]
[]
[]
[]
[]
[]
[]
[]
[]
[]
[]
[]
[]
[]
[]
[]
[]
[]
[]
[]
[]
[]
[]
[]
[]
[]
[]
[]
[]
[]
[]
[]
[]
[]
[]
[]
[]
[]
[]
[]
[]
[]
[]
[]
[]
[]
[]
[]
[]
[]
[]
[]
[]
[]
[]
[]
[]
[]
[]
[]
[]
[]
[]
[]
[]
[]
[]
[]
[]
[]
[]
[]
[]
[]
[]
[]
[]
[]
[]
[]
[]
[]
[]
[]
[]
[]
[]
[]
[]
[]
[]
[]
[]
[]
[]
[]
[]
[]
[]
[]
[]
[]
[]
[]
[]
[]
[]
[]
[]
[]
[]
[]
[]
[]
[]
[]
[]
[]
[]
[]
[]
[]
[]
[]
[]
[]
[]
[]
[]
[]
[]
[]
[]
[]
[]
[]
[]
[]
[]
[]
[]
[]
[]
[]
[]
[]
[]
[]
[]
[]
[]
[]
[]
[]
[]
[]
[]
[]
[]
[]
[]
[]
[]
[]
[]
[]
[]
[]
[]
[]
[]
[]
[]
[]
[]
[]
[]
[]
[]
[]
[]
[]
[]
[]
[]
[]
[]
[]
[]
[]
[]
[]
[]
[]
[]
[]
[]
[]
[]
[]
[]
[]
[]
[]
[]
[]
[]
[]
[]
[]
[]
[]
[]
[]
[]
[]
[]
[]
[]
[]
[]
[]
[]
[]
[]
[]
[]
[]
[]
[]
[]
[]
[]
[]
[]
[]
[]
[]
[]
[]
[]
[]
[]
[]
[]
[]
[]
[]
[]
[]
[]
[]
[]
[]
[]
[]
[]
[]
[]
[]
[]
[]
[]
[]
[]
[]
[]
[]
[]
[]
[]
[]
[]
[]
[]
[]
[]
[]
[]
[]
[]
[]
[]
[]
[]
[]
[]
[]
[]
[]
[]
[]
[]
[]
[]
[]
[]
[]
[]
[]
[]
[]
[]
[]
[]
[]
[]
[]
[]
[]
[]
[]
[]
[]
[]
[]
[]
[]
[]
[]
[]
[]
[]
[]
[]
[]
[]
[]
[]
[]
[]
[]
[]
[]
[]
[]
[]
[]
[]
[]
[]
[]
[]
[]
[]
[]
[]
[]
[]
[]
[]
[]
[]
[]
[]
[]
[]
[]
[]
[]
[]
[]
[]
[]
[]
[]
[]
[]
[]
[]
[]
[]
[]
[]
[]
[]
[]
[]
[]
[]
[]
[]
[]
[]
[]
[]
[]
[]
[]
[]
[]
[]
[]
[]
[]
[]
[]
[]
[]
[]
[]
[]
[]
[]
[]
[]
[]
[]
[]
[]
[]
[]
[]
[]
[]
[]
[]
[]
[]
[]
[]
[]
[]
[]
[]
[]
[]
[]
[]
[]
[]
[]
[]
[]
[]
[]
[]
[]
[]
[]
[]
[]
[]
[]
[]
[]
[]
[]
[]
[]
[]
[]
[]
[]
[]
[]
[]
[]
[]
[]
[]
[]
[]
[]
[]
[]
[]
[]
[]
[]
[]
[]
[]
[]
[]
[]
[]
[]
[]
[]
[]
[]
[]
[]
[]
[]
[]
[]
[]
[]
[]
[]
[]
[]
[]
[]
[]
[]
[]
[]
[]
[]
[]
[]
[]
[]
[]
[]
[]
[]
[]
[]
[]
[]
[]
[]
[]
[]
[]
[]
[]
[]
[]
[]
[]
[]
[]
[]
[]
[]
[]
[]
[]
[]
[]
[]
[]
[]
[]
[]
[]
[]
[]
[]
[]
[]
[]
[]
[]
[]
[]
[]
[]
[]
[]
[]
[]
[]
[]
[]
[]
[]
[]
[]
[]
[]
[]
[]
[]
[]
[]
[]
[]
[]
[]
[]
[]
[]
[]
[]
[]
[]
[]
[]
[]
[]
[]
[]
[]
[]
[]
[]
[]
[]
[]
[]
[]
[]
[]
[]
[]
[]
[]
[]
[]
[]
[]
[]
[]
[]
[]
[]
[]
[]
[]
[]
[]
[]
[]
[]
[]
[]
[]
[]
[]
[]
[]
[]
[]
[]
[]
[]
[]
[]
[]
[]
[]
[]
[]
[]
[]
[]
[]
[]
[]
[]
[]
[]
[]
[]
[]
[]
[]
[]
[]
[]
[]
[]
[]
[]
[]
[]
[]
[]
[]
[]
[]
[]
[]
[]
[]
[]
[]
[]
[]
[]
[]
[]
[]
[]
[]
[]
[]
[]
[]
[]
[]
[]
[]
[]
[]
[]
[]
[]
[]
[]
[]
[]
[]
[]
[]
[]
[]
[]
[]
[]
[]
[]
[]
[]
[]
[]
[]
[]
[]
[]
[]
[]
[]
[]
[]
[]
[]
[]
[]
[]
[]
[]
[]
[]
[]
[]
[]
[]
[]
[]
[]
[]
[]
[]
[]
[]
[]
[]
[]
[]
[]
[]
[]
[]
[]
[]
[]
[]
[]
[]
[]
[]
[]
[]
[]
[]
[]
[]
[]
[]
[]
[]
[]
[]
[]
[]
[]
[]
[]
[]
[]
[]
[]
[]
[]
[]
[]
[]
[]
[]
[]
[]
[]
[]
[]
[]
[]
[]
[]
[]
[]
[]
[]
[]
[]
[]
[]
[]
[]
[]
[]
[]
[]
[]
[]
[]
[]
[]
[]
[]
[]
[]
[]
[]
[]
[]
[]
[]
[]
[]
[]
[]
[]
[]
[]
[]
[]
[]
[]
[]
[]
[]
[]
[]
[]
[]
[]
[]
[]
[]
[]
[]
[]
[]
[]
[]
[]
[]
[]
[]
[]
[]
[]
[]
[]
[]
[]
[]
[]
[]
[]
[]
[]
[]
[]
[]
[]
[]
[]
[]
[]
[]
[]
[]
[]
[]
[]
[]
[]
[]
[]
[]
[]
[]
[]
[]
[]
[]
[]
[]
[]
[]
[]
[]
[]
[]
[]
[]
[]
[]
[]
[]
[]
[]
[]
[]
[]
[]
[]
[]
[]
[]
[]
[]
[]
[]
[]
[]
[]
[]
[]
[]
[]
[]
[]
[]
[]
[]
[]
[]
[]
[]
[]
[]
[]
[]
[]
[]
[]
[]
[]
[]
[]
[]
[]
[]
[]
[]
[]
[]
[]
[]
[]
[]
[]
[]
[]
[]
[]
[]
[]
[]
[]
[]
[]
[]
[]
[]
[]
[]
[]
[]
[]
[]
[]
[]
[]
[]
[]
[]
[]
[]
[]
[]
[]
[]
[]
[]
[]
[]
[]
[]
[]
[]
[]
[]
[]
[]
[]
[]
[]
[]
[]
[]
[]
[]
[]
[]
[]
[]
[]
[]
[]
[]
[]
[]
[]
[]
[]
[]
[]
[]
[]
[]
[]
[]
[]
[]
[]
[]
[]
[]
[]
[]
[]
[]
[]
[]
[]
[]
[]
[]
[]
[]
[]
[]
[]
[]
[]
[]
[]
[]
[]
[]
[]
[]
[]
[]
[]
[]
[]
[]
[]
[]
[]
[]
[]
[]
[]
[]
[]
[]
[]
[]
[]
[]
[]
[]
[]
[]
[]
[]
[]
[]
[]
[]
[]
[]
[]
[]
[]
[]
[]
[]
[]
[]
[]
[]
[]
[]
[]
[]
[]
[]
[]
[]
[]
[]
[]
[]
[]
[]
[]
[]
[]
[]
[]
[]
[]
[]
[]
[]
[]
[]
[]
[]
[]
[]
[]
[]
[]
[]
[]
[]
[]
[]
[]
[]
[]
[]
[]
[]
[]
[]
[]
[]
[]
[]
[]
[]
[]
[]
[]
[]
[]
[]
[]
[]
[]
[]
[]
[]
[]
[]
[]
[]
[]
[]
[]
[]
[]
[]
[]
[]
[]
[]
[]
[]
[]
[]
[]
[]
[]
[]
[]
[]
[]
[]
[]
[]
[]
[]
[]
[]
[]
[]
[]
[]
[]
[]
[]
[]
[]
[]
[]
[]
[]
[]
[]
[]
[]
[]
[]
[]
[]
[]
[]
[]
[]
[]
[]
[]
[]
[]
[]
[]
[]
[]
[]
[]
[]
[]
[]
[]
[]
[]
[]
[]
[]
[]
[]
[]
[]
[]
[]
[]
[]
[]
[]
[]
[]
[]
[]
[]
[]
[]
[]
[]
[]
[]
[]
[]
[]
[]
[]
[]
[]
[]
[]
[]
[]
[]
[]
[]
[]
[]
[]
[]
[]
[]
[]
[]
[]
[]
[]
[]
[]
[]
[]
[]
[]
[]
[]
[]
[]
[]
[]
[]
[]
[]
[]
[]
[]
[]
[]
[]
[]
[]
[]
[]
[]
[]
[]
[]
[]
[]
[]
[]
[]
[]
[]
[]
[]
[]
[]
[]
[]
[]
[]
[]
[]
[]
[]
[]
[]
[]
[]
[]
[]
[]
[]
[]
[]
[]
[]
[]
[]
[]
[]
[]
[]
[]
[]
[]
[]
[]
[]
[]
[]
[]
[]
[]
[]
[]
[]
[]
[]
[]
[]
[]
[]
[]
[]
[]
[]
[]
[]
[]
[]
[]
[]
[]
[]
[]
[]
[]
[]
[]
[]
[]
[]
[]
[]
[]
[]
[]
[]
[]
[]
[]
[]
[]
[]
[]
[]
[]
[]
[]
[]
[]
[]
[]
[]
[]
[]
[]
[]
[]
[]
[]
[]
[]
[]
[]
[]
[]
[]
[]
[]
[]
[]
[]
[]
[]
[]
[]
[]
[]
[]
[]
[]
[]
[]
[]
[]
[]
[]
[]
[]
[]
[]
[]
[]
[]
[]
[]
[]
[]
[]
[]
[]
[]
[]
[]
[]
[]
[]
[]
[]
[]
[]
[]
[]
[]
[]
[]
[]
[]
[]
[]
[]
[]
[]
[]
[]
[]
[]
[]
[]
[]
[]
[]
[]
[]
[]
[]
[]
[]
[]
[]
[]
[]
[]
[]
[]
[]
[]
[]
[]
[]
[]
[]
[]
[]
[]
[]
[]
[]
[]
[]
[]
[]
[]
[]
[]
[]
[]
[]
[]
[]
[]
[]
[]
[]
[]
[]
[]
[]
[]
[]
[]
[]
[]
[]
[]
[]
[]
[]
[]
[]
[]
[]
[]
[]
[]
[]
[]
[]
[]
[]
[]
[]
[]
[]
[]
[]
[]
[]
[]
[]
[]
[]
[]
[]
[]
[]
[]
[]
[]
[]
[]
[]
[]
[]
[]
[]
[]
[]
[]
[]
[]
[]
[]
[]
[]
[]
[]
[]
[]
[]
[]
[]
[]
[]
[]
[]
[]
[]
[]
[]
[]
[]
[]
[]
[]
[]
[]
[]
[]
[]
[]
[]
[]
[]
[]
[]
[]
[]
[]
[]
[]
[]
[]
[]
[]
[]
[]
[]
[]
[]
[]
[]
[]
[]
[]
[]
[]
[]
[]
[]
[]
[]
[]
[]
[]
[]
[]
[]
[]
[]
[]
[]
[]
[]
[]
[]
[]
[]
[]
[]
[]
[]
[]
[]
[]
[]
[]
[]
[]
[]
[]
[]
[]
[]
[]
[]
[]
[]
[]
[]
[]
[]
[]
[]
[]
[]
[]
[]
[]
[]
[]
[]
[]
[]
[]
[]
[]
[]
[]
[]
[]
[]
[]
[]
[]
[]
[]
[]
[]
[]
[]
[]
[]
[]
[]
[]
[]
[]
[]
[]
[]
[]
[]
[]
[]
[]
[]
[]
[]
[]
[]
[]
[]
[]
[]
[]
[]
[]
[]
[]
[]
[]
[]
[]
[]
[]
[]
[]
[]
[]
[]
[]
[]
[]
[]
[]
[]
[]
[]
[]
[]
[]
[]
[]
[]
[]
[]
[]
[]
[]
[]
[]
[]
[]
[]
[]
[]
[]
[]
[]
[]
[]
[]
[]
[]
[]
[]
[]
[]
[]
[]
[]
[]
[]
[]
[]
[]
[]
[]
[]
[]
[]
[]
[]
[]
[]
[]
[]
[]
[]
[]
[]
[]
[]
[]
[]
[]
[]
[]
[]
[]
[]
[]
[]
[]
[]
[]
[]
[]
[]
[]
[]
[]
[]
[]
[]
[]
[]
[]
[]
[]
[]
[]
[]
[]
[]
[]
[]
[]
[]
[]
[]
[]
[]
[]
[]
[]
[]
[]
[]
[]
[]
[]
[]
[]
[]
[]
[]
[]
[]
[]
[]
[]
[]
[]
[]
[]
[]
[]
[]
[]
[]
[]
[]
[]
[]
[]
[]
[]
[]
[]
[]
[]
[]
[]
[]
[]
[]
[]
[]
[]
[]
[]
[]
[]
[]
[]
[]
[]
[]
[]
[]
[]
[]
[]
[]
[]
[]
[]
[]
[]
[]
[]
[]
[]
[]
[]
[]
[]
[]
[]
[]
[]
[]
[]
[]
[]
[]
[]
[]
[]
[]
[]
[]
[]
[]
[]
[]
[]
[]
[]
[]
[]
[]
[]
[]
[]
[]
[]
[]
[]
[]
[]
[]
[]
[]
[]
[]
[]
[]
[]
[]
[]
[]
[]
[]
[]
[]
[]
[]
[]
[]
[]
[]
[]
[]
[]
[]
[]
[]
[]
[]
[]
[]
[]
[]
[]
[]
[]
[]
[]
[]
[]
[]
[]
[]
[]
[]
[]
[]
[]
[]
[]
[]
[]
[]
[]
[]
[]
[]
[]
[]
[]
[]
[]
[]
[]
[]
[]
[]
[]
[]
[]
[]
[]
[]
[]
[]
[]
[]
[]
[]
[]
[]
[]
[]
[]
[]
[]
[]
[]
[]
[]
[]
[]
[]
[]
[]
[]
[]
[]
[]
[]
[]
[]
[]
[]
[]
[]
[]
[]
[]
[]
[]
[]
[]
[]
[]
[]
[]
[]
[]
[]
[]
[]
[]
[]
[]
[]
[]
[]
[]
[]
[]
[]
[]
[]
[]
[]
[]
[]
[]
[]
[]
[]
[]
[]
[]
[]
[]
[]
[]
[]
[]
[]
[]
[]
[]
[]
[]
[]
[]
[]
[]
[]
[]
[]
[]
[]
[]
[]
[]
[]
[]
[]
[]
[]
[]
[]
[]
[]
[]
[]
[]
[]
[]
[]
[]
[]
[]
[]
[]
[]
[]
[]
[]
[]
[]
[]
[]
[]
[]
[]
[]
[]
[]
[]
[]
[]
[]
[]
[]
[]
[]
[]
[]
[]
[]
[]
[]
[]
[]
[]
[]
[]
[]
[]
[]
[]
[]
[]
[]
[]
[]
[]
[]
[]
[]
[]
[]
[]
[]
[]
[]
[]
[]
[]
[]
[]
[]
[]
[]
[]
[]
[]
[]
[]
[]
[]
[]
[]
[]
[]
[]
[]
[]
[]
[]
[]
[]
[]
[]
[]
[]
[]
[]
[]
[]
[]
[]
[]
[]
[]
[]
[]
[]
[]
[]
[]
[]
[]
[]
[]
[]
[]
[]
[]
[]
[]
[]
[]
[]
[]
[]
[]
[]
[]
[]
[]
[]
[]
[]
[]
[]
[]
[]
[]
[]
[]
[]
[]
[]
[]
[]
[]
[]
[]
[]
[]
[]
[]
[]
[]
[]
[]
[]
[]
[]
[]
[]
[]
[]
[]
[]
[]
[]
[]
[]
[]
[]
[]
[]
[]
[]
[]
[]
[]
[]
[]
[]
[]
[]
[]
[]
[]
[]
[]
[]
[]
[]
[]
[]
[]
[]
[]
[]
[]
[]
[]
[]
[]
[]
[]
[]
[]
[]
[]
[]
[]
[]
[]
[]
[]
[]
[]
[]
[]
[]
[]
[]
[]
[]
[]
[]
[]
[]
[]
[]
[]
[]
[]
[]
[]
[]
[]
[]
[]
[]
[]
[]
[]
[]
[]
[]
[]
[]
[]
[]
[]
[]
[]
[]
[]
[]
[]
[]
[]
[]
[]
[]
[]
[]
[]
[]
[]
[]
[]
[]
[]
[]
[]
[]
[]
[]
[]
[]
[]
[]
[]
[]
[]
[]
[]
[]
[]
[]
[]
[]
[]
[]
[]
[]
[]
[]
[]
[]
[]
[]
[]
[]
[]
[]
[]
[]
[]
[]
[]
[]
[]
[]
[]
[]
[]
[]
[]
[]
[]
[]
[]
[]
[]
[]
[]
[]
[]
[]
[]
[]
[]
[]
[]
[]
[]
[]
[]
[]
[]
[]
[]
[]
[]
[]
[]
[]
[]
[]
[]
[]
[]
[]
[]
[]
[]
[]
[]
[]
[]
[]
[]
[]
[]
[]
[]
[]
[]
[]
[]
[]
[]
[]
[]
[]
[]
[]
[]
[]
[]
[]
[]
[]
[]
[]
[]
[]
[]
[]
[]
[]
[]
[]
[]
[]
[]
[]
[]
[]
[]
[]
[]
[]
[]
[]
[]
[]
[]
[]
[]
[]
[]
[]
[]
[]
[]
[]
[]
[]
[]
[]
[]
[]
[]
[]
[]
[]
[]
[]
[]
[]
[]
[]
[]
[]
[]
[]
[]
[]
[]
[]
[]
[]
[]
[]
[]
[]
[]
[]
[]
[]
[]
[]
[]
[]
[]
[]
[]
[]
[]
[]
[]
[]
[]
[]
[]
[]
[]
[]
[]
[]
[]
[]
[]
[]
[]
[]
[]
[]
[]
[]
[]
[]
[]
[]
[]
[]
[]
[]
[]
[]
[]
[]
[]
[]
[]
[]
[]
[]
[]
[]
[]
[]
[]
[]
[]
[]
[]
[]
[]
[]
[]
[]
[]
[]
[]
[]
[]
[]
[]
[]
[]
[]
[]
[]
[]
[]
[]
[]
[]
[]
[]
[]
[]
[]
[]
[]
[]
[]
[]
[]
[]
[]
[]
[]
[]
[]
[]
[]
[]
[]
[]
[]
[]
[]
[]
[]
[]
[]
[]
[]
[]
[]
[]
[]
[]
[]
[]
[]
[]
[]
[]
[]
[]
[]
[]
[]
[]
[]
[]
[]
[]
[]
[]
[]
[]
[]
[]
[]
[]
[]
[]
[]
[]
[]
[]
[]
[]
[]
[]
[]
[]
[]
[]
[]
[]
[]
[]
[]
[]
[]
[]
[]
[]
[]
[]
[]
[]
[]
[]
[]
[]
[]
[]
[]
[]
[]
[]
[]
[]
[]
[]
[]
[]
[]
[]
[]
[]
[]
[]
[]
[]
[]
[]
[]
[]
[]
[]
[]
[]
[]
[]
[]
[]
[]
[]
[]
[]
[]
[]
[]
[]
[]
[]
[]
[]
[]
[]
[]
[]
[]
[]
[]
[]
[]
[]
[]
[]
[]
[]
[]
[]
[]
[]
[]
[]
[]
[]
[]
[]
[]
[]
[]
[]
[]
[]
[]
[]
[]
[]
[]
[]
[]
[]
[]
[]
[]
[]
[]
[]
[]
[]
[]
[]
[]
[]
[]
[]
[]
[]
[]
[]
[]
[]
[]
[]
[]
[]
[]
[]
[]
[]
[]
[]
[]
[]
[]
[]
[]
[]
[]
[]
[]
[]
[]
[]
[]
[]
[]
[]
[]
[]
[]
[]
[]
[]
[]
[]
[]
[]
[]
[]
[]
[]
[]
[]
[]
[]
[]
[]
[]
[]
[]
[]
[]
[]
[]
[]
[]
[]
[]
[]
[]
[]
[]
[]
[]
[]
[]
[]
[]
[]
[]
[]
[]
[]
[]
[]
[]
[]
[]
[]
[]
[]
[]
[]
[]
[]
[]
[]
[]
[]
[]
[]
[]
[]
[]
[]
[]
[]
[]
[]
[]
[]
[]
[]
[]
[]
[]
[]
[]
[]
[]
[]
[]
[]
[]
[]
[]
[]
[]
[]
[]
[]
[]
[]
[]
[]
[]
[]
[]
[]
[]
[]
[]
[]
[]
[]
[]
[]
[]
[]
[]
[]
[]
[]
[]
[]
[]
[]
[]
[]
[]
[]
[]
[]
[]
[]
[]
[]
[]
[]
[]
[]
[]
[]
[]
[]
[]
[]
[]
[]
[]
[]
[]
[]
[]
[]
[]
[]
[]
[]
[]
[]
[]
[]
[]
[]
[]
[]
[]
[]
[]
[]
[]
[]
[]
[]
[]
[]
[]
[]
[]
[]
[]
[]
[]
[]
[]
[]
[]
[]
[]
[]
[]
[]
[]
[]
[]
[]
[]
[]
[]
[]
[]
[]
[]
[]
[]
[]
[]
[]
[]
[]
[]
[]
[]
[]
[]
[]
[]
[]
[]
[]
[]
[]
[]
[]
[]
[]
[]
[]
[]
[]
[]
[]
[]
[]
[]
[]
[]
[]
[]
[]
[]
[]
[]
[]
[]
[]
[]
[]
[]
[]
[]
[]
[]
[]
[]
[]
[]
[]
[]
[]
[]
[]
[]
[]
[]
[]
[]
[]
[]
[]
[]
[]
[]
[]
[]
[]
[]
[]
[]
[]
[]
[]
[]
[]
[]
[]
[]
[]
[]
[]
[]
[]
[]
[]
[]
[]
[]
[]
[]
[]
[]
[]
[]
[]
[]
[]
[]
[]
[]
[]
[]
[]
[]
[]
[]
[]
[]
[]
[]
[]
[]
[]
[]
[]
[]
[]
[]
[]
[]
[]
[]
[]
[]
[]
[]
[]
[]
[]
[]
[]
[]
[]
[]
[]
[]
[]
[]
[]
[]
[]
[]
[]
[]
[]
[]
[]
[]
[]
[]
[]
[]
[]
[]
[]
[]
[]
[]
[]
[]
[]
[]
[]
[]
[]
[]
[]
[]
[]
[]
[]
[]
[]
[]
[]
[]
[]
[]
[]
[]
[]
[]
[]
[]
[]
[]
[]
[]
[]
[]
[]
[]
[]
[]
[]
[]
[]
[]
[]
[]
[]
[]
[]
[]
[]
[]
[]
[]
[]
[]
[]
[]
[]
[]
[]
[]
[]
[]
[]
[]
[]
[]
[]
[]
[]
[]
[]
[]
[]
[]
[]
[]
[]
[]
[]
[]
[]
[]
[]
[]
[]
[]
[]
[]
[]
[]
[]
[]
[]
[]
[]
[]
[]
[]
[]
[]
[]
[]
[]
[]
[]
[]
[]
[]
[]
[]
[]
[]
[]
[]
[]
[]
[]
[]
[]
[]
[]
[]
[]
[]
[]
[]
[]
[]
[]
[]
[]
[]
[]
[]
[]
[]
[]
[]
[]
[]
[]
[]
[]
[]
[]
[]
[]
[]
[]
[]
[]
[]
[]
[]
[]
[]
[]
[]
[]
[]
[]
[]
[]
[]
[]
[]
[]
[]
[]
[]
[]
[]
[]
[]
[]
[]
[]
[]
[]
[]
[]
[]
[]
[]
[]
[]
[]
[]
[]
[]
[]
[]
[]
[]
[]
[]
[]
[]
[]
[]
[]
[]
[]
[]
[]
[]
[]
[]
[]
[]
[]
[]
[]
[]
[]
[]
[]
[]
[]
[]
[]
[]
[]
[]
[]
[]
[]
[]
[]
[]
[]
[]
[]
[]
[]
[]
[]
[]
[]
[]
[]
[]
[]
[]
[]
[]
[]
[]
[]
[]
[]
[]
[]
[]
[]
[]
[]
[]
[]
[]
[]
[]
[]
[]
[]
[]
[]
[]
[]
[]
[]
[]
[]
[]
[]
[]
[]
[]
[]
[]
[]
[]
[]
[]
[]
[]
[]
[]
[]
[]
[]
[]
[]
[]
[]
[]
[]
[]
[]
[]
[]
[]
[]
[]
[]
[]
[]
[]
[]
[]
[]
[]
[]
[]
[]
[]
[]
[]
[]
[]
[]
[]
[]
[]
[]
[]
[]
[]
[]
[]
[]
[]
[]
[]
[]
[]
[]
[]
[]
[]
[]
[]
[]
[]
[]
[]
[]
[]
[]
[]
[]
[]
[]
[]
[]
[]
[]
[]
[]
[]
[]
[]
[]
[]
[]
[]
[]
[]
[]
[]
[]
[]
[]
[]
[]
[]
[]
[]
[]
[]
[]
[]
[]
[]
[]
[]
[]
[]
[]
[]
[]
[]
[]
[]
[]
[]
[]
[]
[]
[]
[]
[]
[]
[]
[]
[]
[]
[]
[]
[]
[]
[]
[]
[]
[]
[]
[]
[]
[]
[]
[]
[]
[]
[]
[]
[]
[]
[]
[]
[]
[]
[]
[]
[]
[]
[]
[]
[]
[]
[]
[]
[]
[]
[]
[]
[]
[]
[]
[]
[]
[]
[]
[]
[]
[]
[]
[]
[]
[]
[]
[]
[]
[]
[]
[]
[]
[]
[]
[]
[]
[]
[]
[]
[]
[]
[]
[]
[]
[]
[]
[]
[]
[]
[]
[]
[]
[]
[]
[]
[]
[]
[]
[]
[]
[]
[]
[]
[]
[]
[]
[]
[]
[]
[]
[]
[]
[]
[]
[]
[]
[]
[]
[]
[]
[]
[]
[]
[]
[]
[]
[]
[]
[]
[]
[]
[]
[]
[]
[]
[]
[]
[]
[]
[]
[]
[]
[]
[]
[]
[]
[]
[]
[]
[]
[]
[]
[]
[]
[]
[]
[]
[]
[]
[]
[]
[]
[]
[]
[]
[]
[]
[]
[]
[]
[]
[]
[]
[]
[]
[]
[]
[]
[]
[]
[]
[]
[]
[]
[]
[]
[]
[]
[]
[]
[]
[]
[]
[]
[]
[]
[]
[]
[]
[]
[]
[]
[]
[]
[]
[]
[]
[]
[]
[]
[]
[]
[]
[]
[]
[]
[]
[]
[]
[]
[]
[]
[]
[]
[]
[]
[]
[]
[]
[]
[]
[]
[]
[]
[]
[]
[]
[]
[]
[]
[]
[]
[]
[]
[]
[]
[]
[]
[]
[]
[]
[]
[]
[]
[]
[]
[]
[]
[]
[]
[]
[]
[]
[]
[]
[]
[]
[]
[]
[]
[]
[]
[]
[]
[]
[]
[]
[]
[]
[]
[]
[]
[]
[]
[]
[]
[]
[]
[]
[]
[]
[]
[]
[]
[]
[]
[]
[]
[]
[]
[]
[]
[]
[]
[]
[]
[]
[]
[]
[]
[]
[]
[]
[]
[]
[]
[]
[]
[]
[]
[]
[]
[]
[]
[]
[]
[]
[]
[]
[]
[]
[]
[]
[]
[]
[]
[]
[]
[]
[]
[]
[]
[]
[]
[]
[]
[]
[]
[]
[]
[]
[]
[]
[]
[]
[]
[]
[]
[]
[]
[]
[]
[]
[]
[]
[]
[]
[]
[]
[]
[]
[]
[]
[]
[]
[]
[]
[]
[]
[]
[]
[]
[]
[]
[]
[]
[]
[]
[]
[]
[]
[]
[]
[]
[]
[]
[]
[]
[]
[]
[]
[]
[]
[]
[]
[]
[]
[]
[]
[]
[]
[]
[]
[]
[]
[]
[]
[]
[]
[]
[]
[]
[]
[]
[]
[]
[]
[]
[]
[]
[]
[]
[]
[]
[]
[]
[]
[]
[]
[]
[]
[]
[]
[]
[]
[]
[]
[]
[]
[]
[]
[]
[]
[]
[]
[]
[]
[]
[]
[]
[]
[]
[]
[]
[]
[]
[]
[]
[]
[]
[]
[]
[]
[]
[]
[]
[]
[]
[]
[]
[]
[]
[]
[]
[]
[]
[]
[]
[]
[]
[]
[]
[]
[]
[]
[]
[]
[]
[]
[]
[]
[]
[]
[]
[]
[]
[]
[]
[]
[]
[]
[]
[]
[]
[]
[]
[]
[]
[]
[]
[]
[]
[]
[]
[]
[]
[]
[]
[]
[]
[]
[]
[]
[]
[]
[]
[]
[]
[]
[]
[]
[]
[]
[]
[]
[]
[]
[]
[]
[]
[]
[]
[]
[]
[]
[]
[]
[]
[]
[]
[]
[]
[]
[]
[]
[]
[]
[]
[]
[]
[]
[]
[]
[]
[]
[]
[]
[]
[]
[]
[]
[]
[]
[]
[]
[]
[]
[]
[]
[]
[]
[]
[]
[]
[]
[]
[]
[]
[]
[]
[]
[]
[]
[]
[]
[]
[]
[]
[]
[]
[]
[]
[]
[]
[]
[]
[]
[]
[]
[]
[]
[]
[]
[]
[]
[]
[]
[]
[]
[]
[]
[]
[]
[]
[]
[]
[]
[]
[]
[]
[]
[]
[]
[]
[]
[]
[]
[]
[]
[]
[]
[]
[]
[]
[]
[]
[]
[]
[]
[]
[]
[]
[]
[]
[]
[]
[]
[]
[]
[]
[]
[]
[]
[]
[]
[]
[]
[]
[]
[]
[]
[]
[]
[]
[]
[]
[]
[]
[]
[]
[]
[]
[]
[]
[]
[]
[]
[]
[]
[]
[]
[]
[]
[]
[]
[]
[]
[]
[]
[]
[]
[]
[]
[]
[]
[]
[]
[]
[]
[]
[]
[]
[]
[]
[]
[]
[]
[]
[]
[]
[]
[]
[]
[]
[]
[]
[]
[]
[]
[]
[]
[]
[]
[]
[]
[]
[]
[]
[]
[]
[]
[]
[]
[]
[]
[]
[]
[]
[]
[]
[]
[]
[]
[]
[]
[]
[]
[]
[]
[]
[]
[]
[]
[]
[]
[]
[]
[]
[]
[]
[]
[]
[]
[]
[]
[]
[]
[]
[]
[]
[]
[]
[]
[]
[]
[]
[]
[]
[]
[]
[]
[]
[]
[]
[]
[]
[]
[]
[]
[]
[]
[]
[]
[]
[]
[]
[]
[]
[]
[]
[]
[]
[]
[]
[]
[]
[]
[]
[]
[]
[]
[]
[]
[]
[]
[]
[]
[]
[]
[]
[]
[]
[]
[]
[]
[]
[]
[]
[]
[]
[]
[]
[]
[]
[]
[]
[]
[]
[]
[]
[]
[]
[]
[]
[]
[]
[]
[]
[]
[]
[]
[]
[]
[]
[]
[]
[]
[]
[]
[]
[]
[]
[]
[]
[]
[]
[]
[]
[]
[]
[]
[]
[]
[]
[]
[]
[]
[]
[]
[]
[]
[]
[]
[]
[]
[]
[]
[]
[]
[]
[]
[]
[]
[]
[]
[]
[]
[]
[]
[]
[]
[]
[]
[]
[]
[]
[]
[]
[]
[]
[]
[]
[]
[]
[]
[]
[]
[]
[]
[]
[]
[]
[]
[]
[]
[]
[]
[]
[]
[]
[]
[]
[]
[]
[]
[]
[]
[]
[]
[]
[]
[]
[]
[]
[]
[]
[]
[]
[]
[]
[]
[]
[]
[]
[]
[]
[]
[]
[]
[]
[]
[]
[]
[]
[]
[]
[]
[]
[]
[]
[]
[]
[]
[]
[]
[]
[]
[]
[]
[]
[]
[]
[]
[]
[]
[]
[]
[]
[]
[]
[]
[]
[]
[]
[]
[]
[]
[]
[]
[]
[]
[]
[]
[]
[]
[]
[]
[]
[]
[]
[]
[]
[]
[]
[]
[]
[]
[]
[]
[]
[]
[]
[]
[]
[]
[]
[]
[]
[]
[]
[]
[]
[]
[]
[]
[]
[]
[]
[]
[]
[]
[]
[]
[]
[]
[]
[]
[]
[]
[]
[]
[]
[]
[]
[]
[]
[]
[]
[]
[]
[]
[]
[]
[]
[]
[]
[]
[]
[]
[]
[]
[]
[]
[]
[]
[]
[]
[]
[]
[]
[]
[]
[]
[]
[]
[]
[]
[]
[]
[]
[]
[]
[]
[]
[]
[]
[]
[]
[]
[]
[]
[]
[]
[]
[]
[]
[]
[]
[]
[]
[]
[]
[]
[]
[]
[]
[]
[]
[]
[]
[]
[]
[]
[]
[]
[]
[]
[]
[]
[]
[]
[]
[]
[]
[]
[]
[]
[]
[]
[]
[]
[]
[]
[]
[]
[]
[]
[]
[]
[]
[]
[]
[]
[]
[]
[]
[]
[]
[]
[]
[]
[]
[]
[]
[]
[]
[]
[]
[]
[]
[]
[]
[]
[]
[]
[]
[]
[]
[]
[]
[]
[]
[]
[]
[]
[]
[]
[]
[]
[]
[]
[]
[]
[]
[]
[]
[]
[]
[]
[]
[]
[]
[]
[]
[]
[]
[]
[]
[]
[]
[]
[]
[]
[]
[]
[]
[]
[]
[]
[]
[]
[]
[]
[]
[]
[]
[]
[]
[]
[]
[]
[]
[]
[]
[]
[]
[]
[]
[]
[]
[]
[]
[]
[]
[]
[]
[]
[]
[]
[]
[]
[]
[]
[]
[]
[]
[]
[]
[]
[]
[]
[]
[]
[]
[]
[]
[]
[]
[]
[]
[]
[]
[]
[]
[]
[]
[]
[]
[]
[]
[]
[]
[]
[]
[]
[]
[]
[]
[]
[]
[]
[]
[]
[]
[]
[]
[]
[]
[]
[]
[]
[]
[]
[]
[]
[]
[]
[]
[]
[]
[]
[]
[]
[]
[]
[]
[]
[]
[]
[]
[]
[]
[]
[]
[]
[]
[]
[]
[]
[]
[]
[]
[]
[]
[]
[]
[]
[]
[]
[]
[]
[]
[]
[]
[]
[]
[]
[]
[]
[]
[]
[]
[]
[]
[]
[]
[]
[]
[]
[]
[]
[]
[]
[]
[]
[]
[]
[]
[]
[]
[]
[]
[]
[]
[]
[]
[]
[]
[]
[]
[]
[]
[]
[]
[]
[]
[]
[]
[]
[]
[]
[]
[]
[]
[]
[]
[]
[]
[]
[]
[]
[]
[]
[]
[]
[]
[]
[]
[]
[]
[]
[]
[]
[]
[]
[]
[]
[]
[]
[]
[]
[]
[]
[]
[]
[]
[]
[]
[]
[]
[]
[]
[]
[]
[]
[]
[]
[]
[]
[]
[]
[]
[]
[]
[]
[]
[]
[]
[]
[]
[]
[]
[]
[]
[]
[]
[]
[]
[]
[]
[]
[]
[]
[]
[]
[]
[]
[]
[]
[]
[]
[]
[]
[]
[]
[]
[]
[]
[]
[]
[]
[]
[]
[]
[]
[]
[]
[]
[]
[]
[]
[]
[]
[]
[]
[]
[]
[]
[]
[]
[]
[]
[]
[]
[]
[]
[]
[]
[]
[]
[]
[]
[]
[]
[]
[]
[]
[]
[]
[]
[]
[]
[]
[]
[]
[]
[]
[]
[]
[]
[]
[]
[]
[]
[]
[]
[]
[]
[]
[]
[]
[]
[]
[]
[]
[]
[]
[]
[]
[]
[]
[]
[]
[]
[]
[]
[]
[]
[]
[]
[]
[]
[]
[]
[]
[]
[]
[]
[]
[]
[]
[]
[]
[]
[]
[]
[]
[]
[]
[]
[]
[]
[]
[]
[]
[]
[]
[]
[]
[]
[]
[]
[]
[]
[]
[]
[]
[]
[]
[]
[]
[]
[]
[]
[]
[]
[]
[]
[]
[]
[]
[]
[]
[]
[]
[]
[]
[]
[]
[]
[]
[]
[]
[]
[]
[]
[]
[]
[]
[]
[]
[]
[]
[]
[]
[]
[]
[]
[]
[]
[]
[]
[]
[]
[]
[]
[]
[]
[]
[]
[]
[]
[]
[]
[]
[]
[]
[]
[]
[]
[]
[]
[]
[]
[]
[]
[]
[]
[]
[]
[]
[]
[]
[]
[]
[]
[]
[]
[]
[]
[]
[]
[]
[]
[]
[]
[]
[]
[]
[]
[]
[]
[]
[]
[]
[]
[]
[]
[]
[]
[]
[]
[]
[]
[]
[]
[]
[]
[]
[]
[]
[]
[]
[]
[]
[]
[]
[]
[]
[]
[]
[]
[]
[]
[]
[]
[]
[]
[]
[]
[]
[]
[]
[]
[]
[]
[]
[]
[]
[]
[]
[]
[]
[]
[]
[]
[]
[]
[]
[]
[]
[]
[]
[]
[]
[]
[]
[]
[]
[]
[]
[]
[]
[]
[]
[]
[]
[]
[]
[]
[]
[]
[]
[]
[]
[]
[]
[]
[]
[]
[]
[]
[]
[]
[]
[]
[]
[]
[]
[]
[]
[]
[]
[]
[]
[]
[]
[]
[]
[]
[]
[]
[]
[]
[]
[]
[]
[]
[]
[]
[]
[]
[]
[]
[]
[]
[]
[]
[]
[]
[]
[]
[]
[]
[]
[]
[]
[]
[]
[]
[]
[]
[]
[]
[]
[]
[]
[]
[]
[]
[]
[]
[]
[]
[]
[]
[]
[]
[]
[]
[]
[]
[]
[]
[]
[]
[]
[]
[]
[]
[]
[]
[]
[]
["This version of this spreadsheet only supports 9999 samples.  You will need to create another spreadsheet if you have 10,000 samples or more for this period."]

{"sheet":"Lookup Codes","index":2,"n_rows":981,"n_cols":33,"rows_kept":981,"cut":false,"hidden":false,"merged":[]}
["Sample Medium Code",null,null,"Analytical Method Code",null,null,null,null,"Sample Code",null,"Parameter Code",null,null,null,"Analytical Result Qualifier",null,"Parameter Units",null,null,null,null,"Modified Code",null,null,null,"QA Codes",null,null,"Priority Review"]
["MATRIX","Definition",null,"ANMCODE","Definition",null,"Modified Methods",null,"PVCCODE",null,"BASIS","PARLABEL","Definition",null,"PARVQ",null,"UNITS","Definition",null,"Modified Units",null,"PARAM","UNITS","Methods",null,"QA_CODE","Definition",null,"PRIORITY_REVIEW_CODE","Definition",null,"Concentration","kg/L,g/L,mg/L,ppth,ug/L,ng/L,pg/L,mg/cm2"]
["W","Water",null,"SRL524M","1,2,3-TCP in Drinking Water by GC/MS - CA DHS [SRL524M]",null,"Inductively Coupled Plasma Emission [E200.7]",null,"PR",null,null,"TC1112","1,1,1,2-Tetrachloroethane",null,"=",null,"PERCENT","%",null,"kg/L",null,"1,1,1,2-Tetrachloroethane",{"$f":"$AG$8","v":"kg/L,g/L,mg/L,ppth,ug/L,ng/L,pg/L,mg/cm2,g/day,g/year,kg/day,kg/month,kg/year,lb/day,lbs/week,lbs/month,lbs/year,mg/day,mg/kg,ug/kg,ng/g,ulbs/day,ug/day,t/day"},"GC/MS SIM Method [SIM];HISTORICAL: Volatile Organic Compounds by GC/MS [SW8260];Semivolatile Organic Compounds by GC/MS [SW8270C];Volatile Organic Compounds by GC/MS [SW8260B];Volatile Organic Compounds EPA Method 624 [E624];Data Unavailable [DU]",null,"B","Analyte present in the blank and the sample [B]",null,"N","No"]
[null,null,null,"ISOPU","1990 EML Procedures Manual, Pu-11, HASL-300 [ISOPU]",null,"Data Unavailable [DU]",null,null,null,null,"TCA111","1,1,1-Trichloroethane",null,"<",null,"PEREFF","% effect",null,"g/L",null,"1,1,1-Trichloroethane","kg/L,g/L,mg/L,ppth,ug/L,ng/L,pg/L,mg/cm2,g/day,g/year,kg/day,kg/month,kg/year,lb/day,lbs/week,lbs/month,lbs/year,mg/day,mg/kg,ug/kg,ng/g,ulbs/day,ug/day,t/day","Extractable Priority Pollutants [E625];Extractable Priority Pollutants by GC/MS SIM [E625SIM];GC/MS SIM Method [SIM];HISTORICAL: Volatile Organic Compounds by GC/MS [SW8260];Organochlorine Pesticides and PCBs [E608];Semivolatile Organic Compounds by GC/MS [SW8270C];VOCs by GC/MS Fuel Additives Plus BTEX [8260FAB];Volatile Organic Compounds by GC/MS - Open Scan [8260BOS];Volatile Organic Compounds by GC/MS [SW8260B];Volatile Organic Compounds by GC/MS SIM [8260SIM];Volatile Organic Compounds by Purge and Trap [E524.2];Volatile Organic Compounds EPA Method 624 [E624];Purgeables by GC/MS [E624.1];Data Unavailable [DU]",null,"D","Analytes analyzed at a secondary dilution [D]",null,"Y","Yes",null,"Loading","g/day,g/year,kg/day,kg/month,kg/year,lb/day,lbs/week,lbs/month,lbs/year,mg/day"]
[null,null,null,"ISOU","34th ORNL-DOE Conf.: Measure of Isotopic Uranium [ISOU]",null,null,null,null,null,null,"PCA","1,1,2,2-Tetrachloroethane",null,"<=",null,"%V/V","% effluent",null,"mg/L",null,"1,1,2,2-Tetrachloroethane","kg/L,g/L,mg/L,ppth,ug/L,ng/L,pg/L,mg/cm2,g/day,g/year,kg/day,kg/month,kg/year,lb/day,lbs/week,lbs/month,lbs/year,mg/day,mg/kg,ug/kg,ng/g,ulbs/day,ug/day,t/day","Extractable Priority Pollutants [E625];Extractable Priority Pollutants by GC/MS SIM [E625SIM];GC/MS SIM Method [SIM];HISTORICAL: Volatile Organic Compounds by GC/MS [SW8260];Organochlorine Pesticides and PCBs [E608];Organochlorine Pesticides by Gas Chromatography [SW8081A];Semivolatile Organic Compounds by GC/MS [SW8270C];VOCs by GC/MS Fuel Additives Plus BTEX [8260FAB];Volatile Organic Compounds by GC/MS - Open Scan [8260BOS];Volatile Organic Compounds by GC/MS [SW8260B];Volatile Organic Compounds by GC/MS SIM [8260SIM];Volatile Organic Compounds by Purge and Trap [E524.2];Volatile Organic Compounds EPA Method 624 [E624];Purgeables by GC/MS [E624.1];Data Unavailable [DU]",null,"U","Compound was analyzed for, but was not detected [U]"]
[null,null,null,"A01RCMA","A-01-R - Isotopic Curium and Americium (Alpha Spectrometry -EML HASL-300)",null,null,null,null,null,null,"FC113","1,1,2-Trichloro-1,2,2-Trifluoroethane",null,">",null,"PERPASS","% survival",null,"ppth",null,"1,1,2-Trichloro-1,2,2-Trifluoroethane","kg/L,g/L,mg/L,ppth,ug/L,ng/L,pg/L,mg/cm2,g/day,g/year,kg/day,kg/month,kg/year,lb/day,lbs/week,lbs/month,lbs/year,mg/day,mg/kg,ug/kg,ng/g,ulbs/day,ug/day,t/day","Semivolatile Organic Compounds by GC/MS [SW8270C];Volatile Organic Compounds by GC/MS [SW8260B];Volatile Organic Compounds by Purge and Trap [E524.2];Volatile Organic Compounds EPA Method 624 [E624];Data Unavailable [DU]",null,"R","Data rejected [R]",null,null,null,null,"Mass","mg/kg,ug/kg,ng/g,ulbs/day,ug/day,t/day"]
[null,null,null,"A01RPUN","A-01-R - Isotopic Plutonium and Neptunium (Alpha Spectrometry - EML HASL-300)",null,null,null,null,null,null,"TCA112","1,1,2-Trichloroethane",null,">=",null,"ACRES","Acre",null,"ug/L",null,"1,1,2-Trichloroethane","kg/L,g/L,mg/L,ppth,ug/L,ng/L,pg/L,mg/cm2,g/day,g/year,kg/day,kg/month,kg/year,lb/day,lbs/week,lbs/month,lbs/year,mg/day,mg/kg,ug/kg,ng/g,ulbs/day,ug/day,t/day","Extractable Priority Pollutants [E625];Extractable Priority Pollutants by GC/MS SIM [E625SIM];GC/MS SIM Method [SIM];HISTORICAL: Volatile Organic Compounds by GC/MS [SW8260];Organochlorine Pesticides and PCBs [E608];Organochlorine Pesticides by Gas Chromatography [SW8081A];Semivolatile Organic Compounds by GC/MS [SW8270C];VOCs by GC/MS Fuel Additives Plus BTEX [8260FAB];Volatile Organic Compounds by GC/MS - Open Scan [8260BOS];Volatile Organic Compounds by GC/MS [SW8260B];Volatile Organic Compounds by GC/MS SIM [8260SIM];Volatile Organic Compounds by Purge and Trap [E524.2];Volatile Organic Compounds EPA Method 624 [E624];Purgeables by GC/MS [E624.1];Data Unavailable [DU]",null,"FO","Estimated maximum possible concentration (EMPC) [FO]"]
[null,null,null,"A01RPO","A-01-R - Isotopic Polonium (Alpha Spectrometry - EML HASL-300)",null,null,null,null,null,null,"DCA11","1,1-Dichloroethane",null,"ND",null,"ACRE FT","Acre-feet",null,"ng/L",null,"1,1-Dichloroethane","kg/L,g/L,mg/L,ppth,ug/L,ng/L,pg/L,mg/cm2,g/day,g/year,kg/day,kg/month,kg/year,lb/day,lbs/week,lbs/month,lbs/year,mg/day,mg/kg,ug/kg,ng/g,ulbs/day,ug/day,t/day","Extractable Priority Pollutants [E625];Extractable Priority Pollutants by GC/MS SIM [E625SIM];GC/MS SIM Method [SIM];HISTORICAL: Volatile Organic Compounds by GC/MS [SW8260];Semivolatile Organic Compounds by GC/MS [SW8270C];VOCs by GC/MS Fuel Additives Plus BTEX [8260FAB];Volatile Organic Compounds by GC/MS - Open Scan [8260BOS];Volatile Organic Compounds by GC/MS [SW8260B];Volatile Organic Compounds by Purge and Trap [E524.2];Volatile Organic Compounds EPA Method 624 [E624];Purgeables by GC/MS [E624.1];Data Unavailable [DU]",null,"J","Estimated value [J]",null,null,null,null,"All",{"$f":"CONCATENATE(AG2,\",\",AG4,\",\",AG6)","v":"kg/L,g/L,mg/L,ppth,ug/L,ng/L,pg/L,mg/cm2,g/day,g/year,kg/day,kg/month,kg/year,lb/day,lbs/week,lbs/month,lbs/year,mg/day,mg/kg,ug/kg,ng/g,ulbs/day,ug/day,t/day"}]
[null,null,null,"SW9030A","Acid Soluble and Acid Insoluble Sulfides [SW9030A]",null,null,null,null,null,null,"DCE11","1,1-Dichloroethylene",null,"DNQ",null,"ADMI COLOR","ADMI Color Unit",null,"pg/L",null,"1,1-Dichloroethylene","kg/L,g/L,mg/L,ppth,ug/L,ng/L,pg/L,mg/cm2,g/day,g/year,kg/day,kg/month,kg/year,lb/day,lbs/week,lbs/month,lbs/year,mg/day,mg/kg,ug/kg,ng/g,ulbs/day,ug/day,t/day","Extractable Priority Pollutants [E625];Extractable Priority Pollutants by GC/MS SIM [E625SIM];GC/MS SIM Method [SIM];HISTORICAL: Volatile Organic Compounds by GC/MS [SW8260];Organochlorine Pesticides and PCBs [E608];Organochlorine Pesticides by Gas Chromatography [SW8081A];Semivolatile Organic Compounds by GC/MS [SW8270C];Tetra-through Octa-Chlorinated Dioxins and Furans by HRGC/HRMS [E1613B];VOCs by GC/MS Fuel Additives Plus BTEX [8260FAB];Volatile Organic Compounds by GC/MS - Open Scan [8260BOS];Volatile Organic Compounds by GC/MS [SW8260B];Volatile Organic Compounds by GC/MS SIM [8260SIM];Volatile Organic Compounds by Purge and Trap [E524.2];Volatile Organic Compounds EPA Method 624 [E624];Purgeables by GC/MS [E624.1];Data Unavailable [DU]",null,"BS","Insufficient sample available to follow standard QC procedures [BS]"]
["Sample Type",null,null,"SACIDSL","Acid Soluble Sulfide (EPA Draft 1991) [SACIDSL]",null,null,null,null,null,null,"DCP11","1,1-Dichloropropene",null,null,null,"BANKS","banks",null,"mg/cm2",null,"1,1-Dichloropropene","kg/L,g/L,mg/L,ppth,ug/L,ng/L,pg/L,mg/cm2,g/day,g/year,kg/day,kg/month,kg/year,lb/day,lbs/week,lbs/month,lbs/year,mg/day,mg/kg,ug/kg,ng/g,ulbs/day,ug/day,t/day","GC/MS SIM Method [SIM];HISTORICAL: Volatile Organic Compounds by GC/MS [SW8260];Semivolatile Organic Compounds by GC/MS [SW8270C];Volatile Organic Compounds by GC/MS [SW8260B];Volatile Organic Compounds EPA Method 624 [E624];Data Unavailable [DU]",null,"GB","Matrix spike recovery not within control limits [GB]"]
["10 Sample 90th Percentile",null,null,"E305.1","Acidity, Total [E305.1]",null,null,null,null,null,null,"DMH11","1,1-Dimethylhydrazine",null,null,null,"CFS","cfs",null,"g/day",null,"1,1-Dimethylhydrazine","kg/L,g/L,mg/L,ppth,ug/L,ng/L,pg/L,mg/cm2,g/day,g/year,kg/day,kg/month,kg/year,lb/day,lbs/week,lbs/month,lbs/year,mg/day,mg/kg,ug/kg,ng/g,ulbs/day,ug/day,t/day","Extractable Priority Pollutants [E625];Extractable Priority Pollutants by GC/MS SIM [E625SIM];GC/MS SIM Method [SIM];Halogenated Volatile Organics by Headspace [3810HVO];HISTORICAL: Semivolatile Organic Compounds by GC/MS [SW8270];HISTORICAL: Semivolatile Organic Compounds by GC/MS [SW8270A];Organochlorine Pesticides and PCBs [E608];Organochlorine Pesticides by Gas Chromatography [SW8081A];Semivolatile Organic Compounds by GC/MS - Open Scan [8270COS];Semivolatile Organic Compounds by GC/MS [SW8270C];Semivolatile Organic Compounds by Isotope Dilution GCMS [E1625C];Semivolatile Organic Compounds by SPE & GC/MS [E526];Volatile Organic Compounds by GC/MS [SW8260B];Volatile Organic Compounds by GC/MS SIM [8260SIM];Volatile Organic Compounds EPA Method 624 [E624];Data Unavailable [DU]",null,"IM","Method does not include this analyte as part of compound list [IM]"]
["10% for 30 days",null,null,"E305.2","Acidity, Total [E305.2]",null,null,null,null,null,null,"OCDF","1,2,3,4,6,7,8,9-Octachlorodibenzofuran",null,null,null,"CFU/100ML","CFU/100 mL",null,"g/year",null,"1,2,3,4,6,7,8,9-Octachlorodibenzofuran","ng/L,pg/L,ug/L, pg/g,lb/day,ulbs/day","HIST:Polychlorinated Dibenzodioxins/Polychlorinated Dibenzofurans [SW8280];Polychlorinated Dibenzodioxins/Polychlorinated Dibenzofurans [SW8280A];Polychlorinated Dibenzodioxins/Polychlorinated Dibenzofurans [SW8290];Tetra thru Octa-Chlorinated Dioxins and Furans by Isotope Dilutin [E1613A];Tetra-through Octa-Chlorinated Dioxins and Furans by HRGC/HRMS [E1613B];Volatile Organic Compounds by GC/MS [SW8260B];Data Unavailable [DU]",null,"LN","MS and/or MSD below acceptance limits. See Blank Spike(LCS)."]
["10% for 6 months",null,null,"SW9030B","Acid-Soluble and Acid-Insoluble Sulfides: Distillation [SW9030B]",null,null,null,null,null,null,"OCDD","1,2,3,4,6,7,8,9-Octachlorodibenzo-p-dioxin",null,null,null,"CNT","count",null,"kg/day",null,"1,2,3,4,6,7,8,9-Octachlorodibenzo-p-dioxin","ng/L,pg/L,ug/L, pg/g,lb/day,ulbs/day","HIST:Polychlorinated Dibenzodioxins/Polychlorinated Dibenzofurans [SW8280];Polychlorinated Dibenzodioxins/Polychlorinated Dibenzofurans [SW8280A];Polychlorinated Dibenzodioxins/Polychlorinated Dibenzofurans [SW8290];Tetra thru Octa-Chlorinated Dioxins and Furans by Isotope Dilutin [E1613A];Tetra-through Octa-Chlorinated Dioxins and Furans by HRGC/HRMS [E1613B];Volatile Organic Compounds by GC/MS [SW8260B];Data Unavailable [DU]",null,"LO","MS and/or MSD result unavailable. Batch accept. based on LCS rec."]
["10% for 60-Days",null,null,"E821012","Acute Toxicity of Effluents/Receiving Water to Fresh Water and Marine Organisms (EPA-821-R-02-012) [E821012]",null,null,null,null,null,null,"HPCDF1234678","1,2,3,4,6,7,8-Heptachlorodibenzofuran",null,null,null,"COUNT/L","Counts/L",null,"kg/month",null,"1,2,3,4,6,7,8-Heptachlorodibenzofuran","ng/L,pg/L,ug/L, pg/g,lb/day,ulbs/day","HIST:Polychlorinated Dibenzodioxins/Polychlorinated Dibenzofurans [SW8280];Polychlorinated Dibenzodioxins/Polychlorinated Dibenzofurans [SW8280A];Polychlorinated Dibenzodioxins/Polychlorinated Dibenzofurans [SW8290];Tetra thru Octa-Chlorinated Dioxins and Furans by Isotope Dilutin [E1613A];Tetra-through Octa-Chlorinated Dioxins and Furans by HRGC/HRMS [E1613B];Volatile Organic Compounds by GC/MS [SW8260B];Data Unavailable [DU]",null,"HR","Post digestion spike [HR]"]
["11 Sample 90th Percentile",null,null,"E2019","Acute Toxicity Test with Effluents and Receiving Waters [E2019]",null,null,null,null,null,null,"HPCDD1234678","1,2,3,4,6,7,8-Heptachlorodibenzo-p-dioxin",null,null,null,"DEG","Degrees",null,"kg/year",null,"1,2,3,4,6,7,8-Heptachlorodibenzo-p-dioxin","ng/L,pg/L,ug/L, pg/g,lb/day,ulbs/day","HIST:Polychlorinated Dibenzodioxins/Polychlorinated Dibenzofurans [SW8280];Polychlorinated Dibenzodioxins/Polychlorinated Dibenzofurans [SW8280A];Polychlorinated Dibenzodioxins/Polychlorinated Dibenzofurans [SW8290];Tetra thru Octa-Chlorinated Dioxins and Furans by Isotope Dilutin [E1613A];Tetra-through Octa-Chlorinated Dioxins and Furans by HRGC/HRMS [E1613B];Volatile Organic Compounds by GC/MS [SW8260B];Data Unavailable [DU]",null,"IL","RPD exceeds laboratory control limit [IL]"]
["11-Day Median",null,null,"E310.1","Alkalinity, Total (as Carbonate) [E310.1]",null,null,null,null,null,null,"HPCDF1234789","1,2,3,4,7,8,9-Heptachlorodibenzofuran",null,null,null,"DEG C","Degrees C",null,"lb/day",null,"1,2,3,4,7,8,9-Heptachlorodibenzofuran","ng/L,pg/L,ug/L, pg/g,lb/day,ulbs/day","HIST:Polychlorinated Dibenzodioxins/Polychlorinated Dibenzofurans [SW8280];Polychlorinated Dibenzodioxins/Polychlorinated Dibenzofurans [SW8280A];Polychlorinated Dibenzodioxins/Polychlorinated Dibenzofurans [SW8290];Tetra thru Octa-Chlorinated Dioxins and Furans by Isotope Dilutin [E1613A];Tetra-through Octa-Chlorinated Dioxins and Furans by HRGC/HRMS [E1613B];Volatile Organic Compounds by GC/MS [SW8260B];Data Unavailable [DU]",null,"BB","Sample > 4x spike concentration [BB]"]
["11-Sample Median",null,null,"E310.2","Alkalinity, Total (as Carbonate) [E310.2]",null,null,null,null,null,null,"HXCDF123478","1,2,3,4,7,8-Hexachlorodibenzofuran",null,null,null,"DEG F","Degrees F",null,"lbs/week",null,"1,2,3,4,7,8-Hexachlorodibenzofuran","ng/L,pg/L,ug/L, pg/g,lb/day,ulbs/day","HIST:Polychlorinated Dibenzodioxins/Polychlorinated Dibenzofurans [SW8280];Polychlorinated Dibenzodioxins/Polychlorinated Dibenzofurans [SW8280A];Polychlorinated Dibenzodioxins/Polychlorinated Dibenzofurans [SW8290];Tetra thru Octa-Chlorinated Dioxins and Furans by Isotope Dilutin [E1613A];Tetra-through Octa-Chlorinated Dioxins and Furans by HRGC/HRMS [E1613B];Volatile Organic Compounds by GC/MS [SW8260B];Data Unavailable [DU]",null,"BU","Sample analyzed after holding time expired [BU]"]
["12-Month Average",null,null,"SW9315","Alpha-Emitting Radium Isotopes [SW9315]",null,null,null,null,null,null,"HXCDD123478","1,2,3,4,7,8-Hexachlorodibenzo-p-dioxin",null,null,null,"FT","Feet",null,"lbs/month",null,"1,2,3,4,7,8-Hexachlorodibenzo-p-dioxin","ng/L,pg/L,ug/L, pg/g,lb/day,ulbs/day","HIST:Polychlorinated Dibenzodioxins/Polychlorinated Dibenzofurans [SW8280];Polychlorinated Dibenzodioxins/Polychlorinated Dibenzofurans [SW8280A];Polychlorinated Dibenzodioxins/Polychlorinated Dibenzofurans [SW8290];Tetra thru Octa-Chlorinated Dioxins and Furans by Isotope Dilutin [E1613A];Tetra-through Octa-Chlorinated Dioxins and Furans by HRGC/HRMS [E1613B];Volatile Organic Compounds by GC/MS [SW8260B];Data Unavailable [DU]",null,"BU,U","Sample analyzed after holding time expired; Compound was analyzed for, but was not detected [BU,U]"]
["1-Hour Average (Mean)",null,null,"E903.0","Alpha-Emitting Radium Isotopes in Drinking Water [E903.0]",null,null,null,null,null,null,"HXCDF123678","1,2,3,6,7,8-Hexachlorodibenzofuran",null,null,null,"FIBERS/L","Fibers/L",null,"lbs/year",null,"1,2,3,6,7,8-Hexachlorodibenzofuran","ng/L,pg/L,ug/L, pg/g,lb/day,ulbs/day","HIST:Polychlorinated Dibenzodioxins/Polychlorinated Dibenzofurans [SW8280];Polychlorinated Dibenzodioxins/Polychlorinated Dibenzofurans [SW8280A];Polychlorinated Dibenzodioxins/Polychlorinated Dibenzofurans [SW8290];Tetra thru Octa-Chlorinated Dioxins and Furans by Isotope Dilutin [E1613A];Tetra-through Octa-Chlorinated Dioxins and Furans by HRGC/HRMS [E1613B];Volatile Organic Compounds by GC/MS [SW8260B];Data Unavailable [DU]",null,"GN","Surrogate recovery is outside of control limits [GN]"]
["20% for 30 days",null,null,"E202.1","Aluminum (AA, Direct Aspiration) [E202.1]",null,null,null,null,null,null,"HXCDD123678","1,2,3,6,7,8-Hexachlorodibenzo-p-dioxin",null,null,null,"FT/FT","ft/ft",null,"mg/day",null,"1,2,3,6,7,8-Hexachlorodibenzo-p-dioxin","ng/L,pg/L,ug/L, pg/g,lb/day,ulbs/day","HIST:Polychlorinated Dibenzodioxins/Polychlorinated Dibenzofurans [SW8280];Polychlorinated Dibenzodioxins/Polychlorinated Dibenzofurans [SW8280A];Polychlorinated Dibenzodioxins/Polychlorinated Dibenzofurans [SW8290];Tetra thru Octa-Chlorinated Dioxins and Furans by Isotope Dilutin [E1613A];Tetra-through Octa-Chlorinated Dioxins and Furans by HRGC/HRMS [E1613B];Volatile Organic Compounds by GC/MS [SW8260B];Data Unavailable [DU]",null,"EB","Value is estimated [EB]"]
["20% of 20 consecutive samples",null,null,"SW7020","Aluminum (AA, Direct Aspiration) [SW7020]",null,null,null,null,null,null,"HXCDF123789","1,2,3,7,8,9-Hexachlorodibenzofuran",null,null,null,"G/DAY","g/day",null,"mg/kg",null,"1,2,3,7,8,9-Hexachlorodibenzofuran","ng/L,pg/L,ug/L, pg/g,lb/day,ulbs/day","HIST:Polychlorinated Dibenzodioxins/Polychlorinated Dibenzofurans [SW8280];Polychlorinated Dibenzodioxins/Polychlorinated Dibenzofurans [SW8280A];Polychlorinated Dibenzodioxins/Polychlorinated Dibenzofurans [SW8290];Tetra thru Octa-Chlorinated Dioxins and Furans by Isotope Dilutin [E1613A];Tetra-through Octa-Chlorinated Dioxins and Furans by HRGC/HRMS [E1613B];Volatile Organic Compounds by GC/MS [SW8260B];Data Unavailable [DU]"]
["24-hour Average",null,null,"E202.2","Aluminum (AA, Furnace Technique) [E202.2]",null,null,null,null,null,null,"HXCDD123789","1,2,3,7,8,9-Hexachlorodibenzo-p-dioxin",null,null,null,"G/L","g/L",null,"ug/kg",null,"1,2,3,7,8,9-Hexachlorodibenzo-p-dioxin","ng/L,pg/L,ug/L, pg/g,lb/day,ulbs/day","HIST:Polychlorinated Dibenzodioxins/Polychlorinated Dibenzofurans [SW8280];Polychlorinated Dibenzodioxins/Polychlorinated Dibenzofurans [SW8280A];Polychlorinated Dibenzodioxins/Polychlorinated Dibenzofurans [SW8290];Tetra thru Octa-Chlorinated Dioxins and Furans by Isotope Dilutin [E1613A];Tetra-through Octa-Chlorinated Dioxins and Furans by HRGC/HRMS [E1613B];Volatile Organic Compounds by GC/MS [SW8260B];Data Unavailable [DU]"]
["30-Day 90th%",null,null,"CSGAS","Analytical Determination of CS Gas [CSGAS]",null,null,null,null,null,null,"PECDF12378","1,2,3,7,8-Pentachlorodibenzofuran",null,null,null,"G/YR","g/year",null,"ng/g",null,"1,2,3,7,8-Pentachlorodibenzofuran","ng/L,pg/L,ug/L, pg/g,lb/day,ulbs/day","HIST:Polychlorinated Dibenzodioxins/Polychlorinated Dibenzofurans [SW8280];Polychlorinated Dibenzodioxins/Polychlorinated Dibenzofurans [SW8280A];Polychlorinated Dibenzodioxins/Polychlorinated Dibenzofurans [SW8290];Tetra thru Octa-Chlorinated Dioxins and Furans by Isotope Dilutin [E1613A];Tetra-through Octa-Chlorinated Dioxins and Furans by HRGC/HRMS [E1613B];Volatile Organic Compounds by GC/MS [SW8260B];Data Unavailable [DU]"]
["30-Day Average",null,null,"E204.1","Antimony (AA, Direct Aspiration) [E204.1]",null,null,null,null,null,null,"PECDD12378","1,2,3,7,8-Pentachlorodibenzo-p-dioxin",null,null,null,"GPM/LAMP","gal/min per lamp",null,"ulbs/day",null,"1,2,3,7,8-Pentachlorodibenzo-p-dioxin","ng/L,pg/L,ug/L, pg/g,lb/day,ulbs/day","HIST:Polychlorinated Dibenzodioxins/Polychlorinated Dibenzofurans [SW8280];Polychlorinated Dibenzodioxins/Polychlorinated Dibenzofurans [SW8280A];Polychlorinated Dibenzodioxins/Polychlorinated Dibenzofurans [SW8290];Tetra thru Octa-Chlorinated Dioxins and Furans by Isotope Dilutin [E1613A];Tetra-through Octa-Chlorinated Dioxins and Furans by HRGC/HRMS [E1613B];Volatile Organic Compounds by GC/MS [SW8260B];Data Unavailable [DU]"]
["30-Day Average of Daily Averages",null,null,"SW7040","Antimony (AA, Direct Aspiration) [SW7040]",null,null,null,null,null,null,"TCB123","1,2,3-Trichlorobenzene",null,null,null,"GAL","gallons",null,"ug/day",null,"1,2,3-Trichlorobenzene",{"$f":"$AG$8","v":"kg/L,g/L,mg/L,ppth,ug/L,ng/L,pg/L,mg/cm2,g/day,g/year,kg/day,kg/month,kg/year,lb/day,lbs/week,lbs/month,lbs/year,mg/day,mg/kg,ug/kg,ng/g,ulbs/day,ug/day,t/day"},"GC/MS SIM Method [SIM];HISTORICAL: Volatile Organic Compounds by GC/MS [SW8260];Semivolatile Organic Compounds by GC/MS [SW8270C];Volatile Organic Compounds by GC/MS [SW8260B];Data Unavailable [DU]"]
["30-Day Average of Daily Maximums",null,null,"CL204.2","Antimony (AA, Furnace Technique) - modified for CLP [CL204.2]",null,null,null,null,null,null,"TCPR123","1,2,3-Trichloropropane",null,null,null,"GAL/HR","gallons/hour",null,"t/day",null,"1,2,3-Trichloropropane","kg/L,g/L,mg/L,ppth,ug/L,ng/L,pg/L,mg/cm2,g/day,g/year,kg/day,kg/month,kg/year,lb/day,lbs/week,lbs/month,lbs/year,mg/day,mg/kg,ug/kg,ng/g,ulbs/day,ug/day,t/day","EDB, DBCP & 123TCP In Water by Microextraction & Gas Chromo. [E504.1];GC/MS SIM Method [SIM];HISTORICAL: Volatile Organic Compounds by GC/MS [SW8260];Semivolatile Organic Compounds by GC/MS [SW8270C];Volatile Organic Compounds by GC/MS [SW8260B];Volatile Organic Compounds by Purge and Trap [E524.2];Volatile Organic Compounds EPA Method 624 [E624];Data Unavailable [DU]"]
["30-Day Geometric Mean",null,null,"E204.2","Antimony (AA, Furnace Technique) [E204.2]",null,null,null,null,null,null,"TCB124","1,2,4-Trichlorobenzene",null,null,null,"GAL/MIN","gallons/minute",null,null,null,"1,2,4-Trichlorobenzene","kg/L,g/L,mg/L,ppth,ug/L,ng/L,pg/L,mg/cm2,g/day,g/year,kg/day,kg/month,kg/year,lb/day,lbs/week,lbs/month,lbs/year,mg/day,mg/kg,ug/kg,ng/g,ulbs/day,ug/day,t/day","Extractable Priority Pollutants [E625];Extractable Priority Pollutants by GC/MS SIM [E625SIM];GC/MS SIM Method [SIM];HISTORICAL: Semivolatile Organic Compounds by GC/MS [SW8270];HISTORICAL: Semivolatile Organic Compounds by GC/MS [SW8270A];HISTORICAL: Volatile Organic Compounds by GC/MS [SW8260];Semivolatile Organic Compounds by GC/MS - Open Scan [8270COS];Semivolatile Organic Compounds by GC/MS [SW8270C];Semivolatile Organic Compounds by Isotope Dilution GCMS [E1625C];Volatile Organic Compounds by GC/MS [SW8260B];Volatile Organic Compounds by GC/MS SIM [8260SIM];Volatile Organic Compounds by Purge and Trap [E524.2];Volatile Organic Compounds EPA Method 624 [E624];Purgeables by GC/MS [E624.1];Base/Neutrals and Acids by GC/MS [E625.1];Data Unavailable [DU]"]
["30-Day Median",null,null,"SW7041","Antimony (AA, Furnace Technique) [SW7041]",null,null,null,null,null,null,"TMB124","1,2,4-Trimethylbenzene",null,null,null,"GAL/MON","gallons/month",null,null,null,"1,2,4-Trimethylbenzene","kg/L,g/L,mg/L,ppth,ug/L,ng/L,pg/L,mg/cm2,g/day,g/year,kg/day,kg/month,kg/year,lb/day,lbs/week,lbs/month,lbs/year,mg/day,mg/kg,ug/kg,ng/g,ulbs/day,ug/day,t/day","GC/MS SIM Method [SIM];HISTORICAL: Volatile Organic Compounds by GC/MS [SW8260];Semivolatile Organic Compounds by GC/MS [SW8270C];Volatile Organic Compounds by GC/MS [SW8260B];Data Unavailable [DU]"]
["3-Month Median",null,null,"SW7062","Antimony and Arsenic (AA, Borohydride Reduction) [SW7062]",null,null,null,null,null,null,"DBCP","1,2-Dibromo-3-Chloropropane",null,null,null,"GAL/WK","gallons/week",null,null,null,"1,2-Dibromo-3-Chloropropane","kg/L,g/L,mg/L,ppth,ug/L,ng/L,pg/L,mg/cm2,g/day,g/year,kg/day,kg/month,kg/year,lb/day,lbs/week,lbs/month,lbs/year,mg/day,mg/kg,ug/kg,ng/g,ulbs/day,ug/day,t/day","Chlorinated and Halogenated Compounds by L-L Extraction, GC/ECD [E551.1];EDB and DBCP In Water by Microextraction and Gas Chromatography [E504];EDB, DBCP & 123TCP In Water by Microextraction & Gas Chromo. [E504.1];GC/MS SIM Method [SIM];HISTORICAL: Volatile Organic Compounds by GC/MS [SW8260];Semivolatile Organic Compounds by GC/MS [SW8270C];Volatile Organic Compounds by GC/MS [SW8260B];Volatile Organic Compounds EPA Method 624 [E624];Data Unavailable [DU]"]
["3-Sample Average (Mean)",null,null,"APIRP40","API Method RP40 for Core Analysis - Porosity Determination [APIRP40]",null,null,null,null,null,null,"EDB","1,2-Dibromoethane",null,null,null,"GPD","GPD",null,null,null,"1,2-Dibromoethane","kg/L,g/L,mg/L,ppth,ug/L,ng/L,pg/L,mg/cm2,g/day,g/year,kg/day,kg/month,kg/year,lb/day,lbs/week,lbs/month,lbs/year,mg/day,mg/kg,ug/kg,ng/g,ulbs/day,ug/day,t/day","Chlorinated and Halogenated Compounds by L-L Extraction, GC/ECD [E551.1];EDB and DBCP In Water by Microextraction and Gas Chromatography [E504];EDB, DBCP & 123TCP In Water by Microextraction & Gas Chromo. [E504.1];GC/MS SIM Method [SIM];HISTORICAL: Volatile Organic Compounds by GC/MS [SW8260];Semivolatile Organic Compounds by GC/MS [SW8270C];Volatile Organic Compounds by GC/MS [SW8260B];Volatile Organic Compounds EPA Method 624 [E624];Purgeables by GC/MS [E624.1];Data Unavailable [DU]"]
["3-Sample Maximum",null,null,"N1501","Aromatic Hydrocarbons in Air [N1501]",null,null,null,null,null,null,"DCBZ12","1,2-Dichlorobenzene",null,null,null,"GPM/FT2","gpm/sqft",null,null,null,"1,2-Dichlorobenzene","kg/L,g/L,mg/L,ppth,ug/L,ng/L,pg/L,mg/cm2,g/day,g/year,kg/day,kg/month,kg/year,lb/day,lbs/week,lbs/month,lbs/year,mg/day,mg/kg,ug/kg,ng/g,ulbs/day,ug/day,t/day","Extractable Priority Pollutants [E625];Base/Neutrals and Acids by GC/MS [E625.1];Extractable Priority Pollutants by GC/MS SIM [E625SIM];GC/MS SIM Method [SIM];HISTORICAL: Semivolatile Organic Compounds by GC/MS [SW8270];HISTORICAL: Semivolatile Organic Compounds by GC/MS [SW8270A];HISTORICAL: Volatile Organic Compounds by GC/MS [SW8260];Semivolatile Organic Compounds by GC/MS [SW8270C];VOCs by GC/MS Fuel Additives Plus BTEX [8260FAB];Volatile Organic Compounds by GC/MS [SW8260B];Volatile Organic Compounds by GC/MS SIM [8260SIM];Volatile Organic Compounds by Purge and Trap [E524.2];Volatile Organic Compounds EPA Method 624 [E624];Purgeables by GC/MS [E624.1];Data Unavailable [DU]"]
["3-Sample Median",null,null,"SW8020A","Aromatic Volatile Organics by Gas Chromatography [SW8020A]",null,null,null,null,null,null,"DCA12","1,2-Dichloroethane",null,null,null,"IN","inches",null,null,null,"1,2-Dichloroethane","kg/L,g/L,mg/L,ppth,ug/L,ng/L,pg/L,mg/cm2,g/day,g/year,kg/day,kg/month,kg/year,lb/day,lbs/week,lbs/month,lbs/year,mg/day,mg/kg,ug/kg,ng/g,ulbs/day,ug/day,t/day","Extractable Priority Pollutants [E625];Extractable Priority Pollutants by GC/MS SIM [E625SIM];GC/MS SIM Method [SIM];HISTORICAL: Semivolatile Organic Compounds by GC/MS [SW8270];HISTORICAL: Volatile Organic Compounds by GC/MS [SW8260];Organochlorine Pesticides and PCBs [E608];Organochlorine Pesticides by Gas Chromatography [SW8081A];Semivolatile Organic Compounds by GC/MS [SW8270C];VOCs by GC/MS Fuel Additives Plus BTEX [8260FAB];Volatile Organic Compounds by GC/MS - Open Scan [8260BOS];Volatile Organic Compounds by GC/MS [SW8260B];Volatile Organic Compounds by GC/MS SIM [8260SIM];Volatile Organic Compounds by Purge and Trap [E524.2];Volatile Organic Compounds EPA Method 624 [E624];Purgeables by GC/MS [E624.1];Data Unavailable [DU]"]
["4-Day Average (Mean)",null,null,"SW7060A","Arsenic (AA, Furnace Technique) [SW7060A]",null,null,null,null,null,null,"DCA12D4","1,2-Dichloroethane-d4",null,null,null,"JTU","JTU",null,null,null,"1,2-Dichloroethane-d4","kg/L,g/L,mg/L,ppth,ug/L,ng/L,pg/L,mg/cm2,g/day,g/year,kg/day,kg/month,kg/year,lb/day,lbs/week,lbs/month,lbs/year,mg/day,mg/kg,ug/kg,ng/g,ulbs/day,ug/day,t/day","Volatile Organic Compounds by GC/MS [SW8260B];Volatile Organic Compounds EPA Method 624 [E624];Purgeables by GC/MS [E624.1];Data Unavailable [DU]"]
["4-Day Average of Daily Averages",null,null,"CL206.2","Arsenic (AA, Furnace) - modified for CLP [CL206.2]",null,null,null,null,null,null,"DCE12TOT","1,2-Dichloroethylenes, Sum",null,null,null,"KG/DAY","kg/day",null,null,null,"1,2-Dichloroethylenes, Sum","kg/L,g/L,mg/L,ppth,ug/L,ng/L,pg/L,mg/cm2,g/day,g/year,kg/day,kg/month,kg/year,lb/day,lbs/week,lbs/month,lbs/year,mg/day,mg/kg,ug/kg,ng/g,ulbs/day,ug/day,t/day","Volatile Organic Compounds by GC/MS [SW8260B];Volatile Organic Compounds EPA Method 624 [E624];Data Unavailable [DU]"]
["4-Day Average of Daily Maximums",null,null,"E206.2","Arsenic (AA, Furnace) [E206.2]",null,null,null,null,null,null,"DCPA12","1,2-Dichloropropane",null,null,null,"KG/L","kg/L",null,null,null,"1,2-Dichloropropane","kg/L,g/L,mg/L,ppth,ug/L,ng/L,pg/L,mg/cm2,g/day,g/year,kg/day,kg/month,kg/year,lb/day,lbs/week,lbs/month,lbs/year,mg/day,mg/kg,ug/kg,ng/g,ulbs/day,ug/day,t/day","Extractable Priority Pollutants [E625];Extractable Priority Pollutants by GC/MS SIM [E625SIM];GC/MS SIM Method [SIM];HISTORICAL: Volatile Organic Compounds by GC/MS [SW8260];Semivolatile Organic Compounds by GC/MS [SW8270C];VOCs by GC/MS Fuel Additives Plus BTEX [8260FAB];Volatile Organic Compounds by GC/MS - Open Scan [8260BOS];Volatile Organic Compounds by GC/MS [SW8260B];Volatile Organic Compounds by GC/MS SIM [8260SIM];Volatile Organic Compounds by Purge and Trap [E524.2];Volatile Organic Compounds EPA Method 624 [E624];Purgeables by GC/MS [E624.1];Data Unavailable [DU]"]
["4-Day Continuous Average",null,null,"SW7061A","Arsenic (AA, Gaseous Hydride) [SW7061A]",null,null,null,null,null,null,"DPHY12","1,2-Diphenylhydrazine",null,null,null,"KG/MO","kg/month",null,null,null,"1,2-Diphenylhydrazine","kg/L,g/L,mg/L,ppth,ug/L,ng/L,pg/L,mg/cm2,g/day,g/year,kg/day,kg/month,kg/year,lb/day,lbs/week,lbs/month,lbs/year,mg/day,mg/kg,ug/kg,ng/g,ulbs/day,ug/day,t/day","Extractable Priority Pollutants [E625];Extractable Priority Pollutants by GC/MS SIM [E625SIM];GC/MS SIM Method [SIM];Halogenated Volatile Organics by Headspace [3810HVO];HISTORICAL: Semivolatile Organic Compounds by GC/MS [SW8270];HISTORICAL: Semivolatile Organic Compounds by GC/MS [SW8270A];Organochlorine Pesticides and PCBs [E608];Organochlorine Pesticides by Gas Chromatography [SW8081A];Semivolatile Organic Compounds by GC/MS - Open Scan [8270COS];Semivolatile Organic Compounds by GC/MS [SW8270C];Semivolatile Organic Compounds by Isotope Dilution GCMS [E1625C];Semivolatile Organic Compounds by SPE & GC/MS [E526];Volatile Organic Compounds by GC/MS [SW8260B];Volatile Organic Compounds by GC/MS SIM [8260SIM];Volatile Organic Compounds EPA Method 624 [E624];Base/Neutrals and Acids by GC/MS [E625.1];Data Unavailable [DU]"]
["50% of Monthly Means for a Calendar Year",null,null,"E206.3","Arsenic (AA, Hydride) [E206.3]",null,null,null,null,null,null,"TMB135","1,3,5-Trimethylbenzene",null,null,null,"KG/YR","kg/year",null,null,null,"1,3,5-Trimethylbenzene","kg/L,g/L,mg/L,ppth,ug/L,ng/L,pg/L,mg/cm2,g/day,g/year,kg/day,kg/month,kg/year,lb/day,lbs/week,lbs/month,lbs/year,mg/day,mg/kg,ug/kg,ng/g,ulbs/day,ug/day,t/day","GC/MS SIM Method [SIM];HISTORICAL: Volatile Organic Compounds by GC/MS [SW8260];Semivolatile Organic Compounds by GC/MS [SW8270C];Volatile Organic Compounds by GC/MS [SW8260B];Data Unavailable [DU]"]
["5-Day Geometric Mean",null,null,"ASA1033","ASA (1982) 10-3.3: Electrical Conductivity [ASA1033]",null,null,null,null,null,null,"TNB135","1,3,5-Trinitrobenzene",null,null,null,"L/DAY","L/day",null,null,null,"1,3,5-Trinitrobenzene","kg/L,g/L,mg/L,ppth,ug/L,ng/L,pg/L,mg/cm2,g/day,g/year,kg/day,kg/month,kg/year,lb/day,lbs/week,lbs/month,lbs/year,mg/day,mg/kg,ug/kg,ng/g,ulbs/day,ug/day,t/day","Nitroaromatics, Nitramines, and Nitrate Esters by HPLC [SW8330B];Data Unavailable [DU]"]
["5-Sample Median",null,null,"ASA2451","ASA (1982) 24-5.1: Phosphorus Soluble in Dilute Acid-Fluoride [ASA2451]",null,null,null,null,null,null,"ERYTHRENE","1,3-Butadiene",null,null,null,"LBS/DAY","lb/day",null,null,null,"1,3-Butadiene","kg/L,g/L,mg/L,ppth,ug/L,ng/L,pg/L,mg/cm2,g/day,g/year,kg/day,kg/month,kg/year,lb/day,lbs/week,lbs/month,lbs/year,mg/day,mg/kg,ug/kg,ng/g,ulbs/day,ug/day,t/day","Data Unavailable [DU]"]
["5-Year Moving Average",null,null,"ASA39","ASA (1982) 39:  Heterotrophic Plate Count [ASA39]",null,null,null,null,null,null,"DCBZ13","1,3-Dichlorobenzene",null,null,null,"LBS","lbs",null,null,null,"1,3-Dichlorobenzene","kg/L,g/L,mg/L,ppth,ug/L,ng/L,pg/L,mg/cm2,g/day,g/year,kg/day,kg/month,kg/year,lb/day,lbs/week,lbs/month,lbs/year,mg/day,mg/kg,ug/kg,ng/g,ulbs/day,ug/day,t/day","Extractable Priority Pollutants [E625];Base/Neutrals and Acids by GC/MS [E625.1];Extractable Priority Pollutants by GC/MS SIM [E625SIM];GC/MS SIM Method [SIM];HISTORICAL: Semivolatile Organic Compounds by GC/MS [SW8270];HISTORICAL: Semivolatile Organic Compounds by GC/MS [SW8270A];HISTORICAL: Volatile Organic Compounds by GC/MS [SW8260];Semivolatile Organic Compounds by GC/MS [SW8270C];Semivolatile Organic Compounds by Isotope Dilution GCMS [E1625C];VOCs by GC/MS Fuel Additives Plus BTEX [8260FAB];Volatile Organic Compounds by GC/MS [SW8260B];Volatile Organic Compounds by GC/MS SIM [8260SIM];Volatile Organic Compounds EPA Method 624 [E624];Purgeables by GC/MS [E624.1];Data Unavailable [DU]"]
["6-Month Median",null,null,"ASA13","ASA (1986) 13:  Bulk Density [ASA13]",null,null,null,null,null,null,"DCPA13","1,3-Dichloropropane",null,null,null,"LBS/ACRE","lbs/acre",null,null,null,"1,3-Dichloropropane","kg/L,g/L,mg/L,ppth,ug/L,ng/L,pg/L,mg/cm2,g/day,g/year,kg/day,kg/month,kg/year,lb/day,lbs/week,lbs/month,lbs/year,mg/day,mg/kg,ug/kg,ng/g,ulbs/day,ug/day,t/day","GC/MS SIM Method [SIM];HISTORICAL: Volatile Organic Compounds by GC/MS [SW8260];Semivolatile Organic Compounds by GC/MS [SW8270C];Volatile Organic Compounds by GC/MS [SW8260B];Volatile Organic Compounds by Purge and Trap [E524.2];Volatile Organic Compounds EPA Method 624 [E624];Data Unavailable [DU]"]
["6-Week Rolling Geometric Mean",null,null,"ASA18","ASA (1986) 18:  Porosity [ASA18]",null,null,null,null,null,null,"DCP13","1,3-Dichloropropylenes, Sum",null,null,null,"LBS/MON","lbs/month",null,null,null,"1,3-Dichloropropylenes, Sum","kg/L,g/L,mg/L,ppth,ug/L,ng/L,pg/L,mg/cm2,g/day,g/year,kg/day,kg/month,kg/year,lb/day,lbs/week,lbs/month,lbs/year,mg/day,mg/kg,ug/kg,ng/g,ulbs/day,ug/day,t/day","Extractable Priority Pollutants [E625];Extractable Priority Pollutants by GC/MS SIM [E625SIM];HISTORICAL: Volatile Organic Compounds by GC/MS [SW8260];Organochlorine Pesticides and PCBs [E608];Organochlorine Pesticides by Gas Chromatography [SW8081A];Semivolatile Organic Compounds by GC/MS [SW8270C];Volatile Organic Compounds by GC/MS - Open Scan [8260BOS];Volatile Organic Compounds by GC/MS [SW8260B];Volatile Organic Compounds by GC/MS SIM [8260SIM];Volatile Organic Compounds by Purge and Trap [E524.2];Volatile Organic Compounds EPA Method 624 [E624];Data Unavailable [DU]"]
["7-Day Average (Mean)",null,null,"E600M4","Asbestos in Bulk Insulation, Int. Method (Pol Lt. Microscopy & Di [E600M4]",null,null,null,null,null,null,"DM13NBZ2","1,3-Dimethyl-2-nitrobenzene",null,null,null,"LBS/WK","lbs/week",null,null,null,"1,3-Dimethyl-2-nitrobenzene","kg/L,g/L,mg/L,ppth,ug/L,ng/L,pg/L,mg/cm2,g/day,g/year,kg/day,kg/month,kg/year,lb/day,lbs/week,lbs/month,lbs/year,mg/day,mg/kg,ug/kg,ng/g,ulbs/day,ug/day,t/day","Data Unavailable [DU]"]
["7-Day Average of Daily Averages",null,null,"D517491","ASTM D5174-91:Standard Test Method for Uranium by Laser Phosph. [D517491]",null,null,null,null,null,null,"DNB13","1,3-Dinitrobenzene",null,null,null,"LBS/YR","lbs/year",null,null,null,"1,3-Dinitrobenzene","kg/L,g/L,mg/L,ppth,ug/L,ng/L,pg/L,mg/cm2,g/day,g/year,kg/day,kg/month,kg/year,lb/day,lbs/week,lbs/month,lbs/year,mg/day,mg/kg,ug/kg,ng/g,ulbs/day,ug/day,t/day","Nitroaromatics, Nitramines, and Nitrate Esters by HPLC [SW8330B];Data Unavailable [DU]"]
["7-Day Average of Daily Maximums",null,null,"D121804","ASTM Guide for Conducting Static Toxicity Tests with Microalgae (ASTM E1218-04(2012)) [D121804]",null,null,null,null,null,null,"DCBZ14","1,4-Dichlorobenzene",null,null,null,"MEQ/L","meq/L",null,null,null,"1,4-Dichlorobenzene","kg/L,g/L,mg/L,ppth,ug/L,ng/L,pg/L,mg/cm2,g/day,g/year,kg/day,kg/month,kg/year,lb/day,lbs/week,lbs/month,lbs/year,mg/day,mg/kg,ug/kg,ng/g,ulbs/day,ug/day,t/day","Extractable Priority Pollutants [E625];Base/Neutrals and Acids by GC/MS [E625.1];Extractable Priority Pollutants by GC/MS SIM [E625SIM];GC/MS SIM Method [SIM];HISTORICAL: Semivolatile Organic Compounds by GC/MS [SW8270];HISTORICAL: Semivolatile Organic Compounds by GC/MS [SW8270A];HISTORICAL: Volatile Organic Compounds by GC/MS [SW8260];Organochlorine Pesticides and PCBs [E608];Organochlorine Pesticides by Gas Chromatography [SW8081A];Semivolatile Organic Compounds by GC/MS [SW8270C];Semivolatile Organic Compounds by Isotope Dilution GCMS [E1625C];VOCs by GC/MS Fuel Additives Plus BTEX [8260FAB];Volatile Organic Compounds by GC/MS [SW8260B];Volatile Organic Compounds by GC/MS SIM [8260SIM];Volatile Organic Compounds by Purge and Trap [E524.2];Volatile Organic Compounds EPA Method 624 [E624];Purgeables by GC/MS [E624.1];Data Unavailable [DU]"]
["7-Day Median",null,null,"D240","ASTM Heat of Combstn of Hydrocarbon Liquids by Bomb Calorimeter [D240]",null,null,null,null,null,null,"DCBZ14D4","1,4-Dichlorobenzene-d4",null,null,null,"M","meters",null,null,null,"1,4-Dichlorobenzene-d4","kg/L,g/L,mg/L,ppth,ug/L,ng/L,pg/L,mg/cm2,g/day,g/year,kg/day,kg/month,kg/year,lb/day,lbs/week,lbs/month,lbs/year,mg/day,mg/kg,ug/kg,ng/g,ulbs/day,ug/day,t/day","Extractable Priority Pollutants [E625];Extractable Priority Pollutants by GC/MS SIM [E625SIM];GC/MS SIM Method [SIM];HISTORICAL: Semivolatile Organic Compounds by GC/MS [SW8270];HISTORICAL: Semivolatile Organic Compounds by GC/MS [SW8270A];HISTORICAL: Volatile Organic Compounds by GC/MS [SW8260];Organochlorine Pesticides and PCBs [E608];Organochlorine Pesticides by Gas Chromatography [SW8081A];Semivolatile Organic Compounds by GC/MS [SW8270C];Semivolatile Organic Compounds by Isotope Dilution GCMS [E1625C];VOCs by GC/MS Fuel Additives Plus BTEX [8260FAB];Volatile Organic Compounds by GC/MS [SW8260B];Volatile Organic Compounds by GC/MS SIM [8260SIM];Volatile Organic Compounds by Purge and Trap [E524.2];Volatile Organic Compounds EPA Method 624 [E624];Data Unavailable [DU]"]
["90% for a calendar year",null,null,"D2972","ASTM Method Arsenic by Atomic Absorption; Furnace [D2972]",null,null,null,null,null,null,"10:2FTS","10:2 Fluorotelomer sulfonic acid",null,null,null,"MTON","Metric Tons",null,null,null,"10:2 Fluorotelomer sulfonic acid","kg/L,g/L,mg/L,ppth,ug/L,ng/L,pg/L,mg/cm2,g/day,g/year,kg/day,kg/month,kg/year,lb/day,lbs/week,lbs/month,lbs/year,mg/day,mg/kg,ug/kg,ng/g,ulbs/day,ug/day,t/day","Data Unavailable [DU]"]
["90% of a Minimum of 5 Samples in 30-Days",null,null,"D482","ASTM Method Ash from Petroleum Products [D482]",null,null,null,null,null,null,"11CLPF3OUDS","11-Chloroeicosafluoro-3-oxaundecane-1-sulfonic acid",null,null,null,"MG","mg",null,null,null,"11-Chloroeicosafluoro-3-oxaundecane-1-sulfonic acid","kg/L,g/L,mg/L,ppth,ug/L,ng/L,pg/L,mg/cm2,g/day,g/year,kg/day,kg/month,kg/year,lb/day,lbs/week,lbs/month,lbs/year,mg/day,mg/kg,ug/kg,ng/g,ulbs/day,ug/day,t/day","Data Unavailable [DU]"]
["90-Day 90%",null,null,"D808","ASTM Method Chlorine in New and Used Petroleum Products [D808]",null,null,null,null,null,null,"2PYRR1M","1-Methyl-2-Pyrrolidinone",null,null,null,"MG/CM2","mg/cm2",null,null,null,"1-Methyl-2-Pyrrolidinone","kg/L,g/L,mg/L,ppth,ug/L,ng/L,pg/L,mg/cm2,g/day,g/year,kg/day,kg/month,kg/year,lb/day,lbs/week,lbs/month,lbs/year,mg/day,mg/kg,ug/kg,ng/g,ulbs/day,ug/day,t/day","Data Unavailable [DU]"]
["90-Day Mean",null,null,"D2500","ASTM Method Cloud Point of Petroleum Oils [D2500]",null,null,null,null,null,null,"MTNPH1","1-Methylnaphthalene",null,null,null,"MG/DAY","mg/day",null,null,null,"1-Methylnaphthalene","kg/L,g/L,mg/L,ppth,ug/L,ng/L,pg/L,mg/cm2,g/day,g/year,kg/day,kg/month,kg/year,lb/day,lbs/week,lbs/month,lbs/year,mg/day,mg/kg,ug/kg,ng/g,ulbs/day,ug/day,t/day","Extractable Priority Pollutants [E625];Base/Neutrals and Acids by GC/MS [E625.1];Data Unavailable [DU]"]
["Annual Average (Mean)",null,null,"DE1109","ASTM Method Determining Bulk Density of Solid Waste Fractions [DE1109]",null,null,null,null,null,null,"FC123","2,2-Dichloro-1,1,1-trifluoroethane",null,null,null,"MG/KG","mg/kg",null,null,null,"2,2-Dichloro-1,1,1-trifluoroethane","kg/L,g/L,mg/L,ppth,ug/L,ng/L,pg/L,mg/cm2,g/day,g/year,kg/day,kg/month,kg/year,lb/day,lbs/week,lbs/month,lbs/year,mg/day,mg/kg,ug/kg,ng/g,ulbs/day,ug/day,t/day","Volatile Organic Compounds EPA Method 624 [E624];Data Unavailable [DU]"]
["Annual Average of Daily Averages",null,null,"D3828","ASTM Method Flash Point by Setaflash Closed Tester [D3828]",null,null,null,null,null,null,"DCPA22","2,2-Dichloropropane",null,null,null,"MG/L","mg/L",null,null,null,"2,2-Dichloropropane","kg/L,g/L,mg/L,ppth,ug/L,ng/L,pg/L,mg/cm2,g/day,g/year,kg/day,kg/month,kg/year,lb/day,lbs/week,lbs/month,lbs/year,mg/day,mg/kg,ug/kg,ng/g,ulbs/day,ug/day,t/day","GC/MS SIM Method [SIM];HISTORICAL: Volatile Organic Compounds by GC/MS [SW8260];Semivolatile Organic Compounds by GC/MS [SW8270C];Volatile Organic Compounds by GC/MS [SW8260B];Data Unavailable [DU]"]
["Annual Average of Daily Maximums",null,null,"D2369","ASTM Method for Volatile Content of Coatings (1998) [D2369]",null,null,null,null,null,null,"HFPA-DA","2,3,3,3-tetrafluoro-2-(1,1,2,2,3,3,3-heptafluoropropoxy) propanoic acid",null,null,null,"MG/M3","mg/m3",null,null,null,"2,3,3,3-tetrafluoro-2-(1,1,2,2,3,3,3-heptafluoropropoxy) propanoic acid","kg/L,g/L,mg/L,ppth,ug/L,ng/L,pg/L,mg/cm2,g/day,g/year,kg/day,kg/month,kg/year,lb/day,lbs/week,lbs/month,lbs/year,mg/day,mg/kg,ug/kg,ng/g,ulbs/day,ug/day,t/day","Data Unavailable [DU]"]
["Annual Average of Daily Minimums",null,null,"D776","ASTM Method Forms of Chlorine in Refuse-Derived Fuel [D776]",null,null,null,null,null,null,"TCP2345","2,3,4,5-Tetrachlorophenol",null,null,null,"MGD","MGD",null,null,null,"2,3,4,5-Tetrachlorophenol","kg/L,g/L,mg/L,ppth,ug/L,ng/L,pg/L,mg/cm2,g/day,g/year,kg/day,kg/month,kg/year,lb/day,lbs/week,lbs/month,lbs/year,mg/day,mg/kg,ug/kg,ng/g,ulbs/day,ug/day,t/day","HISTORICAL: Semivolatile Organic Compounds by GC/MS [SW8270];Data Unavailable [DU]"]
["Annual Loading",null,null,"D2015","ASTM Method High Heat Value Determination in Liquid [D2015]",null,null,null,null,null,null,"HXCDF234678","2,3,4,6,7,8-Hexachlorodibenzofuran",null,null,null,"MGM","MGM",null,null,null,"2,3,4,6,7,8-Hexachlorodibenzofuran","ng/L,pg/L,ug/L, pg/g,lb/day,ulbs/day","HIST:Polychlorinated Dibenzodioxins/Polychlorinated Dibenzofurans [SW8280];Polychlorinated Dibenzodioxins/Polychlorinated Dibenzofurans [SW8280A];Polychlorinated Dibenzodioxins/Polychlorinated Dibenzofurans [SW8290];Tetra thru Octa-Chlorinated Dioxins and Furans by Isotope Dilutin [E1613A];Tetra-through Octa-Chlorinated Dioxins and Furans by HRGC/HRMS [E1613B];Data Unavailable [DU]"]
["Annual Median",null,null,"D2974","ASTM Method Moisture, Ash, and Organic Matter (1987) [D2974]",null,null,null,null,null,null,"TCP2346","2,3,4,6-Tetrachlorophenol",null,null,null,"MG-MIN/L","mg-min/L",null,null,null,"2,3,4,6-Tetrachlorophenol",{"$f":"$AG$8","v":"kg/L,g/L,mg/L,ppth,ug/L,ng/L,pg/L,mg/cm2,g/day,g/year,kg/day,kg/month,kg/year,lb/day,lbs/week,lbs/month,lbs/year,mg/day,mg/kg,ug/kg,ng/g,ulbs/day,ug/day,t/day"},"Extractable Priority Pollutants [E625];Semivolatile Organic Compounds by GC/MS - Open Scan [8270COS];Semivolatile Organic Compounds by GC/MS [SW8270C];Tetra thru Octa-Chlorinated Dioxins and Furans by Isotope Dilutin [E1613A];Data Unavailable [DU]"]
["Average Monthly (AMEL)",null,null,"D1945","ASTM Method Natural Gas by GC [D1945]",null,null,null,null,null,null,"PECDF23478","2,3,4,7,8-Pentachlorodibenzofuran",null,null,null,"MILES","Mile",null,null,null,"2,3,4,7,8-Pentachlorodibenzofuran","ng/L,pg/L,ug/L, pg/g,lb/day,ulbs/day","HIST:Polychlorinated Dibenzodioxins/Polychlorinated Dibenzofurans [SW8280];Polychlorinated Dibenzodioxins/Polychlorinated Dibenzofurans [SW8280A];Polychlorinated Dibenzodioxins/Polychlorinated Dibenzofurans [SW8290];Tetra thru Octa-Chlorinated Dioxins and Furans by Isotope Dilutin [E1613A];Tetra-through Octa-Chlorinated Dioxins and Furans by HRGC/HRMS [E1613B];Data Unavailable [DU]"]
["Average Weekly (AWEL)",null,null,"D3341","ASTM Method Organic Lead [D3341]",null,null,null,null,null,null,"TM235NPH","2,3,5-Trimethylnaphthalene",null,null,null,"MFL","million fibers/L",null,null,null,"2,3,5-Trimethylnaphthalene",{"$f":"$AG$8","v":"kg/L,g/L,mg/L,ppth,ug/L,ng/L,pg/L,mg/cm2,g/day,g/year,kg/day,kg/month,kg/year,lb/day,lbs/week,lbs/month,lbs/year,mg/day,mg/kg,ug/kg,ng/g,ulbs/day,ug/day,t/day"},"Extractable Priority Pollutants [E625];Base/Neutrals and Acids by GC/MS [E625.1];Data Unavailable [DU]"]
["Daily Average (Mean)",null,null,"D1498","ASTM Method Oxygen Reduction Potential [D1498]",null,null,null,null,null,null,"TCDD2378","2,3,7,8-TCDD (Dioxin)",null,null,null,"MGAL","Million gallons",null,null,null,"2,3,7,8-TCDD (Dioxin)","mg/L,ng/L,pg/L,ug/L,pg/g,lb/day/,ulbs/day,g/day,mg/day,ug/day","Determination of Organophosphorus Pesticides [E614];Extractable Priority Pollutants [E625];Extractable Priority Pollutants by GC/MS SIM [E625SIM];Halogenated Volatile Organics by Headspace [3810HVO];HIST:Polychlorinated Dibenzodioxins/Polychlorinated Dibenzofurans [SW8280];HISTORICAL: Draft PC Dibenzodioxins/PC Dibenzofuran [SW8290D];Polychlorinated Dibenzodioxins/Polychlorinated Dibenzofurans [SW8280A];Polychlorinated Dibenzodioxins/Polychlorinated Dibenzofurans [SW8290];Tetra thru Octa-Chlorinated Dioxins and Furans by Isotope Dilutin [E1613A];Tetra-through Octa-Chlorinated Dioxins and Furans by HRGC/HRMS [E1613B];Data Unavailable [DU]"]
["Daily Discharge",null,null,"D97","ASTM Method Pour Point of Petroleum Oils [D97]",null,null,null,null,null,null,"TCDF2378","2,3,7,8-Tetrachlorodibenzofuran",null,null,null,"MILLIVOLTS","millivolts",null,null,null,"2,3,7,8-Tetrachlorodibenzofuran","mg/L,ng/L,pg/L,ug/L,pg/g,lb/day/,ulbs/day","Determination of Chlorinated Acids in Water by GC/ECD [E515.1];HIST:Polychlorinated Dibenzodioxins/Polychlorinated Dibenzofurans [SW8280];Polychlorinated Dibenzodioxins/Polychlorinated Dibenzofurans [SW8280A];Polychlorinated Dibenzodioxins/Polychlorinated Dibenzofurans [SW8290];Tetra thru Octa-Chlorinated Dioxins and Furans by Isotope Dilutin [E1613A];Tetra-through Octa-Chlorinated Dioxins and Furans by HRGC/HRMS [E1613B];Data Unavailable [DU]"]
["Daily Maximum",null,null,"D1946","ASTM Method Reformed Gas by GC (1990) (2000) [D1946]",null,null,null,null,null,null,"SILVEX","2,4,5-TP (Silvex)",null,null,null,"MIN","minutes",null,null,null,"2,4,5-TP (Silvex)",{"$f":"$AG$8","v":"kg/L,g/L,mg/L,ppth,ug/L,ng/L,pg/L,mg/cm2,g/day,g/year,kg/day,kg/month,kg/year,lb/day,lbs/week,lbs/month,lbs/year,mg/day,mg/kg,ug/kg,ng/g,ulbs/day,ug/day,t/day"},"Chlorinated Acids in Water by LLE [E515.3];Chlorinated Acids in Water by LLME [E515.4];Chlorinated Herbicides by GC [SW8151A];Determination of Chlorinated Acids in Water by GC/ECD [E515.1];Extractable Priority Pollutants [E625];Nitrogen- & Phosphorus-Containing Pest. in Water by GC [E507];Organochlorine Pesticides and PCBs [E608];Semivolatile Organic Compounds by GC/MS [SW8270C];Data Unavailable [DU]"]
["Daily Minimum",null,null,"D3859","ASTM Method Selenium in Water [D3859]",null,null,null,null,null,null,"TCP245","2,4,5-Trichlorophenol",null,null,null,"MJ/CM2","mJ/cm2",null,null,null,"2,4,5-Trichlorophenol","kg/L,g/L,mg/L,ppth,ug/L,ng/L,pg/L,mg/cm2,g/day,g/year,kg/day,kg/month,kg/year,lb/day,lbs/week,lbs/month,lbs/year,mg/day,mg/kg,ug/kg,ng/g,ulbs/day,ug/day,t/day","Chlorinated Acids in Water by LLE [E515.3];Chlorinated Herbicides by GC [SW8151A];Extractable Priority Pollutants [E625];Semivolatile Organic Compounds by GC/MS [SW8270C];Data Unavailable [DU]"]
["Delta from Background",null,null,"D287","ASTM Method Specific Gravity (Petrol. Product Hydrometer Sp) [D287]",null,null,null,null,null,null,"PH246BR","2,4,6-Tribromophenol",null,null,null,"ML/L","ml/L",null,null,null,"2,4,6-Tribromophenol","kg/L,g/L,mg/L,ppth,ug/L,ng/L,pg/L,mg/cm2,g/day,g/year,kg/day,kg/month,kg/year,lb/day,lbs/week,lbs/month,lbs/year,mg/day,mg/kg,ug/kg,ng/g,ulbs/day,ug/day,t/day","Extractable Priority Pollutants [E625];Base/Neutrals and Acids by GC/MS [E625.1];Semivolatile Organic Compounds by GC/MS [SW8270C];Data Unavailable [DU]"]
["Event Discharge",null,null,"D1217","ASTM Method Specific Gravity (Pycnometer) [D1217]",null,null,null,null,null,null,"TCP246","2,4,6-Trichlorophenol",null,null,null,"ML/L/HR","ml/L/hr",null,null,null,"2,4,6-Trichlorophenol","kg/L,g/L,mg/L,ppth,ug/L,ng/L,pg/L,mg/cm2,g/day,g/year,kg/day,kg/month,kg/year,lb/day,lbs/week,lbs/month,lbs/year,mg/day,mg/kg,ug/kg,ng/g,ulbs/day,ug/day,t/day","Extractable Priority Pollutants [E625];Base/Neutrals and Acids by GC/MS [E625.1];Extractable Priority Pollutants by GC/MS SIM [E625SIM];GC/MS SIM Method [SIM];HISTORICAL: Semivolatile Organic Compounds by GC/MS [SW8270];HISTORICAL: Semivolatile Organic Compounds by GC/MS [SW8270A];Organochlorine Pesticides and PCBs [E608];Organochlorine Pesticides by Gas Chromatography [SW8081A];Phenols by Gas Chromatography [SW8040A];Semivolatile Organic Compounds by GC/MS - Open Scan [8270COS];Semivolatile Organic Compounds by GC/MS [SW8270C];Semivolatile Organic Compounds by Isotope Dilution GCMS [E1625C];Semivolatile Organic Compounds by SPE & GC/MS [E526];Volatile Organic Compounds by GC/MS [SW8260B];Volatile Organic Compounds by GC/MS SIM [8260SIM];Volatile Organic Compounds EPA Method 624 [E624];Data Unavailable [DU]"]
["Geometric Mean of Minimum 5 Samples in 30-Days",null,null,"D129","ASTM Method Sulfur in Petroleum Products [D129]",null,null,null,null,null,null,"TNT","2,4,6-Trinitrotoluene",null,null,null,"MMHOS/CM","mmhos/cm",null,null,null,"2,4,6-Trinitrotoluene","kg/L,g/L,mg/L,ppth,ug/L,ng/L,pg/L,mg/cm2,g/day,g/year,kg/day,kg/month,kg/year,lb/day,lbs/week,lbs/month,lbs/year,mg/day,mg/kg,ug/kg,ng/g,ulbs/day,ug/day,t/day","Nitroaromatics, Nitramines, and Nitrate Esters by HPLC [SW8330B];Data Unavailable [DU]"]
["High Weekly Average",null,null,"D412982","ASTM Method Total and Organic Carbon in Water Oxidation (1982) [D412982]",null,null,null,null,null,null,"24D","2,4-D",null,null,null,"MPN/100ML","MPN/100 mL",null,null,null,"2,4-D","kg/L,g/L,mg/L,ppth,ug/L,ng/L,pg/L,mg/cm2,g/day,g/year,kg/day,kg/month,kg/year,lb/day,lbs/week,lbs/month,lbs/year,mg/day,mg/kg,ug/kg,ng/g,ulbs/day,ug/day,t/day","Chlorinated Acids in Water by LLE [E515.3];Chlorinated Acids in Water by LLME [E515.4];Chlorinated Herbicides by GC [SW8151A];Determination of Chlorinated Acids in Water by GC/ECD [E515.1];Organochlorine Pesticides and PCBs [E608];Volatile Organic Compounds EPA Method 624 [E624];Data Unavailable [DU]"]
["Instantaneous Maximum (IMAX)",null,null,"D3416","ASTM Method Total Hydrocarbons, Methane, CO in Atmosphere GC [D3416]",null,null,null,null,null,null,"24DB","2,4-DB",null,null,null,"MEGAWATTS","MW",null,null,null,"2,4-DB","kg/L,g/L,mg/L,ppth,ug/L,ng/L,pg/L,mg/cm2,g/day,g/year,kg/day,kg/month,kg/year,lb/day,lbs/week,lbs/month,lbs/year,mg/day,mg/kg,ug/kg,ng/g,ulbs/day,ug/day,t/day","Chlorinated Herbicides by GC [SW8151A];Determination of Chlorinated Acids in Water by GC/ECD [E515.1];Data Unavailable [DU]"]
["Instantaneous Minimum (IMIN)",null,null,"D4129","ASTM Method Total Organic Carbon (TOC) [D4129]",null,null,null,null,null,null,"DDD24","2,4-DDD",null,null,null,"MW/CM2","mW/cm2",null,null,null,"2,4-DDD","kg/L,g/L,mg/L,ppth,ug/L,ng/L,pg/L,mg/cm2,g/day,g/year,kg/day,kg/month,kg/year,lb/day,lbs/week,lbs/month,lbs/year,mg/day,mg/kg,ug/kg,ng/g,ulbs/day,ug/day,t/day","Extractable Priority Pollutants [E625];Organochlorine Pesticides and PCBs [E608];Organochlorine Pesticides and PCBs by GC/HSD [E608.3];Data Unavailable [DU]"]
["Log Mean of Minimum of 4 Samples in 30-Days",null,null,"D445","ASTM Method Viscosity (petroleum product, kinematic visc.) [D445]",null,null,null,null,null,null,"DDE24","2,4-DDE",null,null,null,"MWS/CM2","mWs/cm2",null,null,null,"2,4-DDE","kg/L,g/L,mg/L,ppth,ug/L,ng/L,pg/L,mg/cm2,g/day,g/year,kg/day,kg/month,kg/year,lb/day,lbs/week,lbs/month,lbs/year,mg/day,mg/kg,ug/kg,ng/g,ulbs/day,ug/day,t/day","Extractable Priority Pollutants [E625];Organochlorine Pesticides and PCBs [E608];Organochlorine Pesticides and PCBs by GC/HSD [E608.3];Semivolatile Organic Compounds by Isotope Dilution GCMS [E1625C];Data Unavailable [DU]"]
["Log Mean of Minimum of 5 Samples in 30-Days",null,null,"D2196","ASTM Method Viscosity (Viscometer) [D2196]",null,null,null,null,null,null,"DDT24","2,4-DDT",null,null,null,"NG/G","ng/g",null,null,null,"2,4-DDT","kg/L,g/L,mg/L,ppth,ug/L,ng/L,pg/L,mg/cm2,g/day,g/year,kg/day,kg/month,kg/year,lb/day,lbs/week,lbs/month,lbs/year,mg/day,mg/kg,ug/kg,ng/g,ulbs/day,ug/day,t/day","Extractable Priority Pollutants [E625];Organochlorine Pesticides and PCBs [E608];Organochlorine Pesticides and PCBs by GC/HSD [E608.3];Data Unavailable [DU]"]
["Log Mean of Samples in 30-Days",null,null,"D2216","ASTM Method Water (Moisture) Content of Soil and Rock (1992) [D2216]",null,null,null,null,null,null,"24DA6NBZME","2,4-Diamino-6-nitrotoluene",null,null,null,"NG/L","ng/L",null,null,null,"2,4-Diamino-6-nitrotoluene","kg/L,g/L,mg/L,ppth,ug/L,ng/L,pg/L,mg/cm2,g/day,g/year,kg/day,kg/month,kg/year,lb/day,lbs/week,lbs/month,lbs/year,mg/day,mg/kg,ug/kg,ng/g,ulbs/day,ug/day,t/day","Nitroaromatics, Nitramines, and Nitrate Esters by HPLC [SW8330B];Data Unavailable [DU]"]
["Maximum Daily (MDEL)",null,null,"D1796","ASTM Method Water and Sediment in Fuel Oils by Centrifuge (1997) [D1796]",null,null,null,null,null,null,"DCP24","2,4-Dichlorophenol",null,null,null,"NTU","NTU",null,null,null,"2,4-Dichlorophenol","kg/L,g/L,mg/L,ppth,ug/L,ng/L,pg/L,mg/cm2,g/day,g/year,kg/day,kg/month,kg/year,lb/day,lbs/week,lbs/month,lbs/year,mg/day,mg/kg,ug/kg,ng/g,ulbs/day,ug/day,t/day","Chlorinated Acids in Water by LLME [E515.4];Determination of Chlorinated Acids in Water by GC/ECD [E515.1];Extractable Priority Pollutants [E625];Base/Neutrals and Acids by GC/MS [E625.1];Extractable Priority Pollutants by GC/MS SIM [E625SIM];GC/MS SIM Method [SIM];HISTORICAL: Semivolatile Organic Compounds by GC/MS [SW8270];HISTORICAL: Semivolatile Organic Compounds by GC/MS [SW8270A];Phenols by Gas Chromatography [SW8040A];Semivolatile Organic Compounds by GC/MS - Open Scan [8270COS];Semivolatile Organic Compounds by GC/MS [SW8270C];Semivolatile Organic Compounds by Isotope Dilution GCMS [E1625C];Volatile Organic Compounds by GC/MS [SW8260B];Volatile Organic Compounds by GC/MS SIM [8260SIM];Volatile Organic Compounds EPA Method 624 [E624];Data Unavailable [DU]"]
["Mean of a Minimum of 5 Samples in 30-Days",null,null,"D1744","ASTM Method Water in Liquid Petroleum Prods. by K.F. Reagent [D1744]",null,null,null,null,null,null,"DMP24","2,4-Dimethylphenol",null,null,null,"PASS/FAIL","Pass/Fail (Pass = 0; Fail = 1)",null,null,null,"2,4-Dimethylphenol","kg/L,g/L,mg/L,ppth,ug/L,ng/L,pg/L,mg/cm2,g/day,g/year,kg/day,kg/month,kg/year,lb/day,lbs/week,lbs/month,lbs/year,mg/day,mg/kg,ug/kg,ng/g,ulbs/day,ug/day,t/day","Extractable Priority Pollutants [E625];Base/Neutrals and Acids by GC/MS [E625.1];Extractable Priority Pollutants by GC/MS SIM [E625SIM];GC/MS SIM Method [SIM];HISTORICAL: Semivolatile Organic Compounds by GC/MS [SW8270];HISTORICAL: Semivolatile Organic Compounds by GC/MS [SW8270A];Phenols by Gas Chromatography [SW8040A];Semivolatile Organic Compounds by GC/MS - Open Scan [8270COS];Semivolatile Organic Compounds by GC/MS [SW8270C];Semivolatile Organic Compounds by Isotope Dilution GCMS [E1625C];Volatile Organic Compounds by GC/MS [SW8260B];Volatile Organic Compounds by GC/MS SIM [8260SIM];Volatile Organic Compounds EPA Method 624 [E624];Data Unavailable [DU]"]
["Mean of Monthly Mean",null,null,"E282.2","Atomic Absorption, Furnace [E282.2]",null,null,null,null,null,null,"DNP24","2,4-Dinitrophenol",null,null,null,"PCI/L","PCi/L",null,null,null,"2,4-Dinitrophenol","kg/L,g/L,mg/L,ppth,ug/L,ng/L,pg/L,mg/cm2,g/day,g/year,kg/day,kg/month,kg/year,lb/day,lbs/week,lbs/month,lbs/year,mg/day,mg/kg,ug/kg,ng/g,ulbs/day,ug/day,t/day","Extractable Priority Pollutants [E625];Base/Neutrals and Acids by GC/MS [E625.1];Extractable Priority Pollutants by GC/MS SIM [E625SIM];GC/MS SIM Method [SIM];HISTORICAL: Semivolatile Organic Compounds by GC/MS [SW8270];HISTORICAL: Semivolatile Organic Compounds by GC/MS [SW8270A];Organochlorine Pesticides and PCBs [E608];Phenols by Gas Chromatography [SW8040A];Semivolatile Organic Compounds by GC/MS - Open Scan [8270COS];Semivolatile Organic Compounds by GC/MS [SW8270C];Semivolatile Organic Compounds by Isotope Dilution GCMS [E1625C];Semivolatile Organic Compounds by SPE & GC/MS [E526];Volatile Organic Compounds by GC/MS [SW8260B];Volatile Organic Compounds by GC/MS SIM [8260SIM];Volatile Organic Compounds EPA Method 624 [E624];Data Unavailable [DU]"]
["Median of Minimum of 5 Samples in 30-Days",null,null,"E200.9","Atomic Absorption, Platform [E200.9]",null,null,null,null,null,null,"DNT24","2,4-Dinitrotoluene",null,null,null,"PFU/100ML","PFU/100 mL",null,null,null,"2,4-Dinitrotoluene","kg/L,g/L,mg/L,ppth,ug/L,ng/L,pg/L,mg/cm2,g/day,g/year,kg/day,kg/month,kg/year,lb/day,lbs/week,lbs/month,lbs/year,mg/day,mg/kg,ug/kg,ng/g,ulbs/day,ug/day,t/day","Extractable Priority Pollutants [E625];Extractable Priority Pollutants by GC/MS SIM [E625SIM];GC/MS SIM Method [SIM];HISTORICAL: Semivolatile Organic Compounds by GC/MS [SW8270];HISTORICAL: Semivolatile Organic Compounds by GC/MS [SW8270A];Organochlorine Pesticides and PCBs [E608];Organochlorine Pesticides by Gas Chromatography [SW8081A];Semivolatile Organic Compounds by GC/MS - Open Scan [8270COS];Semivolatile Organic Compounds by GC/MS [SW8270C];Semivolatile Organic Compounds by Isotope Dilution GCMS [E1625C];Semivolatile Organic Compounds by SPE & GC/MS [E526];Volatile Organic Compounds by GC/MS [SW8260B];Volatile Organic Compounds by GC/MS SIM [8260SIM];Base/Neutrals and Acids by GC/MS [E625.1];Data Unavailable [DU]"]
["Monthly 90th%",null,null,"E208.1","Barium (AA, Direct Aspiration) [E208.1]",null,null,null,null,null,null,"26DA4NBZME","2,6-diamino-4-nitrotoluene",null,null,null,"PG/G","pg/g",null,null,null,"2,6-diamino-4-nitrotoluene","kg/L,g/L,mg/L,ppth,ug/L,ng/L,pg/L,mg/cm2,g/day,g/year,kg/day,kg/month,kg/year,lb/day,lbs/week,lbs/month,lbs/year,mg/day,mg/kg,ug/kg,ng/g,ulbs/day,ug/day,t/day","Nitroaromatics, Nitramines, and Nitrate Esters by HPLC [SW8330B];Data Unavailable [DU]"]
["Monthly 95%",null,null,"SW7080","Barium (AA, Direct Aspiration) [SW7080]",null,null,null,null,null,null,"DCP26","2,6-Dichlorophenol",null,null,null,"PG/L","pg/L",null,null,null,"2,6-Dichlorophenol","kg/L,g/L,mg/L,ppth,ug/L,ng/L,pg/L,mg/cm2,g/day,g/year,kg/day,kg/month,kg/year,lb/day,lbs/week,lbs/month,lbs/year,mg/day,mg/kg,ug/kg,ng/g,ulbs/day,ug/day,t/day","Extractable Priority Pollutants [E625];Semivolatile Organic Compounds by GC/MS [SW8270C];Data Unavailable [DU]"]
["Monthly 95% of Mean Daily",null,null,"SW7081","Barium (AA, Furnace Technique) [SW7081]",null,null,null,null,null,null,"DM26NPH","2,6-Dimethylnaphthalene",null,null,null,"PPTH","ppth",null,null,null,"2,6-Dimethylnaphthalene","kg/L,g/L,mg/L,ppth,ug/L,ng/L,pg/L,mg/cm2,g/day,g/year,kg/day,kg/month,kg/year,lb/day,lbs/week,lbs/month,lbs/year,mg/day,mg/kg,ug/kg,ng/g,ulbs/day,ug/day,t/day","Extractable Priority Pollutants [E625];Base/Neutrals and Acids by GC/MS [E625.1];Data Unavailable [DU]"]
["Monthly Average (Mean)",null,null,"E208.2","Barium (AA, Furnace) [E208.2]",null,null,null,null,null,null,"DNT26","2,6-Dinitrotoluene",null,null,null,"COLOR UNIT","Pt-Co Color Unit",null,null,null,"2,6-Dinitrotoluene","kg/L,g/L,mg/L,ppth,ug/L,ng/L,pg/L,mg/cm2,g/day,g/year,kg/day,kg/month,kg/year,lb/day,lbs/week,lbs/month,lbs/year,mg/day,mg/kg,ug/kg,ng/g,ulbs/day,ug/day,t/day","Extractable Priority Pollutants [E625];Extractable Priority Pollutants by GC/MS SIM [E625SIM];GC/MS SIM Method [SIM];HISTORICAL: Semivolatile Organic Compounds by GC/MS [SW8270];HISTORICAL: Semivolatile Organic Compounds by GC/MS [SW8270A];Semivolatile Organic Compounds by GC/MS - Open Scan [8270COS];Semivolatile Organic Compounds by GC/MS [SW8270C];Semivolatile Organic Compounds by Isotope Dilution GCMS [E1625C];Volatile Organic Compounds by GC/MS [SW8260B];Volatile Organic Compounds by GC/MS SIM [8260SIM];Volatile Organic Compounds EPA Method 624 [E624];Base/Neutrals and Acids by GC/MS [E625.1];Data Unavailable [DU]"]
["Monthly Average of Daily Averages",null,null,"E625.1","Base/Neutrals and Acids by GC/MS [E625.1]",null,null,null,null,null,null,"A2DNT46","2-Amino-4,6-dinitrotoluene",null,null,null,"S","seconds",null,null,null,"2-Amino-4,6-dinitrotoluene","kg/L,g/L,mg/L,ppth,ug/L,ng/L,pg/L,mg/cm2,g/day,g/year,kg/day,kg/month,kg/year,lb/day,lbs/week,lbs/month,lbs/year,mg/day,mg/kg,ug/kg,ng/g,ulbs/day,ug/day,t/day","Nitroaromatics, Nitramines, and Nitrate Esters by HPLC [SW8330B];Data Unavailable [DU]"]
["Monthly Average of Daily Maximums",null,null,"E210.1","Beryllium (AA, Direct Aspiration) [E210.1]",null,null,null,null,null,null,"111-76-2","2-butoxy-ethanol",null,null,null,"PH UNITS","SU",null,null,null,"2-butoxy-ethanol","kg/L,g/L,mg/L,ppth,ug/L,ng/L,pg/L,mg/cm2,g/day,g/year,kg/day,kg/month,kg/year,lb/day,lbs/week,lbs/month,lbs/year,mg/day,mg/kg,ug/kg,ng/g,ulbs/day,ug/day,t/day","Semivolatile Organic Compounds by GC/MS [SW8270C];Data Unavailable [DU]"]
["Monthly Average of Daily Minimums",null,null,"SW7090","Beryllium (AA, Direct Aspiration) [SW7090]",null,null,null,null,null,null,"CEVETH","2-Chloroethylvinyl Ether",null,null,null,"T.O.N.","T.O.N.",null,null,null,"2-Chloroethylvinyl Ether","kg/L,g/L,mg/L,ppth,ug/L,ng/L,pg/L,mg/cm2,g/day,g/year,kg/day,kg/month,kg/year,lb/day,lbs/week,lbs/month,lbs/year,mg/day,mg/kg,ug/kg,ng/g,ulbs/day,ug/day,t/day","Extractable Priority Pollutants [E625];Extractable Priority Pollutants by GC/MS SIM [E625SIM];GC/MS SIM Method [SIM];HISTORICAL: Volatile Organic Compounds by GC/MS [SW8260];Volatile Organic Compounds by GC/MS - Open Scan [8260BOS];Volatile Organic Compounds by GC/MS [SW8260B];Volatile Organic Compounds by Purge and Trap [E524.2];Volatile Organic Compounds EPA Method 624 [E624];Purgeables by GC/MS [E624.1];Data Unavailable [DU]"]
["Monthly Discharge",null,null,"CL210.2","Beryllium (AA, Furnace Technique) - modified for CLP [CL210.2]",null,null,null,null,null,null,"CNPH2","2-Chloronaphthalene",null,null,null,"T/DAY","t/day",null,null,null,"2-Chloronaphthalene","kg/L,g/L,mg/L,ppth,ug/L,ng/L,pg/L,mg/cm2,g/day,g/year,kg/day,kg/month,kg/year,lb/day,lbs/week,lbs/month,lbs/year,mg/day,mg/kg,ug/kg,ng/g,ulbs/day,ug/day,t/day","Extractable Priority Pollutants [E625];Extractable Priority Pollutants by GC/MS SIM [E625SIM];GC/MS SIM Method [SIM];HISTORICAL: Semivolatile Organic Compounds by GC/MS [SW8270];HISTORICAL: Semivolatile Organic Compounds by GC/MS [SW8270A];Semivolatile Organic Compounds by GC/MS - Open Scan [8270COS];Semivolatile Organic Compounds by GC/MS [SW8270C];Semivolatile Organic Compounds by Isotope Dilution GCMS [E1625C];Volatile Organic Compounds by GC/MS [SW8260B];Volatile Organic Compounds by GC/MS SIM [8260SIM];Volatile Organic Compounds EPA Method 624 [E624];Base/Neutrals and Acids by GC/MS [E625.1];Data Unavailable [DU]"]
["Monthly Geometric Mean",null,null,"E210.2","Beryllium (AA, Furnace Technique) [E210.2]",null,null,null,null,null,null,"CLPH2","2-Chlorophenol",null,null,null,"TUA","TUa",null,null,null,"2-Chlorophenol","kg/L,g/L,mg/L,ppth,ug/L,ng/L,pg/L,mg/cm2,g/day,g/year,kg/day,kg/month,kg/year,lb/day,lbs/week,lbs/month,lbs/year,mg/day,mg/kg,ug/kg,ng/g,ulbs/day,ug/day,t/day","Extractable Priority Pollutants [E625];Base/Neutrals and Acids by GC/MS [E625.1];Extractable Priority Pollutants by GC/MS SIM [E625SIM];GC/MS SIM Method [SIM];HISTORICAL: Semivolatile Organic Compounds by GC/MS [SW8270];HISTORICAL: Semivolatile Organic Compounds by GC/MS [SW8270A];Phenols by Gas Chromatography [SW8040A];Semivolatile Organic Compounds by GC/MS - Open Scan [8270COS];Semivolatile Organic Compounds by GC/MS [SW8270C];Semivolatile Organic Compounds by Isotope Dilution GCMS [E1625C];Volatile Organic Compounds by GC/MS [SW8260B];Volatile Organic Compounds by GC/MS SIM [8260SIM];Volatile Organic Compounds EPA Method 624 [E624];Data Unavailable [DU]"]
["Monthly Maximum",null,null,"SW7091","Beryllium (AA, Furnace Technique) [SW7091]",null,null,null,null,null,null,"CLPH2D4","2-Chlorophenol-d4",null,null,null,"TUC","TUc",null,null,null,"2-Chlorophenol-d4","kg/L,g/L,mg/L,ppth,ug/L,ng/L,pg/L,mg/cm2,g/day,g/year,kg/day,kg/month,kg/year,lb/day,lbs/week,lbs/month,lbs/year,mg/day,mg/kg,ug/kg,ng/g,ulbs/day,ug/day,t/day","Extractable Priority Pollutants [E625];Extractable Priority Pollutants by GC/MS SIM [E625SIM];GC/MS SIM Method [SIM];HISTORICAL: Semivolatile Organic Compounds by GC/MS [SW8270];HISTORICAL: Semivolatile Organic Compounds by GC/MS [SW8270A];Phenols by Gas Chromatography [SW8040A];Semivolatile Organic Compounds by GC/MS - Open Scan [8270COS];Semivolatile Organic Compounds by GC/MS [SW8270C];Semivolatile Organic Compounds by Isotope Dilution GCMS [E1625C];Volatile Organic Compounds by GC/MS [SW8260B];Volatile Organic Compounds by GC/MS SIM [8260SIM];Volatile Organic Compounds EPA Method 624 [E624];Data Unavailable [DU]"]
["Monthly Mean",null,null,"E405.1","Biochemical Oxygen Demand [E405.1]",null,null,null,null,null,null,"CLBZME2","2-Chlorotoluene",null,null,null,"UG/DAY","ug/day",null,null,null,"2-Chlorotoluene","kg/L,g/L,mg/L,ppth,ug/L,ng/L,pg/L,mg/cm2,g/day,g/year,kg/day,kg/month,kg/year,lb/day,lbs/week,lbs/month,lbs/year,mg/day,mg/kg,ug/kg,ng/g,ulbs/day,ug/day,t/day","GC/MS SIM Method [SIM];HISTORICAL: Volatile Organic Compounds by GC/MS [SW8260];Semivolatile Organic Compounds by GC/MS [SW8270C];Volatile Organic Compounds by GC/MS [SW8260B];Data Unavailable [DU]"]
["Monthly Median",null,null,"BDTL","Bligh and Dyer Method for Total Lipids [BDTL]",null,null,null,null,null,null,"PHEN2F","2-Fluorobiphenyl",null,null,null,"UG/KG","ug/kg",null,null,null,"2-Fluorobiphenyl","kg/L,g/L,mg/L,ppth,ug/L,ng/L,pg/L,mg/cm2,g/day,g/year,kg/day,kg/month,kg/year,lb/day,lbs/week,lbs/month,lbs/year,mg/day,mg/kg,ug/kg,ng/g,ulbs/day,ug/day,t/day","Extractable Priority Pollutants [E625];Semivolatile Organic Compounds by GC/MS [SW8270C];Base/Neutrals and Acids by GC/MS [E625.1];Data Unavailable [DU]"]
["Monthly Median of Mean Daily",null,null,"E212.3","Boron (Colorimetric, Curcumin) [E212.3]",null,null,null,null,null,null,"PH2F","2-Fluorophenol",null,null,null,"UG/L","ug/L",null,null,null,"2-Fluorophenol","kg/L,g/L,mg/L,ppth,ug/L,ng/L,pg/L,mg/cm2,g/day,g/year,kg/day,kg/month,kg/year,lb/day,lbs/week,lbs/month,lbs/year,mg/day,mg/kg,ug/kg,ng/g,ulbs/day,ug/day,t/day","Extractable Priority Pollutants [E625];Base/Neutrals and Acids by GC/MS [E625.1];Semivolatile Organic Compounds by GC/MS [SW8270C];Data Unavailable [DU]"]
["Monthly Minimum",null,null,"E320.1","Bromide [E320.1]",null,null,null,null,null,null,"7:3FTCA","2H,2H,3H,3H-Perfluorodecanoic acid",null,null,null,"UJ/CM2","uJ/cm2",null,null,null,"2H,2H,3H,3H-Perfluorodecanoic acid","kg/L,g/L,mg/L,ppth,ug/L,ng/L,pg/L,mg/cm2,g/day,g/year,kg/day,kg/month,kg/year,lb/day,lbs/week,lbs/month,lbs/year,mg/day,mg/kg,ug/kg,ng/g,ulbs/day,ug/day,t/day","Data Unavailable [DU]"]
["Not Limited",null,null,"SHEEN","Brown & Braddock Method for Sheen Screening (1989) [SHEEN]",null,null,null,null,null,null,"5:3FTCA","2H,2H,3H,3H-Perfluorooctanoic Acid",null,null,null,"ULBS/DAY","ulbs/day",null,null,null,"2H,2H,3H,3H-Perfluorooctanoic Acid","kg/L,g/L,mg/L,ppth,ug/L,ng/L,pg/L,mg/cm2,g/day,g/year,kg/day,kg/month,kg/year,lb/day,lbs/week,lbs/month,lbs/year,mg/day,mg/kg,ug/kg,ng/g,ulbs/day,ug/day,t/day","Data Unavailable [DU]"]
["Not to exceed a specific limit in any two consecutive samples",null,null,"SW8020F","BTEX/Gasoline Range Organics (SW8020/8015) [SW8020F]",null,null,null,null,null,null,"HXO2","2-Hexanone",null,null,null,"UMHOS","umhos",null,null,null,"2-Hexanone","kg/L,g/L,mg/L,ppth,ug/L,ng/L,pg/L,mg/cm2,g/day,g/year,kg/day,kg/month,kg/year,lb/day,lbs/week,lbs/month,lbs/year,mg/day,mg/kg,ug/kg,ng/g,ulbs/day,ug/day,t/day","Extractable Priority Pollutants [E625];Semivolatile Organic Compounds by GC/MS [SW8270C];Volatile Organic Compounds by GC/MS [SW8260B];Volatile Organic Compounds EPA Method 624 [E624];Data Unavailable [DU]"]
["Not to exceed a specific limit in more than 10% of samples within any 30-day period",null,null,"AHERA","Bulk Asbestos-40CFR763, Subpart E, Appendix A [AHERA]",null,null,null,null,null,null,"MTNPH2","2-Methylnaphthalene",null,null,null,"UMHOS/CM","umhos/cm",null,null,null,"2-Methylnaphthalene","kg/L,g/L,mg/L,ppth,ug/L,ng/L,pg/L,mg/cm2,g/day,g/year,kg/day,kg/month,kg/year,lb/day,lbs/week,lbs/month,lbs/year,mg/day,mg/kg,ug/kg,ng/g,ulbs/day,ug/day,t/day","Extractable Priority Pollutants [E625];GC/MS SIM Method [SIM];Semivolatile Organic Compounds by GC/MS [SW8270C];Base/Neutrals and Acids by GC/MS [E625.1];Data Unavailable [DU]"]
["Not to exceed a specific limit more than once within any 30-day period.",null,null,"CARB429","CA ARB-Determ. of PAH Emissions from Stationary Sources [CARB429]",null,null,null,null,null,null,"MEPH2","2-Methylphenol",null,null,null,"UP/DOWN","Up/Down (Up = 1; Down = -1)",null,null,null,"2-Methylphenol",{"$f":"$AG$8","v":"kg/L,g/L,mg/L,ppth,ug/L,ng/L,pg/L,mg/cm2,g/day,g/year,kg/day,kg/month,kg/year,lb/day,lbs/week,lbs/month,lbs/year,mg/day,mg/kg,ug/kg,ng/g,ulbs/day,ug/day,t/day"},"Extractable Priority Pollutants [E625];GC/MS SIM Method [SIM];Semivolatile Organic Compounds by GC/MS [SW8270C];Data Unavailable [DU]"]
["Other",null,null,"CAPBO","CA LUFT Method for Determination of Organic Lead (DHS Method) [CAPBO]",null,null,null,null,null,null,"NO2ANIL2","2-Nitroaniline",null,null,null,null,null,null,null,null,"2-Nitroaniline","kg/L,g/L,mg/L,ppth,ug/L,ng/L,pg/L,mg/cm2,g/day,g/year,kg/day,kg/month,kg/year,lb/day,lbs/week,lbs/month,lbs/year,mg/day,mg/kg,ug/kg,ng/g,ulbs/day,ug/day,t/day","Extractable Priority Pollutants [E625];GC/MS SIM Method [SIM];Semivolatile Organic Compounds by GC/MS [SW8270C];Data Unavailable [DU]"]
["Percent Increase",null,null,"CATPH-D","CA LUFT Method for Diesel Range Organics [CATPH-D]",null,null,null,null,null,null,"NTPH2","2-Nitrophenol",null,null,null,null,null,null,null,null,"2-Nitrophenol","kg/L,g/L,mg/L,ppth,ug/L,ng/L,pg/L,mg/cm2,g/day,g/year,kg/day,kg/month,kg/year,lb/day,lbs/week,lbs/month,lbs/year,mg/day,mg/kg,ug/kg,ng/g,ulbs/day,ug/day,t/day","Extractable Priority Pollutants [E625];Base/Neutrals and Acids by GC/MS [E625.1];Extractable Priority Pollutants by GC/MS SIM [E625SIM];GC/MS SIM Method [SIM];HISTORICAL: Semivolatile Organic Compounds by GC/MS [SW8270];HISTORICAL: Semivolatile Organic Compounds by GC/MS [SW8270A];Phenols by Gas Chromatography [SW8040A];Semivolatile Organic Compounds by GC/MS - Open Scan [8270COS];Semivolatile Organic Compounds by GC/MS [SW8270C];Semivolatile Organic Compounds by Isotope Dilution GCMS [E1625C];Volatile Organic Compounds by GC/MS [SW8260B];Volatile Organic Compounds by GC/MS SIM [8260SIM];Volatile Organic Compounds EPA Method 624 [E624];Data Unavailable [DU]"]
["Percent Reduction",null,null,"CATPH-G","CA LUFT Method for Gasoline Range Organics [CATPH-G]",null,null,null,null,null,null,"NPR2","2-Nitropropane",null,null,null,null,null,null,null,null,"2-Nitropropane","kg/L,g/L,mg/L,ppth,ug/L,ng/L,pg/L,mg/cm2,g/day,g/year,kg/day,kg/month,kg/year,lb/day,lbs/week,lbs/month,lbs/year,mg/day,mg/kg,ug/kg,ng/g,ulbs/day,ug/day,t/day","Volatile Organic Compounds by GC/MS [SW8260B];Purgeables by GC/MS [E624.1];Data Unavailable [DU]"]
["Percent Removal",null,null,"CATFH","CA LUFT Method for Total Fuel Hydrocarbons [CATFH]",null,null,null,null,null,null,"NBZME2","2-Nitrotoluene",null,null,null,null,null,null,null,null,"2-Nitrotoluene","kg/L,g/L,mg/L,ppth,ug/L,ng/L,pg/L,mg/cm2,g/day,g/year,kg/day,kg/month,kg/year,lb/day,lbs/week,lbs/month,lbs/year,mg/day,mg/kg,ug/kg,ng/g,ulbs/day,ug/day,t/day","Nitroaromatics, Nitramines, and Nitrate Esters by HPLC [SW8330B];Data Unavailable [DU]"]
["Seven Sample Median",null,null,"CAGBTEX","CA LUFT Method for Volatiles by GC/GRO (SW8021B/CATPH-G) [CAGBTEX]",null,null,null,null,null,null,"MPK","2-Pentanone",null,null,null,null,null,null,null,null,"2-Pentanone","kg/L,g/L,mg/L,ppth,ug/L,ng/L,pg/L,mg/cm2,g/day,g/year,kg/day,kg/month,kg/year,lb/day,lbs/week,lbs/month,lbs/year,mg/day,mg/kg,ug/kg,ng/g,ulbs/day,ug/day,t/day","Data Unavailable [DU]"]
["Single",null,null,"E213.1","Cadmium (AA, Direct Aspiration) [E213.1]",null,null,null,null,null,null,"MEPH1314","3 & 4-Methylphenol (m,p-Cresol)",null,null,null,null,null,null,null,null,"3 & 4-Methylphenol (m,p-Cresol)","kg/L,g/L,mg/L,ppth,ug/L,ng/L,pg/L,mg/cm2,g/day,g/year,kg/day,kg/month,kg/year,lb/day,lbs/week,lbs/month,lbs/year,mg/day,mg/kg,ug/kg,ng/g,ulbs/day,ug/day,t/day","Base/Neutrals and Acids by GC/MS [E625.1];Data Unavailable [DU]"]
["Single Sample Maximum",null,null,"SW7130","Cadmium (AA, Direct Aspiration) [SW7130]",null,null,null,null,null,null,"DBZD33","3,3-Dichlorobenzidine",null,null,null,null,null,null,null,null,"3,3-Dichlorobenzidine","kg/L,g/L,mg/L,ppth,ug/L,ng/L,pg/L,mg/cm2,g/day,g/year,kg/day,kg/month,kg/year,lb/day,lbs/week,lbs/month,lbs/year,mg/day,mg/kg,ug/kg,ng/g,ulbs/day,ug/day,t/day","Extractable Priority Pollutants [E625];Extractable Priority Pollutants by GC/MS SIM [E625SIM];GC/MS SIM Method [SIM];HISTORICAL: Semivolatile Organic Compounds by GC/MS [SW8270];HISTORICAL: Semivolatile Organic Compounds by GC/MS [SW8270A];Organochlorine Pesticides and PCBs [E608];Organochlorine Pesticides by Gas Chromatography [SW8081A];Phenols by Gas Chromatography [SW8040A];Polynuclear Aromatic Hydrocarbons [E610];Semivolatile Organic Compounds by GC/MS - Open Scan [8270COS];Semivolatile Organic Compounds by GC/MS [SW8270C];Semivolatile Organic Compounds by Isotope Dilution GCMS [E1625C];Semivolatile Organic Compounds by SPE & GC/MS [E526];Volatile Organic Compounds by GC/MS [SW8260B];Volatile Organic Compounds by GC/MS SIM [8260SIM];Volatile Organic Compounds EPA Method 624 [E624];Base/Neutrals and Acids by GC/MS [E625.1];Data Unavailable [DU]"]
["Six-Month Median (6MMED)",null,null,"SW7131A","Cadmium (AA, Furnace Technique) [SW7131A]",null,null,null,null,null,null,"DNA35","3,5-Dinitroaniline",null,null,null,null,null,null,null,null,"3,5-Dinitroaniline","kg/L,g/L,mg/L,ppth,ug/L,ng/L,pg/L,mg/cm2,g/day,g/year,kg/day,kg/month,kg/year,lb/day,lbs/week,lbs/month,lbs/year,mg/day,mg/kg,ug/kg,ng/g,ulbs/day,ug/day,t/day","Nitroaromatics, Nitramines, and Nitrate Esters by HPLC [SW8330B];Data Unavailable [DU]"]
["Weekly Average (Mean)",null,null,"CL213.2","Cadmium (AA, Furnace) - modified for CLP [CL213.2]",null,null,null,null,null,null,"MEPH34CO","3-Methylphenol/4-Methylphenol Coelution",null,null,null,null,null,null,null,null,"3-Methylphenol/4-Methylphenol Coelution","kg/L,g/L,mg/L,ppth,ug/L,ng/L,pg/L,mg/cm2,g/day,g/year,kg/day,kg/month,kg/year,lb/day,lbs/week,lbs/month,lbs/year,mg/day,mg/kg,ug/kg,ng/g,ulbs/day,ug/day,t/day","Extractable Priority Pollutants [E625];Semivolatile Organic Compounds by GC/MS [SW8270C];Data Unavailable [DU]"]
["Weekly Average of Daily Averages",null,null,"E213.2","Cadmium (AA, Furnace) [E213.2]",null,null,null,null,null,null,"NO2ANIL3","3-Nitroaniline",null,null,null,null,null,null,null,null,"3-Nitroaniline","kg/L,g/L,mg/L,ppth,ug/L,ng/L,pg/L,mg/cm2,g/day,g/year,kg/day,kg/month,kg/year,lb/day,lbs/week,lbs/month,lbs/year,mg/day,mg/kg,ug/kg,ng/g,ulbs/day,ug/day,t/day","Extractable Priority Pollutants [E625];GC/MS SIM Method [SIM];Organochlorine Pesticides and PCBs [E608];Semivolatile Organic Compounds by GC/MS [SW8270C];Data Unavailable [DU]"]
["Weekly Average of Daily Maximums",null,null,"CL215.1","Calcium (AA, Direct Aspiration) - modified for CLP [CL215.1]",null,null,null,null,null,null,"NBZME3","3-Nitrotoluene",null,null,null,null,null,null,null,null,"3-Nitrotoluene","kg/L,g/L,mg/L,ppth,ug/L,ng/L,pg/L,mg/cm2,g/day,g/year,kg/day,kg/month,kg/year,lb/day,lbs/week,lbs/month,lbs/year,mg/day,mg/kg,ug/kg,ng/g,ulbs/day,ug/day,t/day","Nitroaromatics, Nitramines, and Nitrate Esters by HPLC [SW8330B];Data Unavailable [DU]"]
["Weekly Discharge",null,null,"E215.1","Calcium (AA, Direct Aspiration) [E215.1]",null,null,null,null,null,null,"3:3FTCA","4,4,5,5,6,6,6-Heptafluorohexanoic Acid",null,null,null,null,null,null,null,null,"4,4,5,5,6,6,6-Heptafluorohexanoic Acid","kg/L,g/L,mg/L,ppth,ug/L,ng/L,pg/L,mg/cm2,g/day,g/year,kg/day,kg/month,kg/year,lb/day,lbs/week,lbs/month,lbs/year,mg/day,mg/kg,ug/kg,ng/g,ulbs/day,ug/day,t/day","Data Unavailable [DU]"]
["Weekly Geometric Mean",null,null,"SW7140","Calcium (AA, Direct Aspiration) [SW7140]",null,null,null,null,null,null,"DDD44","4,4-DDD",null,null,null,null,null,null,null,null,"4,4-DDD","kg/L,g/L,mg/L,ppth,ug/L,ng/L,pg/L,mg/cm2,g/day,g/year,kg/day,kg/month,kg/year,lb/day,lbs/week,lbs/month,lbs/year,mg/day,mg/kg,ug/kg,ng/g,ulbs/day,ug/day,t/day","Chlorinated Pesticides in Groundwater [E508];Extractable Priority Pollutants [E625];Extractable Priority Pollutants by GC/MS SIM [E625SIM];GC/MS SIM Method [SIM];HISTORICAL: Organochlorine Pesticides & PCBs as Aroclors by GC [SW8081];HISTORICAL: Organochlorine Pesticides and PCBs [SW8080];Organochlorine Pesticides and PCBs [E608];Organochlorine Pesticides and PCBs by GC/HSD [E608.3];Organochlorine Pesticides by Gas Chromatography [SW8081A];Semivolatile Organic Compounds by GC/MS [SW8270C];Semivolatile Organic Compounds by Isotope Dilution GCMS [E1625C];Volatile Organic Compounds by GC/MS SIM [8260SIM];Data Unavailable [DU]"]
[null,null,null,"E215.2","Calcium (Titrimetric, EDTA ) [E215.2]",null,null,null,null,null,null,"DDE44","4,4-DDE",null,null,null,null,null,null,null,null,"4,4-DDE","kg/L,g/L,mg/L,ppth,ug/L,ng/L,pg/L,mg/cm2,g/day,g/year,kg/day,kg/month,kg/year,lb/day,lbs/week,lbs/month,lbs/year,mg/day,mg/kg,ug/kg,ng/g,ulbs/day,ug/day,t/day","Chlorinated Pesticides in Groundwater [E508];Extractable Priority Pollutants [E625];Extractable Priority Pollutants by GC/MS SIM [E625SIM];GC/MS SIM Method [SIM];HISTORICAL: Organochlorine Pesticides & PCBs as Aroclors by GC [SW8081];HISTORICAL: Organochlorine Pesticides and PCBs [SW8080];Organochlorine Pesticides and PCBs [E608];Organochlorine Pesticides and PCBs by GC/HSD [E608.3];Organochlorine Pesticides by Gas Chromatography [SW8081A];Semivolatile Organic Compounds by GC/MS [SW8270C];Semivolatile Organic Compounds by Isotope Dilution GCMS [E1625C];Volatile Organic Compounds by GC/MS SIM [8260SIM];Data Unavailable [DU]"]
[null,null,null,"A203","Calcium Carbonate Saturation [A203]",null,null,null,null,null,null,"DDT44","4,4-DDT",null,null,null,null,null,null,null,null,"4,4-DDT","kg/L,g/L,mg/L,ppth,ug/L,ng/L,pg/L,mg/cm2,g/day,g/year,kg/day,kg/month,kg/year,lb/day,lbs/week,lbs/month,lbs/year,mg/day,mg/kg,ug/kg,ng/g,ulbs/day,ug/day,t/day","Chlorinated Pesticides in Groundwater [E508];Extractable Priority Pollutants [E625];Extractable Priority Pollutants by GC/MS SIM [E625SIM];GC/MS SIM Method [SIM];HISTORICAL: Organochlorine Pesticides & PCBs as Aroclors by GC [SW8081];HISTORICAL: Organochlorine Pesticides and PCBs [SW8080];Organochlorine Pesticides and PCBs [E608];Organochlorine Pesticides and PCBs by GC/HSD [E608.3];Organochlorine Pesticides by Gas Chromatography [SW8081A];Semivolatile Organic Compounds by GC/MS [SW8270C];Semivolatile Organic Compounds by Isotope Dilution GCMS [E1625C];Volatile Organic Compounds by GC/MS SIM [8260SIM];Data Unavailable [DU]"]
[null,null,null,"CALCVAL","Calculated Value [CALCVAL]",null,null,null,null,null,null,"DN46M","4,6-Dinitro-2-methylphenol",null,null,null,null,null,null,null,null,"4,6-Dinitro-2-methylphenol","kg/L,g/L,mg/L,ppth,ug/L,ng/L,pg/L,mg/cm2,g/day,g/year,kg/day,kg/month,kg/year,lb/day,lbs/week,lbs/month,lbs/year,mg/day,mg/kg,ug/kg,ng/g,ulbs/day,ug/day,t/day","Extractable Priority Pollutants [E625];Base/Neutrals and Acids by GC/MS [E625.1];Extractable Priority Pollutants by GC/MS SIM [E625SIM];GC/MS SIM Method [SIM];HISTORICAL: Semivolatile Organic Compounds by GC/MS [SW8270];HISTORICAL: Semivolatile Organic Compounds by GC/MS [SW8270A];Organochlorine Pesticides and PCBs [E608];Phenols by Gas Chromatography [SW8040A];Semivolatile Organic Compounds by GC/MS - Open Scan [8270COS];Semivolatile Organic Compounds by GC/MS [SW8270C];Semivolatile Organic Compounds by Isotope Dilution GCMS [E1625C];Semivolatile Organic Compounds by SPE & GC/MS [E526];Volatile Organic Compounds by GC/MS [SW8260B];Volatile Organic Compounds by GC/MS SIM [8260SIM];Volatile Organic Compounds EPA Method 624 [E624];Data Unavailable [DU]"]
[null,null,null,"CALCFE2","Calculation for Ferrous Iron: Total Iron - Ferric Iron [CALCFE2]",null,null,null,null,null,null,"ADONA","4,8-Dioxa-3H-perfluorononanoic acid",null,null,null,null,null,null,null,null,"4,8-Dioxa-3H-perfluorononanoic acid","kg/L,g/L,mg/L,ppth,ug/L,ng/L,pg/L,mg/cm2,g/day,g/year,kg/day,kg/month,kg/year,lb/day,lbs/week,lbs/month,lbs/year,mg/day,mg/kg,ug/kg,ng/g,ulbs/day,ug/day,t/day","Data Unavailable [DU]"]
[null,null,null,"CALCNIO","Calculation for Inorganic Nitrogen: NO2 + NO3 + NH3 [CALCNIO]",null,null,null,null,null,null,"4:2FTS","4:2 Fluorotelomer sulfonic acid (1H, 1H, 2H, 2H-Perfluorohexanesulfonic acid)",null,null,null,null,null,null,null,null,"4:2 Fluorotelomer sulfonic acid (1H, 1H, 2H, 2H-Perfluorohexanesulfonic acid)","kg/L,g/L,mg/L,ppth,ug/L,ng/L,pg/L,mg/cm2,g/day,g/year,kg/day,kg/month,kg/year,lb/day,lbs/week,lbs/month,lbs/year,mg/day,mg/kg,ug/kg,ng/g,ulbs/day,ug/day,t/day","Data Unavailable [DU]"]
[null,null,null,"CALCN","Calculation for Total Nitrogen: TKN + NO2 + NO3 [CALCN]",null,null,null,null,null,null,"A4DNT26","4-Amino-2,6-dinitrotoluene",null,null,null,null,null,null,null,null,"4-Amino-2,6-dinitrotoluene","kg/L,g/L,mg/L,ppth,ug/L,ng/L,pg/L,mg/cm2,g/day,g/year,kg/day,kg/month,kg/year,lb/day,lbs/week,lbs/month,lbs/year,mg/day,mg/kg,ug/kg,ng/g,ulbs/day,ug/day,t/day","Nitroaromatics, Nitramines, and Nitrate Esters by HPLC [SW8330B];Data Unavailable [DU]"]
[null,null,null,"CALCCR3","Calculation for Trivalent Chromium: Total Cr - Hexavalent Cr [CALCCR3]",null,null,null,null,null,null,"BR4FBZ","4-Bromofluorobenzene",null,null,null,null,null,null,null,null,"4-Bromofluorobenzene","kg/L,g/L,mg/L,ppth,ug/L,ng/L,pg/L,mg/cm2,g/day,g/year,kg/day,kg/month,kg/year,lb/day,lbs/week,lbs/month,lbs/year,mg/day,mg/kg,ug/kg,ng/g,ulbs/day,ug/day,t/day","Extractable Priority Pollutants [E625];Non-Halogenated Organics Using GC/FID [SW8015B];Volatile Organic Compounds by GC/MS [SW8260B];Volatile Organic Compounds by Purge and Trap [E524.2];Volatile Organic Compounds EPA Method 624 [E624];Purgeables by GC/MS [E624.1];Data Unavailable [DU]"]
[null,null,null,"AB1803","California DHS Method for EDB and DBCP in Water [AB1803]",null,null,null,null,null,null,"BPPE4","4-Bromophenyl Phenyl Ether",null,null,null,null,null,null,null,null,"4-Bromophenyl Phenyl Ether","kg/L,g/L,mg/L,ppth,ug/L,ng/L,pg/L,mg/cm2,g/day,g/year,kg/day,kg/month,kg/year,lb/day,lbs/week,lbs/month,lbs/year,mg/day,mg/kg,ug/kg,ng/g,ulbs/day,ug/day,t/day","Extractable Priority Pollutants [E625];Extractable Priority Pollutants by GC/MS SIM [E625SIM];GC/MS SIM Method [SIM];HISTORICAL: Semivolatile Organic Compounds by GC/MS [SW8270];HISTORICAL: Semivolatile Organic Compounds by GC/MS [SW8270A];Semivolatile Organic Compounds by GC/MS - Open Scan [8270COS];Semivolatile Organic Compounds by GC/MS [SW8270C];Semivolatile Organic Compounds by Isotope Dilution GCMS [E1625C];Volatile Organic Compounds by GC/MS [SW8260B];Volatile Organic Compounds by GC/MS SIM [8260SIM];Base/Neutrals and Acids by GC/MS [E625.1];Data Unavailable [DU]"]
[null,null,null,"CA410A","CARB Method 410A-Determination of Benzene from Stationary Sources [CA410A]",null,null,null,null,null,null,"C4M3PH","4-Chloro-3-methylphenol",null,null,null,null,null,null,null,null,"4-Chloro-3-methylphenol","kg/L,g/L,mg/L,ppth,ug/L,ng/L,pg/L,mg/cm2,g/day,g/year,kg/day,kg/month,kg/year,lb/day,lbs/week,lbs/month,lbs/year,mg/day,mg/kg,ug/kg,ng/g,ulbs/day,ug/day,t/day","Extractable Priority Pollutants [E625];Base/Neutrals and Acids by GC/MS [E625.1];Extractable Priority Pollutants by GC/MS SIM [E625SIM];HISTORICAL: Semivolatile Organic Compounds by GC/MS [SW8270];HISTORICAL: Semivolatile Organic Compounds by GC/MS [SW8270A];Organochlorine Pesticides by Gas Chromatography [SW8081A];Phenols by Gas Chromatography [SW8040A];Semivolatile Organic Compounds by GC/MS - Open Scan [8270COS];Semivolatile Organic Compounds by GC/MS [SW8270C];Semivolatile Organic Compounds by Isotope Dilution GCMS [E1625C];Volatile Organic Compounds by GC/MS [SW8260B];Volatile Organic Compounds by GC/MS SIM [8260SIM];Data Unavailable [DU]"]
[null,null,null,"E556","Carbonyl Compounds by GC/MS [E556]",null,null,null,null,null,null,"CLANIL4","4-Chloroaniline",null,null,null,null,null,null,null,null,"4-Chloroaniline","kg/L,g/L,mg/L,ppth,ug/L,ng/L,pg/L,mg/cm2,g/day,g/year,kg/day,kg/month,kg/year,lb/day,lbs/week,lbs/month,lbs/year,mg/day,mg/kg,ug/kg,ng/g,ulbs/day,ug/day,t/day","Extractable Priority Pollutants [E625];GC/MS SIM Method [SIM];Semivolatile Organic Compounds by GC/MS [SW8270C];Data Unavailable [DU]"]
[null,null,null,"E554","Carbonyl Compounds in Drinking Water by DD & HPLC [E554]",null,null,null,null,null,null,"CPPE4","4-Chlorophenyl Phenyl Ether",null,null,null,null,null,null,null,null,"4-Chlorophenyl Phenyl Ether","kg/L,g/L,mg/L,ppth,ug/L,ng/L,pg/L,mg/cm2,g/day,g/year,kg/day,kg/month,kg/year,lb/day,lbs/week,lbs/month,lbs/year,mg/day,mg/kg,ug/kg,ng/g,ulbs/day,ug/day,t/day","Extractable Priority Pollutants [E625];Extractable Priority Pollutants by GC/MS SIM [E625SIM];GC/MS SIM Method [SIM];HISTORICAL: Semivolatile Organic Compounds by GC/MS [SW8270];HISTORICAL: Semivolatile Organic Compounds by GC/MS [SW8270A];Semivolatile Organic Compounds by GC/MS - Open Scan [8270COS];Semivolatile Organic Compounds by GC/MS [SW8270C];Semivolatile Organic Compounds by Isotope Dilution GCMS [E1625C];Volatile Organic Compounds by GC/MS [SW8260B];Volatile Organic Compounds by GC/MS SIM [8260SIM];Base/Neutrals and Acids by GC/MS [E625.1];Data Unavailable [DU]"]
[null,null,null,"MSACAT","Cation Exchange Capacity & Exchange Coefficients [MSACAT]",null,null,null,null,null,null,"CLBZME4","4-Chlorotoluene",null,null,null,null,null,null,null,null,"4-Chlorotoluene","kg/L,g/L,mg/L,ppth,ug/L,ng/L,pg/L,mg/cm2,g/day,g/year,kg/day,kg/month,kg/year,lb/day,lbs/week,lbs/month,lbs/year,mg/day,mg/kg,ug/kg,ng/g,ulbs/day,ug/day,t/day","GC/MS SIM Method [SIM];HISTORICAL: Volatile Organic Compounds by GC/MS [SW8260];Semivolatile Organic Compounds by GC/MS [SW8270C];Volatile Organic Compounds by GC/MS [SW8260B];Data Unavailable [DU]"]
[null,null,null,"PCPTW","Chau & Coburn, Determ. of Pentachlorophenol in Water [PCPTW]",null,null,null,null,null,null,"MIBC","4-Methyl-2-pentanol",null,null,null,null,null,null,null,null,"4-Methyl-2-pentanol","kg/L,g/L,mg/L,ppth,ug/L,ng/L,pg/L,mg/cm2,g/day,g/year,kg/day,kg/month,kg/year,lb/day,lbs/week,lbs/month,lbs/year,mg/day,mg/kg,ug/kg,ng/g,ulbs/day,ug/day,t/day","Halogenated Volatile Organics by Headspace [3810HVO];Volatile Organic Compounds by GC/MS [SW8260B];Data Unavailable [DU]"]
[null,null,null,"E410.4","Chemical Oxygen Demand - Colorimetric [E410.4]",null,null,null,null,null,null,"MIBK","4-Methyl-2-pentanone",null,null,null,null,null,null,null,null,"4-Methyl-2-pentanone","kg/L,g/L,mg/L,ppth,ug/L,ng/L,pg/L,mg/cm2,g/day,g/year,kg/day,kg/month,kg/year,lb/day,lbs/week,lbs/month,lbs/year,mg/day,mg/kg,ug/kg,ng/g,ulbs/day,ug/day,t/day","Halogenated Volatile Organics by Headspace [3810HVO];HISTORICAL: Volatile Organic Compounds by GC/MS [SW8260];Semivolatile Organic Compounds by GC/MS [SW8270C];Volatile Organic Compounds by GC/MS [SW8260B];Volatile Organic Compounds EPA Method 624 [E624];Purgeables by GC/MS [E624.1];Data Unavailable [DU]"]
[null,null,null,"E410.1","Chemical Oxygen Demand [E410.1]",null,null,null,null,null,null,"MEPH4","4-Methylphenol",null,null,null,null,null,null,null,null,"4-Methylphenol","kg/L,g/L,mg/L,ppth,ug/L,ng/L,pg/L,mg/cm2,g/day,g/year,kg/day,kg/month,kg/year,lb/day,lbs/week,lbs/month,lbs/year,mg/day,mg/kg,ug/kg,ng/g,ulbs/day,ug/day,t/day","Extractable Priority Pollutants [E625];HISTORICAL: Semivolatile Organic Compounds by GC/MS [SW8270];Semivolatile Organic Compounds by GC/MS [SW8270C];Volatile Organic Compounds by GC/MS [SW8260B];Data Unavailable [DU]"]
[null,null,null,"E410.2","Chemical Oxygen Demand [E410.2]",null,null,null,null,null,null,"NO2ANIL4","4-Nitroaniline",null,null,null,null,null,null,null,null,"4-Nitroaniline","kg/L,g/L,mg/L,ppth,ug/L,ng/L,pg/L,mg/cm2,g/day,g/year,kg/day,kg/month,kg/year,lb/day,lbs/week,lbs/month,lbs/year,mg/day,mg/kg,ug/kg,ng/g,ulbs/day,ug/day,t/day","Extractable Priority Pollutants [E625];GC/MS SIM Method [SIM];Semivolatile Organic Compounds by GC/MS [SW8270C];Data Unavailable [DU]"]
[null,null,null,"E410","Chemical Oxygen Demand [E410]",null,null,null,null,null,null,"NTPH4","4-Nitrophenol",null,null,null,null,null,null,null,null,"4-Nitrophenol","kg/L,g/L,mg/L,ppth,ug/L,ng/L,pg/L,mg/cm2,g/day,g/year,kg/day,kg/month,kg/year,lb/day,lbs/week,lbs/month,lbs/year,mg/day,mg/kg,ug/kg,ng/g,ulbs/day,ug/day,t/day","Acute Toxicity Test with Effluents and Receiving Waters [E2019];Chlorinated Herbicides by GC [SW8151A];Extractable Priority Pollutants [E625];Base/Neutrals and Acids by GC/MS [E625.1];Extractable Priority Pollutants by GC/MS SIM [E625SIM];GC/MS SIM Method [SIM];HISTORICAL: Semivolatile Organic Compounds by GC/MS [SW8270];HISTORICAL: Semivolatile Organic Compounds by GC/MS [SW8270A];Phenols by Gas Chromatography [SW8040A];Semivolatile Organic Compounds by GC/MS - Open Scan [8270COS];Semivolatile Organic Compounds by GC/MS [SW8270C];Semivolatile Organic Compounds by Isotope Dilution GCMS [E1625C];Volatile Organic Compounds by GC/MS [SW8260B];Volatile Organic Compounds by GC/MS SIM [8260SIM];Volatile Organic Compounds EPA Method 624 [E624];Data Unavailable [DU]"]
[null,null,null,"E325.3M","Chloride (as CI) Modified [E325.3M]",null,null,null,null,null,null,"NBZME4","4-Nitrotoluene",null,null,null,null,null,null,null,null,"4-Nitrotoluene","kg/L,g/L,mg/L,ppth,ug/L,ng/L,pg/L,mg/cm2,g/day,g/year,kg/day,kg/month,kg/year,lb/day,lbs/week,lbs/month,lbs/year,mg/day,mg/kg,ug/kg,ng/g,ulbs/day,ug/day,t/day","Nitroaromatics, Nitramines, and Nitrate Esters by HPLC [SW8330B];Data Unavailable [DU]"]
[null,null,null,"E325.1","Chloride (as Cl) [E325.1]",null,null,null,null,null,null,"6:2FTS","6:2 Fluorotelomer sulfonic acid (1H,1H,2H,2H-Perfluorooctanesulfonic acid)",null,null,null,null,null,null,null,null,"6:2 Fluorotelomer sulfonic acid (1H,1H,2H,2H-Perfluorooctanesulfonic acid)",{"$f":"$AG$8","v":"kg/L,g/L,mg/L,ppth,ug/L,ng/L,pg/L,mg/cm2,g/day,g/year,kg/day,kg/month,kg/year,lb/day,lbs/week,lbs/month,lbs/year,mg/day,mg/kg,ug/kg,ng/g,ulbs/day,ug/day,t/day"},"Data Unavailable [DU]"]
[null,null,null,"E325.2","Chloride (as Cl) [E325.2]",null,null,null,null,null,null,"8:2FTS","8:2 Fluorotelomer sulfonic acid (1H, 1H, 2H, 2H-Perfluorodecanesulfonic acid)",null,null,null,null,null,null,null,null,"8:2 Fluorotelomer sulfonic acid (1H, 1H, 2H, 2H-Perfluorodecanesulfonic acid)","kg/L,g/L,mg/L,ppth,ug/L,ng/L,pg/L,mg/cm2,g/day,g/year,kg/day,kg/month,kg/year,lb/day,lbs/week,lbs/month,lbs/year,mg/day,mg/kg,ug/kg,ng/g,ulbs/day,ug/day,t/day","Data Unavailable [DU]"]
[null,null,null,"E325.3","Chloride (as Cl) [E325.3]",null,null,null,null,null,null,"9CLPF3ONS","9-Chlorohexadecafluoro-3-oxanonane-1-sulfonic acid",null,null,null,null,null,null,null,null,"9-Chlorohexadecafluoro-3-oxanonane-1-sulfonic acid","kg/L,g/L,mg/L,ppth,ug/L,ng/L,pg/L,mg/cm2,g/day,g/year,kg/day,kg/month,kg/year,lb/day,lbs/week,lbs/month,lbs/year,mg/day,mg/kg,ug/kg,ng/g,ulbs/day,ug/day,t/day","Data Unavailable [DU]"]
[null,null,null,"E325.2M","Chloride (as Cl) Modified [E325.2M]",null,null,null,null,null,null,"ACNP","Acenaphthene",null,null,null,null,null,null,null,null,"Acenaphthene","kg/L,g/L,mg/L,ppth,ug/L,ng/L,pg/L,mg/cm2,g/day,g/year,kg/day,kg/month,kg/year,lb/day,lbs/week,lbs/month,lbs/year,mg/day,mg/kg,ug/kg,ng/g,ulbs/day,ug/day,t/day","Extractable Priority Pollutants [E625];Extractable Priority Pollutants by GC/MS SIM [E625SIM];GC/MS SIM Method [SIM];HISTORICAL: Semivolatile Organic Compounds by GC/MS [SW8270];HISTORICAL: Semivolatile Organic Compounds by GC/MS [SW8270A];Polynuclear Aromatic Hydrocarbons [E610];Semivolatile Organic Compounds by GC/MS - Open Scan [8270COS];Semivolatile Organic Compounds by GC/MS [SW8270C];Semivolatile Organic Compounds by GC/MS SIM [8270SIM];Semivolatile Organic Compounds by Isotope Dilution GCMS [E1625C];Volatile Organic Compounds by GC/MS [SW8260B];Volatile Organic Compounds by GC/MS SIM [8260SIM];Base/Neutrals and Acids by GC/MS [E625.1];Data Unavailable [DU]"]
[null,null,null,"SW9252","Chloride (Titrimetric, Mercuric Nitrate) [SW9252]",null,null,null,null,null,null,"ACNPD10","Acenaphthene-d10",null,null,null,null,null,null,null,null,"Acenaphthene-d10","kg/L,g/L,mg/L,ppth,ug/L,ng/L,pg/L,mg/cm2,g/day,g/year,kg/day,kg/month,kg/year,lb/day,lbs/week,lbs/month,lbs/year,mg/day,mg/kg,ug/kg,ng/g,ulbs/day,ug/day,t/day","Extractable Priority Pollutants [E625];Extractable Priority Pollutants by GC/MS SIM [E625SIM];GC/MS SIM Method [SIM];HISTORICAL: Semivolatile Organic Compounds by GC/MS [SW8270];HISTORICAL: Semivolatile Organic Compounds by GC/MS [SW8270A];Polynuclear Aromatic Hydrocarbons [E610];Semivolatile Organic Compounds by GC/MS - Open Scan [8270COS];Semivolatile Organic Compounds by GC/MS [SW8270C];Semivolatile Organic Compounds by GC/MS SIM [8270SIM];Semivolatile Organic Compounds by Isotope Dilution GCMS [E1625C];Volatile Organic Compounds by GC/MS [SW8260B];Volatile Organic Compounds by GC/MS SIM [8260SIM];Data Unavailable [DU]"]
[null,null,null,"SW9253","Chloride (Titrimetric, Silver Nitrate) [SW9253]",null,null,null,null,null,null,"ACNPY","Acenaphthylene",null,null,null,null,null,null,null,null,"Acenaphthylene","kg/L,g/L,mg/L,ppth,ug/L,ng/L,pg/L,mg/cm2,g/day,g/year,kg/day,kg/month,kg/year,lb/day,lbs/week,lbs/month,lbs/year,mg/day,mg/kg,ug/kg,ng/g,ulbs/day,ug/day,t/day","Extractable Priority Pollutants [E625];Extractable Priority Pollutants by GC/MS SIM [E625SIM];GC/MS SIM Method [SIM];HISTORICAL: Semivolatile Organic Compounds by GC/MS [SW8270];HISTORICAL: Semivolatile Organic Compounds by GC/MS [SW8270A];Organic Compounds in Drinking Water by LSE & CCGC/MS [E525.2];Polynuclear Aromatic Hydrocarbons [E610];Semivolatile Organic Compounds by GC/MS - Open Scan [8270COS];Semivolatile Organic Compounds by GC/MS [SW8270C];Semivolatile Organic Compounds by GC/MS SIM [8270SIM];Semivolatile Organic Compounds by Isotope Dilution GCMS [E1625C];Volatile Organic Compounds by GC/MS SIM [8260SIM];Base/Neutrals and Acids by GC/MS [E625.1];Data Unavailable [DU]"]
[null,null,null,"E515.3","Chlorinated Acids in Water by LLE [E515.3]",null,null,null,null,null,null,"ACETALD","Acetaldehyde",null,null,null,null,null,null,null,null,"Acetaldehyde","kg/L,g/L,mg/L,ppth,ug/L,ng/L,pg/L,mg/cm2,g/day,g/year,kg/day,kg/month,kg/year,lb/day,lbs/week,lbs/month,lbs/year,mg/day,mg/kg,ug/kg,ng/g,ulbs/day,ug/day,t/day","Carbonyl Compounds by GC/MS [E556];Data Unavailable [DU]"]
[null,null,null,"E515.4","Chlorinated Acids in Water by LLME [E515.4]",null,null,null,null,null,null,"ACETICACID","Acetic acid",null,null,null,null,null,null,null,null,"Acetic acid","kg/L,g/L,mg/L,ppth,ug/L,ng/L,pg/L,mg/cm2,g/day,g/year,kg/day,kg/month,kg/year,lb/day,lbs/week,lbs/month,lbs/year,mg/day,mg/kg,ug/kg,ng/g,ulbs/day,ug/day,t/day","Data Unavailable [DU]"]
[null,null,null,"E515.2","Chlorinated Acids in Water by LSE & GC/ECD [E515.2]",null,null,null,null,null,null,"ACE","Acetone",null,null,null,null,null,null,null,null,"Acetone","kg/L,g/L,mg/L,ppth,ug/L,ng/L,pg/L,mg/cm2,g/day,g/year,kg/day,kg/month,kg/year,lb/day,lbs/week,lbs/month,lbs/year,mg/day,mg/kg,ug/kg,ng/g,ulbs/day,ug/day,t/day","Extractable Priority Pollutants [E625];GC/MS SIM Method [SIM];HISTORICAL: Volatile Organic Compounds by GC/MS [SW8260];Semivolatile Organic Compounds by GC/MS [SW8270C];Standard Method 5550 B: Tannin and Lignin [A5550B];Volatile Organic Compounds by GC/MS [SW8260B];Volatile Organic Compounds EPA Method 624 [E624];Purgeables by GC/MS [E624.1];Data Unavailable [DU]"]
[null,null,null,"E551.1","Chlorinated and Halogenated Compounds by L-L Extraction, GC/ECD [E551.1]",null,null,null,null,null,null,"ASAL","Acid-Soluble Aluminum",null,null,null,null,null,null,null,null,"Acid-Soluble Aluminum","kg/L,g/L,mg/L,ppth,ug/L,ng/L,pg/L,mg/cm2,g/day,g/year,kg/day,kg/month,kg/year,lb/day,lbs/week,lbs/month,lbs/year,mg/day,mg/kg,ug/kg,ng/g,ulbs/day,ug/day,t/day","Aluminum (AA, Direct Aspiration) [E202.1];Aluminum (AA, Furnace Technique) [E202.2];Inductively Coupled Plasma Emission - modified for CLP [CL200.7];Inductively Coupled Plasma Emission [E200.7];Inductively Coupled Plasma/Mass Spectroscopy [E200.8];Atomic Absorption, Platform [E200.9];HISTORICAL: Inductively Coupled Plasma-Emission [SW6010];Inductively Coupled Plasma-Atomic Emission Spectroscopy [SW6010B];Inductively Coupled Plasma-Mass Spectrometry [SW6020];Metals by Atomic Absorption [E200.0];Standard Method (19th) 3113: Metals by Furnace AAS [A3113B];Data Unavailable [DU]"]
[null,null,null,"E1668C","Chlorinated Biphenyl Congeners in Multiple Matrices by HRGC/HRMS (2010) [E1668C]",null,null,null,null,null,null,"AVS","Acid-Volatile Sulfide",null,null,null,null,null,null,null,null,"Acid-Volatile Sulfide","kg/L,g/L,mg/L,ppth,ug/L,ng/L,pg/L,mg/cm2,g/day,g/year,kg/day,kg/month,kg/year,lb/day,lbs/week,lbs/month,lbs/year,mg/day,mg/kg,ug/kg,ng/g,ulbs/day,ug/day,t/day","Determination of Acid Volatile Sulfides and Simultaneously Extractable Metals (EPA-821-R-91-100);Data Unavailable [DU]"]
[null,null,null,"E1668A","Chlorinated Biphenyl Congeners in Multiple Matrices by HRGC/HRMS [E1668A]",null,null,null,null,null,null,"ACRL","Acrolein",null,null,null,null,null,null,null,null,"Acrolein","kg/L,g/L,mg/L,ppth,ug/L,ng/L,pg/L,mg/cm2,g/day,g/year,kg/day,kg/month,kg/year,lb/day,lbs/week,lbs/month,lbs/year,mg/day,mg/kg,ug/kg,ng/g,ulbs/day,ug/day,t/day","Extractable Priority Pollutants [E625];Extractable Priority Pollutants by GC/MS SIM [E625SIM];GC/MS SIM Method [SIM];HISTORICAL: Volatile Organic Compounds by GC/MS [SW8260];Volatile Organic Compounds by GC/MS - Open Scan [8260BOS];Volatile Organic Compounds by GC/MS [SW8260B];Volatile Organic Compounds EPA Method 624 [E624];Purgeables by GC/MS [E624.1];Data Unavailable [DU]"]
[null,null,null,"E615","Chlorinated Herbicides [E615]",null,null,null,null,null,null,"ACRAMD","Acrylonitrile",null,null,null,null,null,null,null,null,"Acrylonitrile","kg/L,g/L,mg/L,ppth,ug/L,ng/L,pg/L,mg/cm2,g/day,g/year,kg/day,kg/month,kg/year,lb/day,lbs/week,lbs/month,lbs/year,mg/day,mg/kg,ug/kg,ng/g,ulbs/day,ug/day,t/day","Extractable Priority Pollutants [E625];Extractable Priority Pollutants by GC/MS SIM [E625SIM];GC/MS SIM Method [SIM];HISTORICAL: Volatile Organic Compounds by GC/MS [SW8260];Organochlorine Pesticides and PCBs [E608];Organochlorine Pesticides by Gas Chromatography [SW8081A];Semivolatile Organic Compounds by SPE & GC/MS [E526];Volatile Organic Compounds by GC/MS - Open Scan [8260BOS];Volatile Organic Compounds by GC/MS [SW8260B];Volatile Organic Compounds EPA Method 624 [E624];Purgeables by GC/MS [E624.1];Data Unavailable [DU]"]
[null,null,null,"SW8150A","Chlorinated Herbicides by GC [SW8150A]",null,null,null,null,null,null,"AC-227","Actinium-227",null,null,null,null,null,null,null,null,"Actinium-227","PCi/L","Gamm-Emitting Radionuclides in Drinking Water;Data Unavailable [DU]"]
[null,null,null,"SW8151A","Chlorinated Herbicides by GC [SW8151A]",null,null,null,null,null,null,"ACBANSHINS","Acute Toxicity-Bannerfin shiner-survival",null,null,null,null,null,null,null,null,"Acute Toxicity-Bannerfin shiner-survival","% effect,% survival,Pass/Fail (Pass = 0; Fail = 1),TUa","Acute Toxicity of Effluents/Receiving Water to Fresh Water and Marine Organisms (EPA-821-R-02-012) [E821012];Data Unavailable [DU]"]
[null,null,null,"E508","Chlorinated Pesticides in Groundwater [E508]",null,null,null,null,null,null,"ACBRTROUTS","Acute Toxicity-Brook Trout-survival",null,null,null,null,null,null,null,null,"Acute Toxicity-Brook Trout-survival","% effect,% survival,Pass/Fail (Pass = 0; Fail = 1),TUa","Acute Toxicity of Effluents/Receiving Water to Fresh Water and Marine Organisms (EPA-821-R-02-012) [E821012];Data Unavailable [DU]"]
[null,null,null,"E508.1","Chlorinated Pests., Herbs., & Organohalides by LSE & ECGC [E508.1]",null,null,null,null,null,null,"ACCDUBIAS","Acute Toxicity-C.dubia-survival",null,null,null,null,null,null,null,null,"Acute Toxicity-C.dubia-survival","% effect,% survival,Pass/Fail (Pass = 0; Fail = 1),TUa","Acute Toxicity of Effluents/Receiving Water to Fresh Water and Marine Organisms (EPA-821-R-02-012) [E821012];Data Unavailable [DU]"]
[null,null,null,"E330.5","Chlorine, Total Residual (Spectrophotometric, DPD) [E330.5]",null,null,null,null,null,null,"ACDMAGNADPS","Acute Toxicity-D.magna and D. pulex-survival",null,null,null,null,null,null,null,null,"Acute Toxicity-D.magna and D. pulex-survival","% effect,% survival,Pass/Fail (Pass = 0; Fail = 1),TUa","Acute Toxicity of Effluents/Receiving Water to Fresh Water and Marine Organisms (EPA-821-R-02-012) [E821012];Data Unavailable [DU]"]
[null,null,null,"E330.2","Chlorine, Total Residual (Titrimetric, Back, Iodometric) [E330.2]",null,null,null,null,null,null,"ACFATMINNOWS","Acute Toxicity-Fathead Minnow-survival",null,null,null,null,null,null,null,null,"Acute Toxicity-Fathead Minnow-survival","% effect,% survival,Pass/Fail (Pass = 0; Fail = 1),TUa","Acute Toxicity of Effluents/Receiving Water to Fresh Water and Marine Organisms (EPA-821-R-02-012) [E821012];Data Unavailable [DU]"]
[null,null,null,"E330.4","Chlorine, Total Residual (Titrimetric, DPD-FAS) [E330.4]",null,null,null,null,null,null,"ACHYAZTECAS","Acute Toxicity-Hyalella Azteca -survival.",null,null,null,null,null,null,null,null,"Acute Toxicity-Hyalella Azteca -survival.","% effect,% survival,Pass/Fail (Pass = 0; Fail = 1),TUa","Acute Toxicity of Effluents/Receiving Water to Fresh Water and Marine Organisms (EPA-821-R-02-012) [E821012];Data Unavailable [DU]"]
[null,null,null,"E330.3","Chlorine, Total Residual (Titrimetric, Iodometric) [E330.3]",null,null,null,null,null,null,"ACMYHCOMBAHS","Acute Toxicity-Mysid, H. costata or M. bahia-survival",null,null,null,null,null,null,null,null,"Acute Toxicity-Mysid, H. costata or M. bahia-survival","% effect,% survival,Pass/Fail (Pass = 0; Fail = 1),TUa","Acute Toxicity of Effluents/Receiving Water to Fresh Water and Marine Organisms (EPA-821-R-02-012) [E821012];Data Unavailable [DU]"]
[null,null,null,"E218.1","Chromium (AA, Direct Aspiration) [E218.1]",null,null,null,null,null,null,"ACRAINTROUTS","Acute Toxicity-Rainbow Trout-survival",null,null,null,null,null,null,null,null,"Acute Toxicity-Rainbow Trout-survival","% effect,% survival,Pass/Fail (Pass = 0; Fail = 1),TUa","Acute Toxicity of Effluents/Receiving Water to Fresh Water and Marine Organisms (EPA-821-R-02-012) [E821012];Data Unavailable [DU]"]
[null,null,null,"SW7190","Chromium (AA, Direct Aspiration) [SW7190]",null,null,null,null,null,null,"ACSHMINNOWS","Acute Toxicity-Sheepshead Minnow-survival",null,null,null,null,null,null,null,null,"Acute Toxicity-Sheepshead Minnow-survival","% effect,% survival,Pass/Fail (Pass = 0; Fail = 1),TUa","Acute Toxicity of Effluents/Receiving Water to Fresh Water and Marine Organisms (EPA-821-R-02-012) [E821012];Data Unavailable [DU]"]
[null,null,null,"SW7191","Chromium (AA, Furnace Technique) [SW7191]",null,null,null,null,null,null,"ACSILVERS","Acute Toxicity-Sliversides-survival",null,null,null,null,null,null,null,null,"Acute Toxicity-Sliversides-survival","% effect,% survival,Pass/Fail (Pass = 0; Fail = 1),TUa","Acute Toxicity of Effluents/Receiving Water to Fresh Water and Marine Organisms (EPA-821-R-02-012) [E821012];Data Unavailable [DU]"]
[null,null,null,"CL218.2","Chromium (AA, Furnace) - modified for CLP [CL218.2]",null,null,null,null,null,null,"ACTOPSMELTS","Acute Toxicity-Topsmelt-survival",null,null,null,null,null,null,null,null,"Acute Toxicity-Topsmelt-survival","% effect,% survival,Pass/Fail (Pass = 0; Fail = 1),TUa","Acute Toxicity of Effluents/Receiving Water to Fresh Water and Marine Organisms (EPA-821-R-02-012) [E821012];Data Unavailable [DU]"]
[null,null,null,"E218.2","Chromium (AA, Furnace) [E218.2]",null,null,null,null,null,null,"HALIDES","Adsorbable Organic Halides (AOX)",null,null,null,null,null,null,null,null,"Adsorbable Organic Halides (AOX)",{"$f":"$AG$8","v":"kg/L,g/L,mg/L,ppth,ug/L,ng/L,pg/L,mg/cm2,g/day,g/year,kg/day,kg/month,kg/year,lb/day,lbs/week,lbs/month,lbs/year,mg/day,mg/kg,ug/kg,ng/g,ulbs/day,ug/day,t/day"},"Data Unavailable [DU]"]
[null,null,null,"E218.3","Chromium by Chelation - Extraction [E218.3]",null,null,null,null,null,null,"ALACL","Alachlor",null,null,null,null,null,null,null,null,"Alachlor","kg/L,g/L,mg/L,ppth,ug/L,ng/L,pg/L,mg/cm2,g/day,g/year,kg/day,kg/month,kg/year,lb/day,lbs/week,lbs/month,lbs/year,mg/day,mg/kg,ug/kg,ng/g,ulbs/day,ug/day,t/day","Extractable Priority Pollutants [E625];Extractable Priority Pollutants by GC/MS SIM [E625SIM];Nitrogen- & Phosphorus-Containing Pest. in Water by GC [E507];Organic Compounds in Drinking Water by LSE & CCGC/MS [E525.2];Organochlorine Pesticides and PCBs [E608];Data Unavailable [DU]"]
[null,null,null,"E218.4","Chromium Hexavalent (AA, Chelation-Extraction) [E218.4]",null,null,null,null,null,null,"ALDRIN","Aldrin",null,null,null,null,null,null,null,null,"Aldrin","kg/L,g/L,mg/L,ppth,ug/L,ng/L,pg/L,mg/cm2,g/day,g/year,kg/day,kg/month,kg/year,lb/day,lbs/week,lbs/month,lbs/year,mg/day,mg/kg,ug/kg,ng/g,ulbs/day,ug/day,t/day","Chlorinated Pesticides in Groundwater [E508];Extractable Priority Pollutants [E625];Extractable Priority Pollutants by GC/MS SIM [E625SIM];GC/MS SIM Method [SIM];HISTORICAL: Organochlorine Pesticides & PCBs as Aroclors by GC [SW8081];HISTORICAL: Organochlorine Pesticides and PCBs [SW8080];Organochlorine Pesticides and PCBs [E608];Organochlorine Pesticides by Gas Chromatography [SW8081A];Semivolatile Organic Compounds by GC/MS [SW8270C];Semivolatile Organic Compounds by Isotope Dilution GCMS [E1625C];Volatile Organic Compounds by GC/MS [SW8260B];Volatile Organic Compounds by GC/MS SIM [8260SIM];Organochlorine Pesticides and PCBs by GC/HSD [E608.3];Data Unavailable [DU]"]
[null,null,null,"E218.5","Chromium Hexavalent, Dissolved (AA, Furnace) [E218.5]",null,null,null,null,null,null,"ALKB","Alkalinity, Bicarbonate (as CaCO3)",null,null,null,null,null,null,null,null,"Alkalinity, Bicarbonate (as CaCO3)","kg/L,g/L,mg/L,ppth,ug/L,ng/L,pg/L,mg/cm2,g/day,g/year,kg/day,kg/month,kg/year,lb/day,lbs/week,lbs/month,lbs/year,mg/day,mg/kg,ug/kg,ng/g,ulbs/day,ug/day,t/day","Alkalinity, Total (as Carbonate) [E310.1];Alkalinity, Total (as Carbonate) [E310.2];Standard Method (18th & 19th) 2320 B: Alkalinity by Titration [A2320B];Data Unavailable [DU]"]
[null,null,null,"SW7197","Chromium, Hexavalent (Chelation/Extraction) [SW7197]",null,null,null,null,null,null,"ALKC","Alkalinity, Carbonate (as CaCO3)",null,null,null,null,null,null,null,null,"Alkalinity, Carbonate (as CaCO3)","kg/L,g/L,mg/L,ppth,ug/L,ng/L,pg/L,mg/cm2,g/day,g/year,kg/day,kg/month,kg/year,lb/day,lbs/week,lbs/month,lbs/year,mg/day,mg/kg,ug/kg,ng/g,ulbs/day,ug/day,t/day","Alkalinity, Total (as Carbonate) [E310.1];Alkalinity, Total (as Carbonate) [E310.2];Standard Method (18th & 19th) 2320 B: Alkalinity by Titration [A2320B];Data Unavailable [DU]"]
[null,null,null,"SW7196A","Chromium, Hexavalent (Colorimetric) [SW7196A]",null,null,null,null,null,null,"ALKH","Alkalinity, Hydroxide (as CaCO3)",null,null,null,null,null,null,null,null,"Alkalinity, Hydroxide (as CaCO3)","kg/L,g/L,mg/L,ppth,ug/L,ng/L,pg/L,mg/cm2,g/day,g/year,kg/day,kg/month,kg/year,lb/day,lbs/week,lbs/month,lbs/year,mg/day,mg/kg,ug/kg,ng/g,ulbs/day,ug/day,t/day","Alkalinity, Total (as Carbonate) [E310.1];Alkalinity, Total (as Carbonate) [E310.2];Standard Method (18th & 19th) 2320 B: Alkalinity by Titration [A2320B];Data Unavailable [DU]"]
[null,null,null,"SW7195","Chromium, Hexavalent (Coprecipitation) [SW7195]",null,null,null,null,null,null,"ALK","Alkalinity, Total (as CaCO3)",null,null,null,null,null,null,null,null,"Alkalinity, Total (as CaCO3)","kg/L,g/L,mg/L,ppth,ug/L,ng/L,pg/L,mg/cm2,g/day,g/year,kg/day,kg/month,kg/year,lb/day,lbs/week,lbs/month,lbs/year,mg/day,mg/kg,ug/kg,ng/g,ulbs/day,ug/day,t/day","Alkalinity, Total (as Carbonate) [E310.1];Alkalinity, Total (as Carbonate) [E310.2];Standard Method (18th & 19th) 2320 B: Alkalinity by Titration [A2320B];Standard Method 2340 C: Hardness by Calc.-EDTA Titrimetric Method [A2340C];Data Unavailable [DU]"]
[null,null,null,"SW7198","Chromium, Hexavalent (Differential Pulse Polarography) [SW7198]",null,null,null,null,null,null,"CLPE3","Allyl Chloride",null,null,null,null,null,null,null,null,"Allyl Chloride","kg/L,g/L,mg/L,ppth,ug/L,ng/L,pg/L,mg/cm2,g/day,g/year,kg/day,kg/month,kg/year,lb/day,lbs/week,lbs/month,lbs/year,mg/day,mg/kg,ug/kg,ng/g,ulbs/day,ug/day,t/day","Volatile Organic Compounds by GC/MS [SW8260B];Purgeables by GC/MS [E624.1];Data Unavailable [DU]"]
[null,null,null,"SW7199","Chromium, Hexavalent (Ion Chromatography) [SW7199]",null,null,null,null,null,null,"BHCALPHA","alpha-BHC",null,null,null,null,null,null,null,null,"alpha-BHC","kg/L,g/L,mg/L,ppth,ug/L,ng/L,pg/L,mg/cm2,g/day,g/year,kg/day,kg/month,kg/year,lb/day,lbs/week,lbs/month,lbs/year,mg/day,mg/kg,ug/kg,ng/g,ulbs/day,ug/day,t/day","Chlorinated Pesticides in Groundwater [E508];Extractable Priority Pollutants [E625];Extractable Priority Pollutants by GC/MS SIM [E625SIM];GC/MS SIM Method [SIM];HISTORICAL: Organochlorine Pesticides & PCBs as Aroclors by GC [SW8081];HISTORICAL: Organochlorine Pesticides and PCBs [SW8080];Organochlorine Pesticides and PCBs [E608];Organochlorine Pesticides and PCBs by GC/HSD [E608.3];Organochlorine Pesticides by Gas Chromatography [SW8081A];Semivolatile Organic Compounds by GC/MS [SW8270C];Semivolatile Organic Compounds by Isotope Dilution GCMS [E1625C];Volatile Organic Compounds by GC/MS SIM [8260SIM];Volatile Organic Compounds EPA Method 624 [E624];Data Unavailable [DU]"]
[null,null,null,"E821013","Chronic Toxicity of Effluents/ Receiving Water to Freshwater Organisms (EPA-821-R-02-013) [E821013]",null,null,null,null,null,null,"CHLORDANEA","alpha-Chlordane",null,null,null,null,null,null,null,null,"alpha-Chlordane","kg/L,g/L,mg/L,ppth,ug/L,ng/L,pg/L,mg/cm2,g/day,g/year,kg/day,kg/month,kg/year,lb/day,lbs/week,lbs/month,lbs/year,mg/day,mg/kg,ug/kg,ng/g,ulbs/day,ug/day,t/day","Extractable Priority Pollutants [E625];GC/MS SIM Method [SIM];HISTORICAL: Organochlorine Pesticides and PCBs [SW8080];Organochlorine Pesticides and PCBs [E608];Organochlorine Pesticides by Gas Chromatography [SW8081A];Organochlorine Pesticides and PCBs by GC/HSD [E608.3];Data Unavailable [DU]"]
[null,null,null,"E821014","Chronic Toxicity of Effluents/Receiving Water to Marine and Estuarine Organisms (EPA-821-R-02-014) [E821014]",null,null,null,null,null,"L","AL","Aluminum, Dissolved",null,null,null,null,null,null,null,null,"Aluminum, Dissolved","kg/L,g/L,mg/L,ppth,ug/L,ng/L,pg/L,mg/cm2,g/day,g/year,kg/day,kg/month,kg/year,lb/day,lbs/week,lbs/month,lbs/year,mg/day,mg/kg,ug/kg,ng/g,ulbs/day,ug/day,t/day","Aluminum (AA, Direct Aspiration) [E202.1];Aluminum (AA, Furnace Technique) [E202.2];Inductively Coupled Plasma Emission - modified for CLP [CL200.7];Inductively Coupled Plasma Emission [E200.7];Inductively Coupled Plasma/Mass Spectroscopy [E200.8];Atomic Absorption, Platform [E200.9];HISTORICAL: Inductively Coupled Plasma-Emission [SW6010];Inductively Coupled Plasma-Atomic Emission Spectroscopy [SW6010B];Inductively Coupled Plasma-Mass Spectrometry [SW6020];Metals by Atomic Absorption [E200.0];Standard Method (19th) 3113: Metals by Furnace AAS [A3113B];Data Unavailable [DU]"]
[null,null,null,"E600136","Chronic Toxicity of Effluents/Receiving Water to West Coast Marine/Estuar. Organ. (EPA-600-R-95-136) [E600136]",null,null,null,null,null,"F","AL","Aluminum, Filtered",null,null,null,null,null,null,null,null,"Aluminum, Filtered","kg/L,g/L,mg/L,ppth,ug/L,ng/L,pg/L,mg/cm2,g/day,g/year,kg/day,kg/month,kg/year,lb/day,lbs/week,lbs/month,lbs/year,mg/day,mg/kg,ug/kg,ng/g,ulbs/day,ug/day,t/day","Aluminum (AA, Direct Aspiration) [E202.1];Aluminum (AA, Furnace Technique) [E202.2];Inductively Coupled Plasma Emission - modified for CLP [CL200.7];Inductively Coupled Plasma Emission [E200.7];Inductively Coupled Plasma/Mass Spectroscopy [E200.8];Atomic Absorption, Platform [E200.9];HISTORICAL: Inductively Coupled Plasma-Emission [SW6010];Inductively Coupled Plasma-Atomic Emission Spectroscopy [SW6010B];Inductively Coupled Plasma-Mass Spectrometry [SW6020];Metals by Atomic Absorption [E200.0];Standard Method (19th) 3113: Metals by Furnace AAS [A3113B];Data Unavailable [DU]"]
[null,null,null,"CLPPM","CLP Method for Percent Moisture (ILM03.0) [CLPPM]",null,null,null,null,null,null,"AL","Aluminum, Total",null,null,null,null,null,null,null,null,"Aluminum, Total","kg/L,g/L,mg/L,ppth,ug/L,ng/L,pg/L,mg/cm2,g/day,g/year,kg/day,kg/month,kg/year,lb/day,lbs/week,lbs/month,lbs/year,mg/day,mg/kg,ug/kg,ng/g,ulbs/day,ug/day,t/day","Aluminum (AA, Direct Aspiration) [E202.1];Aluminum (AA, Furnace Technique) [E202.2];Inductively Coupled Plasma Emission - modified for CLP [CL200.7];Inductively Coupled Plasma Emission [E200.7];Inductively Coupled Plasma/Mass Spectroscopy [E200.8];Atomic Absorption, Platform [E200.9];HISTORICAL: Inductively Coupled Plasma-Emission [SW6010];Inductively Coupled Plasma-Atomic Emission Spectroscopy [SW6010B];Inductively Coupled Plasma-Mass Spectrometry [SW6020];Metals by Atomic Absorption [E200.0];Standard Method (19th) 3113: Metals by Furnace AAS [A3113B];Data Unavailable [DU]"]
[null,null,null,"E219.1","Cobalt (AA, Direct Aspiration) [E219.1]",null,null,null,null,null,"N","AL","Aluminum, Total Recoverable",null,null,null,null,null,null,null,null,"Aluminum, Total Recoverable","kg/L,g/L,mg/L,ppth,ug/L,ng/L,pg/L,mg/cm2,g/day,g/year,kg/day,kg/month,kg/year,lb/day,lbs/week,lbs/month,lbs/year,mg/day,mg/kg,ug/kg,ng/g,ulbs/day,ug/day,t/day","Aluminum (AA, Direct Aspiration) [E202.1];Aluminum (AA, Furnace Technique) [E202.2];Inductively Coupled Plasma Emission - modified for CLP [CL200.7];Inductively Coupled Plasma Emission [E200.7];Inductively Coupled Plasma/Mass Spectroscopy [E200.8];Atomic Absorption, Platform [E200.9];HISTORICAL: Inductively Coupled Plasma-Emission [SW6010];Inductively Coupled Plasma-Atomic Emission Spectroscopy [SW6010B];Inductively Coupled Plasma-Mass Spectrometry [SW6020];Metals by Atomic Absorption [E200.0];Standard Method (19th) 3113: Metals by Furnace AAS [A3113B];Data Unavailable [DU]"]
[null,null,null,"SW7200","Cobalt (AA, Direct Aspiration) [SW7200]",null,null,null,null,null,null,"AM-241","Americium-241",null,null,null,null,null,null,null,null,"Americium-241","PCi/L","A-01-R - Isotopic Curium and Americium (Alpha Spectrometry -EML HASL-300);Data Unavailable [DU]"]
[null,null,null,"E219.2","Cobalt (AA, Furnace Technique) [E219.2]",null,null,null,null,null,null,"AMINOCARB","Aminocarb",null,null,null,null,null,null,null,null,"Aminocarb",{"$f":"$AG$8","v":"kg/L,g/L,mg/L,ppth,ug/L,ng/L,pg/L,mg/cm2,g/day,g/year,kg/day,kg/month,kg/year,lb/day,lbs/week,lbs/month,lbs/year,mg/day,mg/kg,ug/kg,ng/g,ulbs/day,ug/day,t/day"},"Lovely/Phillips (1987) Rapid Assay for Microbially Reducible Fe3+ [LPFE3];Standard Method (19th) 4500-NH: Nitrogen (Ammonia) [A4500NH];Data Unavailable [DU]"]
[null,null,null,"SW7201","Cobalt (AA, Furnace Technique) [SW7201]",null,null,null,null,null,null,"AIRATIO","Ammonia Impact Ratio",null,null,null,null,null,null,null,null,"Ammonia Impact Ratio","%","Aluminum (AA, Direct Aspiration) [E202.1];Aluminum (AA, Furnace Technique) [E202.2];Inductively Coupled Plasma Emission - modified for CLP [CL200.7];Inductively Coupled Plasma Emission [E200.7];Inductively Coupled Plasma/Mass Spectroscopy [E200.8];Atomic Absorption, Platform [E200.9];HISTORICAL: Inductively Coupled Plasma-Emission [SW6010];Inductively Coupled Plasma-Atomic Emission Spectroscopy [SW6010B];Inductively Coupled Plasma-Mass Spectrometry [SW6020];Metals by Atomic Absorption [E200.0];Standard Method (19th) 3113: Metals by Furnace AAS [A3113B];Standard Methods 4500-NH3 H: Nitrogen (Ammonia) - Flow Injection Analysis (1997) [4500NHH];Data Unavailable [DU]"]
[null,null,null,"E410.3M","COD (Titrimetric, High Level for Saline Water) Modified [E410.3M]",null,null,null,null,null,null,"NH3N","Ammonia, Total (as N)",null,null,null,null,null,null,null,null,"Ammonia, Total (as N)",{"$f":"$AG$8","v":"kg/L,g/L,mg/L,ppth,ug/L,ng/L,pg/L,mg/cm2,g/day,g/year,kg/day,kg/month,kg/year,lb/day,lbs/week,lbs/month,lbs/year,mg/day,mg/kg,ug/kg,ng/g,ulbs/day,ug/day,t/day"},"Nitrogen, Ammonia (as N) [E350.1];Nitrogen, Ammonia (as N) [E350.2];Nitrogen, Ammonia (as N) [E350.3];Nitrogen, Ammonia (as N) Modified [E350.1M];Standard Method (19th) 4500-NH: Nitrogen (Ammonia) [A4500NH];Standard Methods 4500-NH3 H: Nitrogen (Ammonia) - Flow Injection Analysis (1997) [4500NHH];Standard Method 4500-NH3 C: N (Ammonia) Titrimetric [A45001C];Standard Method (20th) 4500-NH3 G: N (Ammonia) Auto Phenate [A4500NG];Data Unavailable [DU]"]
[null,null,null,"E110.2","Color (Colorimetric-Platinum-Cobalt) [E110.2]",null,null,null,null,null,null,"NH3","Ammonia, Unionized (as N)",null,null,null,null,null,null,null,null,"Ammonia, Unionized (as N)",{"$f":"$AG$8","v":"kg/L,g/L,mg/L,ppth,ug/L,ng/L,pg/L,mg/cm2,g/day,g/year,kg/day,kg/month,kg/year,lb/day,lbs/week,lbs/month,lbs/year,mg/day,mg/kg,ug/kg,ng/g,ulbs/day,ug/day,t/day"},"1990 EML Procedures Manual, Pu-11, HASL-300 [ISOPU];Calculation for Inorganic Nitrogen: NO2 + NO3 + NH3 [CALCNIO];Halogenated Volatile Organics by Headspace [3810HVO];Nitrogen, Ammonia (as N) [E350.1];Nitrogen, Ammonia (as N) [E350.3];Nitrogen, Ammonia (as N) Modified [E350.1M];Oil and Grease, Total Recoverable [E413.1];Semivolatile Organic Compounds by GC/MS [SW8270C];Standard Method (19th) 2550 B: Temperature, Lab and Field Methods [A2550B];Standard Method (19th) 4500-N(org) A: Calc. for Org. N (TKN-NH3) [A4500NA];Standard Method (19th) 4500-NH: Nitrogen (Ammonia) [A4500NH];Standard Methods 4500-NH3 H: Nitrogen (Ammonia) - Flow Injection Analysis (1997) [4500NHH];Standard Method (19th) 4500-O G:Diss. O by Membrane Electrode [A4500OG];Standard Method (20th) 4500-NH3 G: N (Ammonia) Auto Phenate [A4500NG];Data Unavailable [DU]"]
[null,null,null,"E601-2","Combined Methods E601/E602 [E601-2]",null,null,null,null,null,null,"NH4N","Ammonium as Nitrogen",null,null,null,null,null,null,null,null,"Ammonium as Nitrogen",{"$f":"$AG$8","v":"kg/L,g/L,mg/L,ppth,ug/L,ng/L,pg/L,mg/cm2,g/day,g/year,kg/day,kg/month,kg/year,lb/day,lbs/week,lbs/month,lbs/year,mg/day,mg/kg,ug/kg,ng/g,ulbs/day,ug/day,t/day"},"1991 EML Procedures Manual, Pu-11, HASL-300 [ISOPU];Calculation for Inorganic Nitrogen: NO2 + NO3 + NH3 [CALCNIO];Halogenated Volatile Organics by Headspace [3810HVO];Nitrogen, Ammonia (as N) [E350.1];Nitrogen, Ammonia (as N) [E350.3];Nitrogen, Ammonia (as N) Modified [E350.1M];Oil and Grease, Total Recoverable [E413.1];Semivolatile Organic Compounds by GC/MS [SW8270C];Standard Method (19th) 2550 B: Temperature, Lab and Field Methods [A2550B];Standard Method (19th) 4500-N(org) A: Calc. for Org. N (TKN-NH3) [A4500NA];Standard Method (19th) 4500-NH: Nitrogen (Ammonia) [A4500NH];Standard Methods 4500-NH3 H: Nitrogen (Ammonia) - Flow Injection Analysis (1997) [4500NHH];Standard Method (19th) 4500-O G:Diss. O by Membrane Electrode [A4500OG];Standard Method (20th) 4500-NH3 G: N (Ammonia) Auto Phenate [A4500NG];Data Unavailable [DU]"]
[null,null,null,"E220.1","Copper (AA, Direct Aspiration) [E220.1]",null,null,null,null,null,null,"ANILINE","Aniline",null,null,null,null,null,null,null,null,"Aniline",{"$f":"$AG$8","v":"kg/L,g/L,mg/L,ppth,ug/L,ng/L,pg/L,mg/cm2,g/day,g/year,kg/day,kg/month,kg/year,lb/day,lbs/week,lbs/month,lbs/year,mg/day,mg/kg,ug/kg,ng/g,ulbs/day,ug/day,t/day"},"Extractable Priority Pollutants [E625];GC/MS SIM Method [SIM];Semivolatile Organic Compounds by GC/MS [SW8270C];Data Unavailable [DU]"]
[null,null,null,"SW7210","Copper (AA, Direct Aspiration) [SW7210]",null,null,null,null,null,null,"TOTANIONS","Anion Total",null,null,null,null,null,null,null,null,"Anion Total","meq/L","Alkalinity, Total (as Carbonate) [E310.2];Standard Method (18th & 19th) 2320 B: Alkalinity by Titration [A2320B];Standard Method 1030F1: Cation-Anion Balance Calculation [A1030F1];Data Unavailable [DU]"]
[null,null,null,"SW7211","Copper (AA, Furnace Technique) [SW7211]",null,null,null,null,null,null,"ACB","Anion/Cation Balance",null,null,null,null,null,null,null,null,"Anion/Cation Balance","%","Inductively Coupled Plasma Emission [E200.7];Standard Method 1030F1: Cation-Anion Balance Calculation [A1030F1];Data Unavailable [DU]"]
[null,null,null,"E220.2","Copper (AA, Furnace) [E220.2]",null,null,null,null,null,null,"ANTH","Anthracene",null,null,null,null,null,null,null,null,"Anthracene",{"$f":"$AG$8","v":"kg/L,g/L,mg/L,ppth,ug/L,ng/L,pg/L,mg/cm2,g/day,g/year,kg/day,kg/month,kg/year,lb/day,lbs/week,lbs/month,lbs/year,mg/day,mg/kg,ug/kg,ng/g,ulbs/day,ug/day,t/day"},"Extractable Priority Pollutants [E625];Extractable Priority Pollutants by GC/MS SIM [E625SIM];GC/MS SIM Method [SIM];HISTORICAL: Semivolatile Organic Compounds by GC/MS [SW8270];HISTORICAL: Semivolatile Organic Compounds by GC/MS [SW8270A];Polynuclear Aromatic Hydrocarbons [E610];Semivolatile Organic Compounds by GC/MS - Open Scan [8270COS];Semivolatile Organic Compounds by GC/MS [SW8270C];Semivolatile Organic Compounds by GC/MS SIM [8270SIM];Semivolatile Organic Compounds by Isotope Dilution GCMS [E1625C];Volatile Organic Compounds by GC/MS [SW8260B];Volatile Organic Compounds by GC/MS SIM [8260SIM];Volatile Organic Compounds EPA Method 624 [E624];Base/Neutrals and Acids by GC/MS [E625.1];Data Unavailable [DU]"]
[null,null,null,"SW1110","Corrosivity Toward Steel [SW1110]",null,null,null,null,null,"L","SB","Antimony, Dissolved",null,null,null,null,null,null,null,null,"Antimony, Dissolved","kg/L,g/L,mg/L,ppth,ug/L,ng/L,pg/L,mg/cm2,g/day,g/year,kg/day,kg/month,kg/year,lb/day,lbs/week,lbs/month,lbs/year,mg/day,mg/kg,ug/kg,ng/g,ulbs/day,ug/day,t/day","Trace Elements in Water by Preconcentration and ICP-MS [E1640];Trace Elements in Ambient Waters by ICP-MS [E1638];Antimony (AA, Direct Aspiration) [E204.1];Antimony (AA, Direct Aspiration) [SW7040];Antimony (AA, Furnace Technique) - modified for CLP [CL204.2];Antimony (AA, Furnace Technique) [E204.2];Antimony (AA, Furnace Technique) [SW7041];Atomic Absorption, Platform [E200.9];HISTORICAL: Inductively Coupled Plasma-Emission [SW6010];Inductively Coupled Plasma Emission - modified for CLP [CL200.7];Inductively Coupled Plasma Emission [E200.7];Inductively Coupled Plasma/Mass Spectroscopy [E200.8];Inductively Coupled Plasma-Atomic Emission Spectroscopy [SW6010B];Inductively Coupled Plasma-Mass Spectrometry [SW6020];Metals by Atomic Absorption [E200.0];Standard Method (19th) 3111 B: Metals, Direct Air-Acetylene Flame [A3111B];Standard Method (19th) 3113: Metals by Electrothermal AAS [A3113];Data Unavailable [DU]"]
[null,null,null,"SW9013","Cyanide Extraction Procedure for Solids and Oils [SW9013]",null,null,null,null,null,null,"SB","Antimony, Total",null,null,null,null,null,null,null,null,"Antimony, Total","kg/L,g/L,mg/L,ppth,ug/L,ng/L,pg/L,mg/cm2,g/day,g/year,kg/day,kg/month,kg/year,lb/day,lbs/week,lbs/month,lbs/year,mg/day,mg/kg,ug/kg,ng/g,ulbs/day,ug/day,t/day","Trace Elements in Water by Preconcentration and ICP-MS [E1640];Trace Elements in Ambient Waters by ICP-MS [E1638];Antimony (AA, Direct Aspiration) [E204.1];Antimony (AA, Direct Aspiration) [SW7040];Antimony (AA, Furnace Technique) - modified for CLP [CL204.2];Antimony (AA, Furnace Technique) [E204.2];Antimony (AA, Furnace Technique) [SW7041];Atomic Absorption, Platform [E200.9];HISTORICAL: Inductively Coupled Plasma-Emission [SW6010];Inductively Coupled Plasma Emission - modified for CLP [CL200.7];Inductively Coupled Plasma Emission [E200.7];Inductively Coupled Plasma/Mass Spectroscopy [E200.8];Inductively Coupled Plasma-Atomic Emission Spectroscopy [SW6010B];Inductively Coupled Plasma-Mass Spectrometry [SW6020];Metals by Atomic Absorption [E200.0];Standard Method (19th) 3111 B: Metals, Direct Air-Acetylene Flame [A3111B];Standard Method (19th) 3113: Metals by Electrothermal AAS [A3113];Data Unavailable [DU]"]
[null,null,null,"E335.1","Cynanides, Amenable to Chlorination [E335.1]",null,null,null,null,null,"N","SB","Antimony, Total Recoverable",null,null,null,null,null,null,null,null,"Antimony, Total Recoverable","kg/L,g/L,mg/L,ppth,ug/L,ng/L,pg/L,mg/cm2,g/day,g/year,kg/day,kg/month,kg/year,lb/day,lbs/week,lbs/month,lbs/year,mg/day,mg/kg,ug/kg,ng/g,ulbs/day,ug/day,t/day","Trace Elements in Water by Preconcentration and ICP-MS [E1640];Trace Elements in Ambient Waters by ICP-MS [E1638];Antimony (AA, Direct Aspiration) [E204.1];Antimony (AA, Direct Aspiration) [SW7040];Antimony (AA, Furnace Technique) - modified for CLP [CL204.2];Antimony (AA, Furnace Technique) [E204.2];Antimony (AA, Furnace Technique) [SW7041];Atomic Absorption, Platform [E200.9];HISTORICAL: Inductively Coupled Plasma-Emission [SW6010];Inductively Coupled Plasma Emission - modified for CLP [CL200.7];Inductively Coupled Plasma Emission [E200.7];Inductively Coupled Plasma/Mass Spectroscopy [E200.8];Inductively Coupled Plasma-Atomic Emission Spectroscopy [SW6010B];Inductively Coupled Plasma-Mass Spectrometry [SW6020];Metals by Atomic Absorption [E200.0];Standard Method (19th) 3111 B: Metals, Direct Air-Acetylene Flame [A3111B];Standard Method (19th) 3113: Metals by Electrothermal AAS [A3113];Data Unavailable [DU]"]
[null,null,null,"E1002.0","Daphnid Survival and Reproduction Test [E1002.0]",null,null,null,null,null,"L","AS","Arsenic (III), Dissolved",null,null,null,null,null,null,null,null,"Arsenic (III), Dissolved","kg/L,g/L,mg/L,ppth,ug/L,ng/L,pg/L,mg/cm2,g/day,g/year,kg/day,kg/month,kg/year,lb/day,lbs/week,lbs/month,lbs/year,mg/day,mg/kg,ug/kg,ng/g,ulbs/day,ug/day,t/day","Trace Elements in Water by Preconcentration and ICP-MS [E1640];Arsenic (AA, Furnace Technique) [SW7060A];Arsenic (AA, Furnace) - modified for CLP [CL206.2];Arsenic (AA, Furnace) [E206.2];Arsenic (AA, Gaseous Hydride) [SW7061A];Arsenic (AA, Hydride) [E206.3];Atomic Absorption, Platform [E200.9];HISTORICAL: Inductively Coupled Plasma-Emission [SW6010];Inductively Coupled Plasma Emission - modified for CLP [CL200.7];Inductively Coupled Plasma Emission [E200.7];Inductively Coupled Plasma/Mass Spectroscopy [E200.8];Inductively Coupled Plasma-Atomic Emission Spectroscopy [SW6010B];Inductively Coupled Plasma-Mass Spectrometry [SW6020];Metals by Atomic Absorption [E200.0];Standard Method (19th) 3113: Metals by Furnace AAS [A3113B];Standard Methods (19th) 3114 B: Metals by Gaseuous Hydride AAS [A3114B];Data Unavailable [DU]"]
[null,null,null,"DU","Data Unavailable [DU]",null,null,null,null,null,"N","AS","Arsenic (III), Total Recoverable",null,null,null,null,null,null,null,null,"Arsenic (III), Total Recoverable","kg/L,g/L,mg/L,ppth,ug/L,ng/L,pg/L,mg/cm2,g/day,g/year,kg/day,kg/month,kg/year,lb/day,lbs/week,lbs/month,lbs/year,mg/day,mg/kg,ug/kg,ng/g,ulbs/day,ug/day,t/day","Trace Elements in Water by Preconcentration and ICP-MS [E1640];Arsenic (AA, Furnace Technique) [SW7060A];Arsenic (AA, Furnace) - modified for CLP [CL206.2];Arsenic (AA, Furnace) [E206.2];Arsenic (AA, Gaseous Hydride) [SW7061A];Arsenic (AA, Hydride) [E206.3];Atomic Absorption, Platform [E200.9];HISTORICAL: Inductively Coupled Plasma-Emission [SW6010];Inductively Coupled Plasma Emission - modified for CLP [CL200.7];Inductively Coupled Plasma Emission [E200.7];Inductively Coupled Plasma/Mass Spectroscopy [E200.8];Inductively Coupled Plasma-Atomic Emission Spectroscopy [SW6010B];Inductively Coupled Plasma-Mass Spectrometry [SW6020];Metals by Atomic Absorption [E200.0];Standard Method (19th) 3113: Metals by Furnace AAS [A3113B];Standard Methods (19th) 3114 B: Metals by Gaseuous Hydride AAS [A3114B];Data Unavailable [DU]"]
[null,null,null,"E314.0","Determ. of Perchlorate in Drinking Water using Ion Chromatography [E314.0]",null,null,null,null,null,"L","AS","Arsenic, Dissolved",null,null,null,null,null,null,null,null,"Arsenic, Dissolved","kg/L,g/L,mg/L,ppth,ug/L,ng/L,pg/L,mg/cm2,g/day,g/year,kg/day,kg/month,kg/year,lb/day,lbs/week,lbs/month,lbs/year,mg/day,mg/kg,ug/kg,ng/g,ulbs/day,ug/day,t/day","Trace Elements in Water by Preconcentration and ICP-MS [E1640];Arsenic (AA, Furnace Technique) [SW7060A];Arsenic (AA, Furnace) - modified for CLP [CL206.2];Arsenic (AA, Furnace) [E206.2];Arsenic (AA, Gaseous Hydride) [SW7061A];Arsenic (AA, Hydride) [E206.3];Atomic Absorption, Platform [E200.9];HISTORICAL: Inductively Coupled Plasma-Emission [SW6010];Inductively Coupled Plasma Emission - modified for CLP [CL200.7];Inductively Coupled Plasma Emission [E200.7];Inductively Coupled Plasma/Mass Spectroscopy [E200.8];Inductively Coupled Plasma-Atomic Emission Spectroscopy [SW6010B];Inductively Coupled Plasma-Mass Spectrometry [SW6020];Metals by Atomic Absorption [E200.0];Standard Method (19th) 3113: Metals by Furnace AAS [A3113B];Standard Methods (19th) 3114 B: Metals by Gaseuous Hydride AAS [A3114B];Data Unavailable [DU]"]
[null,null,null,"E904.0","Determ. of Radium -226, 228 [E904.0]",null,null,null,null,null,null,"AS","Arsenic, Total",null,null,null,null,null,null,null,null,"Arsenic, Total","kg/L,g/L,mg/L,ppth,ug/L,ng/L,pg/L,mg/cm2,g/day,g/year,kg/day,kg/month,kg/year,lb/day,lbs/week,lbs/month,lbs/year,mg/day,mg/kg,ug/kg,ng/g,ulbs/day,ug/day,t/day","Trace Elements in Water by Preconcentration and ICP-MS [E1640];Arsenic (AA, Furnace Technique) [SW7060A];Arsenic (AA, Furnace) - modified for CLP [CL206.2];Arsenic (AA, Furnace) [E206.2];Arsenic (AA, Gaseous Hydride) [SW7061A];Arsenic (AA, Hydride) [E206.3];Atomic Absorption, Platform [E200.9];HISTORICAL: Inductively Coupled Plasma-Emission [SW6010];Inductively Coupled Plasma Emission - modified for CLP [CL200.7];Inductively Coupled Plasma Emission [E200.7];Inductively Coupled Plasma/Mass Spectroscopy [E200.8];Inductively Coupled Plasma-Atomic Emission Spectroscopy [SW6010B];Inductively Coupled Plasma-Mass Spectrometry [SW6020];Metals by Atomic Absorption [E200.0];Standard Method (19th) 3113: Metals by Furnace AAS [A3113B];Standard Methods (19th) 3114 B: Metals by Gaseuous Hydride AAS [A3114B];Data Unavailable [DU]"]
[null,null,null,"E25","Determ. of Total Gaseous Nonmethane Organic Emissions as Carbon [E25]",null,null,null,null,null,"N","AS","Arsenic, Total Recoverable",null,null,null,null,null,null,null,null,"Arsenic, Total Recoverable","kg/L,g/L,mg/L,ppth,ug/L,ng/L,pg/L,mg/cm2,g/day,g/year,kg/day,kg/month,kg/year,lb/day,lbs/week,lbs/month,lbs/year,mg/day,mg/kg,ug/kg,ng/g,ulbs/day,ug/day,t/day","Trace Elements in Water by Preconcentration and ICP-MS [E1640];Arsenic (AA, Furnace Technique) [SW7060A];Arsenic (AA, Furnace) - modified for CLP [CL206.2];Arsenic (AA, Furnace) [E206.2];Arsenic (AA, Gaseous Hydride) [SW7061A];Arsenic (AA, Hydride) [E206.3];Atomic Absorption, Platform [E200.9];HISTORICAL: Inductively Coupled Plasma-Emission [SW6010];Inductively Coupled Plasma Emission - modified for CLP [CL200.7];Inductively Coupled Plasma Emission [E200.7];Inductively Coupled Plasma/Mass Spectroscopy [E200.8];Inductively Coupled Plasma-Atomic Emission Spectroscopy [SW6010B];Inductively Coupled Plasma-Mass Spectrometry [SW6020];Metals by Atomic Absorption [E200.0];Standard Method (19th) 3113: Metals by Furnace AAS [A3113B];Standard Methods (19th) 3114 B: Metals by Gaseuous Hydride AAS [A3114B];Data Unavailable [DU]"]
[null,null,null,"ETO15","Determ. of VOCs in Air by GC/MS, Collected in Special Canisters [ETO15]",null,null,null,null,null,null,"ASBESTOS","Asbestos",null,null,null,null,null,null,null,null,"Asbestos","Counts/L,Fibers/L,million fibers/L","Asbestos in Bulk Insulation, Int. Method (Pol Lt. Microscopy & Di [E600M4];Determination of Asbestos Structures (>10um) in Drinking Water [E100.2];Data Unavailable [DU]"]
[null,null,null,"ETO14AL","Determ. of Volatile Organics in Ambient Air by GC/Low Level [ETO14AL]",null,null,null,null,null,null,"ASPON","Aspon",null,null,null,null,null,null,null,null,"Aspon",{"$f":"$AG$8","v":"kg/L,g/L,mg/L,ppth,ug/L,ng/L,pg/L,mg/cm2,g/day,g/year,kg/day,kg/month,kg/year,lb/day,lbs/week,lbs/month,lbs/year,mg/day,mg/kg,ug/kg,ng/g,ulbs/day,ug/day,t/day"},"Data Unavailable [DU]"]
[null,null,null,"E821100","Determination of Acid Volatile Sulfides and Simultaneously Extractable Metals (EPA-821-R-91-100)",null,null,null,null,null,null,"ATRAZINE","Atrazine",null,null,null,null,null,null,null,null,"Atrazine",{"$f":"$AG$8","v":"kg/L,g/L,mg/L,ppth,ug/L,ng/L,pg/L,mg/cm2,g/day,g/year,kg/day,kg/month,kg/year,lb/day,lbs/week,lbs/month,lbs/year,mg/day,mg/kg,ug/kg,ng/g,ulbs/day,ug/day,t/day"},"Nitrogen- & Phosphorus-Containing Pest. in Water by GC [E507];Organic Compounds in Drinking Water by LSE & CCGC/MS [E525.2];Organochlorine Pesticides and PCBs [E608];Data Unavailable [DU]"]
[null,null,null,"E100.2","Determination of Asbestos Structures (>10um) in Drinking Water [E100.2]",null,null,null,null,null,null,"AVAILST","Available Storage Volume",null,null,null,null,null,null,null,null,"Available Storage Volume","Acre-feet","Data Unavailable [DU]"]
[null,null,null,"SW8315A","Determination of Carbonyl Compounds by HPLC [SW8315A]",null,null,null,null,null,null,"AZIPE","Azinphos-ethyl",null,null,null,null,null,null,null,null,"Azinphos-ethyl",{"$f":"$AG$8","v":"kg/L,g/L,mg/L,ppth,ug/L,ng/L,pg/L,mg/cm2,g/day,g/year,kg/day,kg/month,kg/year,lb/day,lbs/week,lbs/month,lbs/year,mg/day,mg/kg,ug/kg,ng/g,ulbs/day,ug/day,t/day"},"Data Unavailable [DU]"]
[null,null,null,"E515.1","Determination of Chlorinated Acids in Water by GC/ECD [E515.1]",null,null,null,null,null,null,"AZIPM","Azinphos-methyl",null,null,null,null,null,null,null,null,"Azinphos-methyl","kg/L,g/L,mg/L,ppth,ug/L,ng/L,pg/L,mg/cm2,g/day,g/year,kg/day,kg/month,kg/year,lb/day,lbs/week,lbs/month,lbs/year,mg/day,mg/kg,ug/kg,ng/g,ulbs/day,ug/day,t/day","Determination of Organophosphorus Pesticides [E614];Extractable Priority Pollutants [E625];Extractable Priority Pollutants by GC/MS SIM [E625SIM];HISTORICAL: Organophosphorus Compounds by GC [SW8141];Organophosphorus Compounds by Gas Chromatography [SW8141A];Semivolatile Organic Compounds by GC/MS [SW8270C];Data Unavailable [DU]"]
[null,null,null,"ULK09","Determination of DIMP and DMMP in Soil by GC/FPD [ULK09]",null,null,null,null,null,null,"AZOBENZENE","Azobenzene",null,null,null,null,null,null,null,null,"Azobenzene","kg/L,g/L,mg/L,ppth,ug/L,ng/L,pg/L,mg/cm2,g/day,g/year,kg/day,kg/month,kg/year,lb/day,lbs/week,lbs/month,lbs/year,mg/day,mg/kg,ug/kg,ng/g,ulbs/day,ug/day,t/day","Extractable Priority Pollutants [E625];Semivolatile Organic Compounds by GC/MS [SW8270C];Data Unavailable [DU]"]
[null,null,null,"N3503","Determination of Hydrazine by NIOSH Method 3503 [N3503]",null,null,null,null,null,null,"BARBAN","Barban",null,null,null,null,null,null,null,null,"Barban","kg/L,g/L,mg/L,ppth,ug/L,ng/L,pg/L,mg/cm2,g/day,g/year,kg/day,kg/month,kg/year,lb/day,lbs/week,lbs/month,lbs/year,mg/day,mg/kg,ug/kg,ng/g,ulbs/day,ug/day,t/day","Inductively Coupled Plasma/Mass Spectroscopy [E200.8];Data Unavailable [DU]"]
[null,null,null,"SW9056","Determination of Inorganic Anions by Ion Chromatography [SW9056]",null,null,null,null,null,"L","BA","Barium, Dissolved",null,null,null,null,null,null,null,null,"Barium, Dissolved","kg/L,g/L,mg/L,ppth,ug/L,ng/L,pg/L,mg/cm2,g/day,g/year,kg/day,kg/month,kg/year,lb/day,lbs/week,lbs/month,lbs/year,mg/day,mg/kg,ug/kg,ng/g,ulbs/day,ug/day,t/day","Barium (AA, Direct Aspiration) [E208.1];Barium (AA, Direct Aspiration) [SW7080];Barium (AA, Furnace Technique) [SW7081];Barium (AA, Furnace) [E208.2];Inductively Coupled Plasma Emission [E200.7];HISTORICAL: Inductively Coupled Plasma-Emission [SW6010];Inductively Coupled Plasma Emission - modified for CLP [CL200.7];Inductively Coupled Plasma/Mass Spectroscopy [E200.8];Inductively Coupled Plasma-Atomic Emission Spectroscopy [SW6010B];Inductively Coupled Plasma-Mass Spectrometry [SW6020];Data Unavailable [DU]"]
[null,null,null,"E308","Determination of Methanol Emissions from Stationary Sources [E308]",null,null,null,null,null,null,"BATOT","Barium, Total",null,null,null,null,null,null,null,null,"Barium, Total","kg/L,g/L,mg/L,ppth,ug/L,ng/L,pg/L,mg/cm2,g/day,g/year,kg/day,kg/month,kg/year,lb/day,lbs/week,lbs/month,lbs/year,mg/day,mg/kg,ug/kg,ng/g,ulbs/day,ug/day,t/day","Barium (AA, Direct Aspiration) [E208.1];Barium (AA, Direct Aspiration) [SW7080];Barium (AA, Furnace Technique) [SW7081];Barium (AA, Furnace) [E208.2];Inductively Coupled Plasma Emission [E200.7];HISTORICAL: Inductively Coupled Plasma-Emission [SW6010];Inductively Coupled Plasma Emission - modified for CLP [CL200.7];Inductively Coupled Plasma/Mass Spectroscopy [E200.8];Inductively Coupled Plasma-Atomic Emission Spectroscopy [SW6010B];Inductively Coupled Plasma-Mass Spectrometry [SW6020];Data Unavailable [DU]"]
[null,null,null,"N3515","Determination of Methylhydrazines by NIOSH Method 3515, 4th ed. [N3515]",null,null,null,null,null,"N","BA","Barium, Total Recoverable",null,null,null,null,null,null,null,null,"Barium, Total Recoverable","kg/L,g/L,mg/L,ppth,ug/L,ng/L,pg/L,mg/cm2,g/day,g/year,kg/day,kg/month,kg/year,lb/day,lbs/week,lbs/month,lbs/year,mg/day,mg/kg,ug/kg,ng/g,ulbs/day,ug/day,t/day","Barium (AA, Direct Aspiration) [E208.1];Barium (AA, Direct Aspiration) [SW7080];Barium (AA, Furnace Technique) [SW7081];Barium (AA, Furnace) [E208.2];Inductively Coupled Plasma Emission [E200.7];HISTORICAL: Inductively Coupled Plasma-Emission [SW6010];Inductively Coupled Plasma Emission - modified for CLP [CL200.7];Inductively Coupled Plasma/Mass Spectroscopy [E200.8];Inductively Coupled Plasma-Atomic Emission Spectroscopy [SW6010B];Inductively Coupled Plasma-Mass Spectrometry [SW6020];Data Unavailable [DU]"]
[null,null,null,"ETO12","Determination of Non-Methane Organic Compounds in Ambient Air [ETO12]",null,null,null,null,null,null,"BTZ","Bentazon",null,null,null,null,null,null,null,null,"Bentazon","kg/L,g/L,mg/L,ppth,ug/L,ng/L,pg/L,mg/cm2,g/day,g/year,kg/day,kg/month,kg/year,lb/day,lbs/week,lbs/month,lbs/year,mg/day,mg/kg,ug/kg,ng/g,ulbs/day,ug/day,t/day","Chlorinated Acids in Water by LLE [E515.3];Chlorinated Acids in Water by LLME [E515.4];Chlorinated Herbicides by GC [SW8151A];Determination of Chlorinated Acids in Water by GC/ECD [E515.1];Organochlorine Pesticides and PCBs [E608];Data Unavailable [DU]"]
[null,null,null,"ULT04","Determination of Organic Acids in Soil by Ion Chromatography [ULT04]",null,null,null,null,null,null,"BZ","Benzene",null,null,null,null,null,null,null,null,"Benzene","kg/L,g/L,mg/L,ppth,ug/L,ng/L,pg/L,mg/cm2,g/day,g/year,kg/day,kg/month,kg/year,lb/day,lbs/week,lbs/month,lbs/year,mg/day,mg/kg,ug/kg,ng/g,ulbs/day,ug/day,t/day","Extractable Priority Pollutants [E625];Extractable Priority Pollutants by GC/MS SIM [E625SIM];GC/MS SIM Method [SIM];HISTORICAL: Volatile Organic Compounds by GC/MS [SW8260];Organochlorine Pesticides and PCBs [E608];Organochlorine Pesticides by Gas Chromatography [SW8081A];Semivolatile Organic Compounds by GC/MS [SW8270C];VOCs by GC/MS Fuel Additives Plus BTEX [8260FAB];Volatile Organic Compounds by GC/MS - Open Scan [8260BOS];Volatile Organic Compounds by GC/MS [SW8260B];Volatile Organic Compounds by GC/MS plus Oxygenates [8260+OX];Volatile Organic Compounds by Purge and Trap [E524.2];Volatile Organic Compounds EPA Method 624 [E624];Purgeables by GC/MS [E624.1];Data Unavailable [DU]"]
[null,null,null,"E614","Determination of Organophosphorus Pesticides [E614]",null,null,null,null,null,null,"BZD","Benzidine",null,null,null,null,null,null,null,null,"Benzidine","kg/L,g/L,mg/L,ppth,ug/L,ng/L,pg/L,mg/cm2,g/day,g/year,kg/day,kg/month,kg/year,lb/day,lbs/week,lbs/month,lbs/year,mg/day,mg/kg,ug/kg,ng/g,ulbs/day,ug/day,t/day","Extractable Priority Pollutants [E625];Extractable Priority Pollutants by GC/MS SIM [E625SIM];GC/MS SIM Method [SIM];HISTORICAL: Semivolatile Organic Compounds by GC/MS [SW8270];HISTORICAL: Semivolatile Organic Compounds by GC/MS [SW8270A];Organochlorine Pesticides and PCBs [E608];Organochlorine Pesticides by Gas Chromatography [SW8081A];Semivolatile Organic Compounds by GC/MS - Open Scan [8270COS];Semivolatile Organic Compounds by GC/MS [SW8270C];Semivolatile Organic Compounds by Isotope Dilution GCMS [E1625C];Semivolatile Organic Compounds by SPE & GC/MS [E526];Volatile Organic Compounds by GC/MS [SW8260B];Volatile Organic Compounds by GC/MS SIM [8260SIM];Base/Neutrals and Acids by GC/MS [E625.1];Data Unavailable [DU]"]
[null,null,null,"ULL05","Determination of Organosulfur Compounds in Soil by GC [ULL05]",null,null,null,null,null,null,"BZAA","Benzo(a)anthracene",null,null,null,null,null,null,null,null,"Benzo(a)anthracene","kg/L,g/L,mg/L,ppth,ug/L,ng/L,pg/L,mg/cm2,g/day,g/year,kg/day,kg/month,kg/year,lb/day,lbs/week,lbs/month,lbs/year,mg/day,mg/kg,ug/kg,ng/g,ulbs/day,ug/day,t/day","Extractable Priority Pollutants [E625];Extractable Priority Pollutants by GC/MS SIM [E625SIM];GC/MS SIM Method [SIM];HISTORICAL: Semivolatile Organic Compounds by GC/MS [SW8270];HISTORICAL: Semivolatile Organic Compounds by GC/MS [SW8270A];Organic Compounds in Drinking Water by LSE & CCGC/MS [E525.2];Polynuclear Aromatic Hydrocarbons [E610];Semivolatile Organic Compounds by GC/MS - Open Scan [8270COS];Semivolatile Organic Compounds by GC/MS [SW8270C];Semivolatile Organic Compounds by GC/MS SIM [8270SIM];Semivolatile Organic Compounds by Isotope Dilution GCMS [E1625C];Volatile Organic Compounds by GC/MS SIM [8260SIM];Base/Neutrals and Acids by GC/MS [E625.1];Data Unavailable [DU]"]
[null,null,null,"E331.0","Determination of Perchlorate in Drinking Water by LCEI/MS [E331.0]",null,null,null,null,null,null,"BZAP","Benzo(a)pyrene",null,null,null,null,null,null,null,null,"Benzo(a)pyrene","kg/L,g/L,mg/L,ppth,ug/L,ng/L,pg/L,mg/cm2,g/day,g/year,kg/day,kg/month,kg/year,lb/day,lbs/week,lbs/month,lbs/year,mg/day,mg/kg,ug/kg,ng/g,ulbs/day,ug/day,t/day","Extractable Priority Pollutants [E625];Extractable Priority Pollutants by GC/MS SIM [E625SIM];GC/MS SIM Method [SIM];HISTORICAL: Semivolatile Organic Compounds by GC/MS [SW8270];HISTORICAL: Semivolatile Organic Compounds by GC/MS [SW8270A];Organic Compounds in Drinking Water by LSE & CCGC/MS [E525.2];Polynuclear Aromatic Hydrocarbons [E610];Semivolatile Organic Compounds by GC/MS - Open Scan [8270COS];Semivolatile Organic Compounds by GC/MS [SW8270C];Semivolatile Organic Compounds by GC/MS SIM [8270SIM];Semivolatile Organic Compounds by Isotope Dilution GCMS [E1625C];Volatile Organic Compounds by GC/MS SIM [8260SIM];Base/Neutrals and Acids by GC/MS [E625.1];Data Unavailable [DU]"]
[null,null,null,"ETO10A","Determination of Pesticides and PCBs in Ambient Air by GC/MD [ETO10A]",null,null,null,null,null,null,"BZBF","Benzo(b)fluoranthene",null,null,null,null,null,null,null,null,"Benzo(b)fluoranthene","kg/L,g/L,mg/L,ppth,ug/L,ng/L,pg/L,mg/cm2,g/day,g/year,kg/day,kg/month,kg/year,lb/day,lbs/week,lbs/month,lbs/year,mg/day,mg/kg,ug/kg,ng/g,ulbs/day,ug/day,t/day","Extractable Priority Pollutants [E625];Extractable Priority Pollutants by GC/MS SIM [E625SIM];GC/MS SIM Method [SIM];HISTORICAL: Semivolatile Organic Compounds by GC/MS [SW8270];HISTORICAL: Semivolatile Organic Compounds by GC/MS [SW8270A];Organic Compounds in Drinking Water by LSE & CCGC/MS [E525.2];Polynuclear Aromatic Hydrocarbons [E610];Semivolatile Organic Compounds by GC/MS - Open Scan [8270COS];Semivolatile Organic Compounds by GC/MS [SW8270C];Semivolatile Organic Compounds by GC/MS SIM [8270SIM];Semivolatile Organic Compounds by Isotope Dilution GCMS [E1625C];Volatile Organic Compounds by GC/MS [SW8260B];Volatile Organic Compounds by GC/MS SIM [8260SIM];Data Unavailable [DU]"]
[null,null,null,"E1658","Determination of Phenoxy-acid Herbicides [E1658]",null,null,null,null,null,null,"BZEP","Benzo(e)pyrene",null,null,null,null,null,null,null,null,"Benzo(e)pyrene","kg/L,g/L,mg/L,ppth,ug/L,ng/L,pg/L,mg/cm2,g/day,g/year,kg/day,kg/month,kg/year,lb/day,lbs/week,lbs/month,lbs/year,mg/day,mg/kg,ug/kg,ng/g,ulbs/day,ug/day,t/day","Extractable Priority Pollutants [E625];Base/Neutrals and Acids by GC/MS [E625.1];Data Unavailable [DU]"]
[null,null,null,"ULL9","Determination of Thiodiglycol and Chloroacetic Acid in Soil [ULL9]",null,null,null,null,null,null,"BZGHIP","Benzo(ghi)perylene",null,null,null,null,null,null,null,null,"Benzo(ghi)perylene","kg/L,g/L,mg/L,ppth,ug/L,ng/L,pg/L,mg/cm2,g/day,g/year,kg/day,kg/month,kg/year,lb/day,lbs/week,lbs/month,lbs/year,mg/day,mg/kg,ug/kg,ng/g,ulbs/day,ug/day,t/day","Extractable Priority Pollutants [E625];Extractable Priority Pollutants by GC/MS SIM [E625SIM];GC/MS SIM Method [SIM];HISTORICAL: Semivolatile Organic Compounds by GC/MS [SW8270];HISTORICAL: Semivolatile Organic Compounds by GC/MS [SW8270A];Organic Compounds in Drinking Water by LSE & CCGC/MS [E525.2];Polynuclear Aromatic Hydrocarbons [E610];Semivolatile Organic Compounds by GC/MS - Open Scan [8270COS];Semivolatile Organic Compounds by GC/MS [SW8270C];Semivolatile Organic Compounds by GC/MS SIM [8270SIM];Semivolatile Organic Compounds by Isotope Dilution GCMS [E1625C];Volatile Organic Compounds by GC/MS [SW8260B];Volatile Organic Compounds by GC/MS SIM [8260SIM];Base/Neutrals and Acids by GC/MS [E625.1];Data Unavailable [DU]"]
[null,null,null,"KAHNTOC","Determination of TOC in Soil by Modified Lloyd Kahn Method [KAHNTOC]",null,null,null,null,null,null,"BZKF","Benzo(k)fluoranthene",null,null,null,null,null,null,null,null,"Benzo(k)fluoranthene","kg/L,g/L,mg/L,ppth,ug/L,ng/L,pg/L,mg/cm2,g/day,g/year,kg/day,kg/month,kg/year,lb/day,lbs/week,lbs/month,lbs/year,mg/day,mg/kg,ug/kg,ng/g,ulbs/day,ug/day,t/day","Extractable Priority Pollutants [E625];Extractable Priority Pollutants by GC/MS SIM [E625SIM];GC/MS SIM Method [SIM];HISTORICAL: Semivolatile Organic Compounds by GC/MS [SW8270];HISTORICAL: Semivolatile Organic Compounds by GC/MS [SW8270A];Organic Compounds in Drinking Water by LSE & CCGC/MS [E525.2];Polynuclear Aromatic Hydrocarbons [E610];Semivolatile Organic Compounds by GC/MS - Open Scan [8270COS];Semivolatile Organic Compounds by GC/MS [SW8270C];Semivolatile Organic Compounds by GC/MS SIM [8270SIM];Semivolatile Organic Compounds by Isotope Dilution GCMS [E1625C];Volatile Organic Compounds by GC/MS [SW8260B];Volatile Organic Compounds by GC/MS SIM [8260SIM];Base/Neutrals and Acids by GC/MS [E625.1];Data Unavailable [DU]"]
[null,null,null,"ETO3","Determination of Volatile Organic Compounds in Ambient Air [ETO3]",null,null,null,null,null,null,"BZACID","Benzoic Acid",null,null,null,null,null,null,null,null,"Benzoic Acid","kg/L,g/L,mg/L,ppth,ug/L,ng/L,pg/L,mg/cm2,g/day,g/year,kg/day,kg/month,kg/year,lb/day,lbs/week,lbs/month,lbs/year,mg/day,mg/kg,ug/kg,ng/g,ulbs/day,ug/day,t/day","Extractable Priority Pollutants [E625];GC/MS SIM Method [SIM];HISTORICAL: Semivolatile Organic Compounds by GC/MS [SW8270];Semivolatile Organic Compounds by GC/MS [SW8270C];Standard Method (18th & 19th) 2320 B: Alkalinity by Titration [A2320B];Data Unavailable [DU]"]
[null,null,null,"ETO14A","Determination of Volatile Organic Compounds in Ambient Air by GC [ETO14A]",null,null,null,null,null,null,"BZLAL","Benzyl alcohol",null,null,null,null,null,null,null,null,"Benzyl alcohol","kg/L,g/L,mg/L,ppth,ug/L,ng/L,pg/L,mg/cm2,g/day,g/year,kg/day,kg/month,kg/year,lb/day,lbs/week,lbs/month,lbs/year,mg/day,mg/kg,ug/kg,ng/g,ulbs/day,ug/day,t/day","Extractable Priority Pollutants [E625];GC/MS SIM Method [SIM];Semivolatile Organic Compounds by GC/MS [SW8270C];Data Unavailable [DU]"]
[null,null,null,"SW8000B","Determinative Chromatographic Separations [SW8000B]",null,null,null,null,null,"L","BE","Beryllium, Dissolved",null,null,null,null,null,null,null,null,"Beryllium, Dissolved","kg/L,g/L,mg/L,ppth,ug/L,ng/L,pg/L,mg/cm2,g/day,g/year,kg/day,kg/month,kg/year,lb/day,lbs/week,lbs/month,lbs/year,mg/day,mg/kg,ug/kg,ng/g,ulbs/day,ug/day,t/day","Beryllium (AA, Direct Aspiration) [E210.1];Beryllium (AA, Direct Aspiration) [SW7090];Beryllium (AA, Furnace Technique) - modified for CLP [CL210.2];Beryllium (AA, Furnace Technique) [E210.2];Beryllium (AA, Furnace Technique) [SW7091];HISTORICAL: Inductively Coupled Plasma-Emission [SW6010];Inductively Coupled Plasma Emission - modified for CLP [CL200.7];Inductively Coupled Plasma Emission [E200.7];Inductively Coupled Plasma/Mass Spectroscopy [E200.8];Atomic Absorption, Platform [E200.9];Inductively Coupled Plasma-Atomic Emission Spectroscopy [SW6010B];Inductively Coupled Plasma-Mass Spectrometry [SW6020];Metals by Atomic Absorption [E200.0];Standard Method (19th) 3113: Metals by Electrothermal AAS [A3113];Trace Elements in Water by Preconcentration and ICP-MS [E1640];Data Unavailable [DU]"]
[null,null,null,"AK102AA","Diesel Range Organics (Aliphatics/Aromatics), ADEC [AK102AA]",null,null,null,null,null,null,"BE","Beryllium, Total",null,null,null,null,null,null,null,null,"Beryllium, Total","kg/L,g/L,mg/L,ppth,ug/L,ng/L,pg/L,mg/cm2,g/day,g/year,kg/day,kg/month,kg/year,lb/day,lbs/week,lbs/month,lbs/year,mg/day,mg/kg,ug/kg,ng/g,ulbs/day,ug/day,t/day","Beryllium (AA, Direct Aspiration) [E210.1];Beryllium (AA, Direct Aspiration) [SW7090];Beryllium (AA, Furnace Technique) - modified for CLP [CL210.2];Beryllium (AA, Furnace Technique) [E210.2];Beryllium (AA, Furnace Technique) [SW7091];HISTORICAL: Inductively Coupled Plasma-Emission [SW6010];Inductively Coupled Plasma Emission - modified for CLP [CL200.7];Inductively Coupled Plasma Emission [E200.7];Inductively Coupled Plasma/Mass Spectroscopy [E200.8];Atomic Absorption, Platform [E200.9];Inductively Coupled Plasma-Atomic Emission Spectroscopy [SW6010B];Inductively Coupled Plasma-Mass Spectrometry [SW6020];Metals by Atomic Absorption [E200.0];Standard Method (19th) 3113: Metals by Electrothermal AAS [A3113];Trace Elements in Water by Preconcentration and ICP-MS [E1640];Data Unavailable [DU]"]
[null,null,null,"AK102","Diesel Range Organics, Alaska Dept. of Environment. Conserv. [AK102]",null,null,null,null,null,"N","BE","Beryllium, Total Recoverable",null,null,null,null,null,null,null,null,"Beryllium, Total Recoverable","kg/L,g/L,mg/L,ppth,ug/L,ng/L,pg/L,mg/cm2,g/day,g/year,kg/day,kg/month,kg/year,lb/day,lbs/week,lbs/month,lbs/year,mg/day,mg/kg,ug/kg,ng/g,ulbs/day,ug/day,t/day","Beryllium (AA, Direct Aspiration) [E210.1];Beryllium (AA, Direct Aspiration) [SW7090];Beryllium (AA, Furnace Technique) - modified for CLP [CL210.2];Beryllium (AA, Furnace Technique) [E210.2];Beryllium (AA, Furnace Technique) [SW7091];HISTORICAL: Inductively Coupled Plasma-Emission [SW6010];Inductively Coupled Plasma Emission - modified for CLP [CL200.7];Inductively Coupled Plasma Emission [E200.7];Inductively Coupled Plasma/Mass Spectroscopy [E200.8];Atomic Absorption, Platform [E200.9];Inductively Coupled Plasma-Atomic Emission Spectroscopy [SW6010B];Inductively Coupled Plasma-Mass Spectrometry [SW6020];Metals by Atomic Absorption [E200.0];Standard Method (19th) 3113: Metals by Electrothermal AAS [A3113];Trace Elements in Water by Preconcentration and ICP-MS [E1640];Data Unavailable [DU]"]
[null,null,null,"L2041X","Digestion and Distillation of Total Cyanide in Drinking and Wastewaters (Lachat 10-204-00-1-X) [L2041X]",null,null,null,null,null,null,"BHCBETA","beta-BHC",null,null,null,null,null,null,null,null,"beta-BHC","kg/L,g/L,mg/L,ppth,ug/L,ng/L,pg/L,mg/cm2,g/day,g/year,kg/day,kg/month,kg/year,lb/day,lbs/week,lbs/month,lbs/year,mg/day,mg/kg,ug/kg,ng/g,ulbs/day,ug/day,t/day","Chlorinated Pesticides in Groundwater [E508];Extractable Priority Pollutants [E625];Extractable Priority Pollutants by GC/MS SIM [E625SIM];GC/MS SIM Method [SIM];HISTORICAL: Organochlorine Pesticides & PCBs as Aroclors by GC [SW8081];HISTORICAL: Organochlorine Pesticides and PCBs [SW8080];Organochlorine Pesticides and PCBs [E608];Organochlorine Pesticides and PCBs by GC/HSD [E608.3];Organochlorine Pesticides by Gas Chromatography [SW8081A];Semivolatile Organic Compounds by GC/MS [SW8270C];Semivolatile Organic Compounds by Isotope Dilution GCMS [E1625C];Volatile Organic Compounds by GC/MS SIM [8260SIM];Data Unavailable [DU]"]
[null,null,null,"DTN19","Dionex Technical Note 19: Anion Exchange with Cond. Detection [DTN19]",null,null,null,null,null,null,"BHCTOTAL","BHC, Sum",null,null,null,null,null,null,null,null,"BHC, Sum","kg/L,g/L,mg/L,ppth,ug/L,ng/L,pg/L,mg/cm2,g/day,g/year,kg/day,kg/month,kg/year,lb/day,lbs/week,lbs/month,lbs/year,mg/day,mg/kg,ug/kg,ng/g,ulbs/day,ug/day,t/day","Extractable Priority Pollutants [E625];Organochlorine Pesticides and PCBs [E608];Organochlorine Pesticides by Gas Chromatography [SW8081A];Organochlorine Pesticides and PCBs by GC/HSD [E608.3];Data Unavailable [DU]"]
[null,null,null,"E549.2","Diquat and Paraquat by LSE and HPLC [E549.2]",null,null,null,null,null,null,"HCO3","Bicarbonate Ion (as HCO3)",null,null,null,null,null,null,null,null,"Bicarbonate Ion (as HCO3)","kg/L,g/L,mg/L,ppth,ug/L,ng/L,pg/L,mg/cm2,g/day,g/year,kg/day,kg/month,kg/year,lb/day,lbs/week,lbs/month,lbs/year,mg/day,mg/kg,ug/kg,ng/g,ulbs/day,ug/day,t/day","Alkalinity, Total (as Carbonate) [E310.1];Carbonyl Compounds by GC/MS [E556];Standard Method (18th & 19th) 2320 B: Alkalinity by Titration [A2320B];Standard Method 4500-CO2 D: CO2 and Forms of Alkalinity by Calc. [A4500DA];Data Unavailable [DU]"]
[null,null,null,"RSK174","Diss. CH4, C2H6, & C2H4 in GW by GC (J. Chrom. Sci. Vol. 36) [RSK174]",null,null,null,null,null,"L","BIFENTHRIN","Bifenthrin, Freely Dissolved",null,null,null,null,null,null,null,null,"Bifenthrin, Freely Dissolved","kg/L,g/L,mg/L,ppth,ug/L,ng/L,pg/L,mg/cm2,g/day,g/year,kg/day,kg/month,kg/year,lb/day,lbs/week,lbs/month,lbs/year,mg/day,mg/kg,ug/kg,ng/g,ulbs/day,ug/day,t/day","Data Unavailable [DU]"]
[null,null,null,"RSK175","Diss. Gasses in Water by GC (Inter'l J. Env. Anal. Chem. 1991) [RSK175]",null,null,null,null,null,null,"BIFENTHRIN","Bifenthrin, Total",null,null,null,null,null,null,null,null,"Bifenthrin, Total","kg/L,g/L,mg/L,ppth,ug/L,ng/L,pg/L,mg/cm2,g/day,g/year,kg/day,kg/month,kg/year,lb/day,lbs/week,lbs/month,lbs/year,mg/day,mg/kg,ug/kg,ng/g,ulbs/day,ug/day,t/day","Data Unavailable [DU]"]
[null,null,null,"DOCH4","Diss. Oxygen & Methane (Inter'l J. Env. Anal. Chem. 1988) [DOCH4]",null,null,null,null,null,null,"BOD5","Biochemical Oxygen Demand (BOD) (5-day @ 20 Deg. C)",null,null,null,null,null,null,null,null,"Biochemical Oxygen Demand (BOD) (5-day @ 20 Deg. C)","kg/L,g/L,mg/L,ppth,ug/L,ng/L,pg/L,mg/cm2,g/day,g/year,kg/day,kg/month,kg/year,lb/day,lbs/week,lbs/month,lbs/year,mg/day,mg/kg,ug/kg,ng/g,ulbs/day,ug/day,t/day","Biochemical Oxygen Demand [E405.1];Standard Method (18th & 19th) 5210 B: 5-Day BOD Test [A5210B];Standard Method (18th) 5210: Biochemical Oxygen Demand [A5210];Data Unavailable [DU]"]
[null,null,null,"E218.6","Dissolved Hexavalent Chromium in Water by IC [E218.6]",null,null,null,null,null,null,"BIPHENYL","Biphenyl",null,null,null,null,null,null,null,null,"Biphenyl","kg/L,g/L,mg/L,ppth,ug/L,ng/L,pg/L,mg/cm2,g/day,g/year,kg/day,kg/month,kg/year,lb/day,lbs/week,lbs/month,lbs/year,mg/day,mg/kg,ug/kg,ng/g,ulbs/day,ug/day,t/day","Extractable Priority Pollutants [E625];Base/Neutrals and Acids by GC/MS [E625.1];Data Unavailable [DU]"]
[null,null,null,"DMEE","Dissolved Methane, Ethane, and Ethylene by GC (JCS May, 1998) [DMEE]",null,null,null,null,null,null,"BECEM","Bis (2-Chloroethoxy) Methane",null,null,null,null,null,null,null,null,"Bis (2-Chloroethoxy) Methane","kg/L,g/L,mg/L,ppth,ug/L,ng/L,pg/L,mg/cm2,g/day,g/year,kg/day,kg/month,kg/year,lb/day,lbs/week,lbs/month,lbs/year,mg/day,mg/kg,ug/kg,ng/g,ulbs/day,ug/day,t/day","Extractable Priority Pollutants [E625];Extractable Priority Pollutants by GC/MS SIM [E625SIM];GC/MS SIM Method [SIM];HISTORICAL: Semivolatile Organic Compounds by GC/MS [SW8270];HISTORICAL: Semivolatile Organic Compounds by GC/MS [SW8270A];Semivolatile Organic Compounds by GC/MS - Open Scan [8270COS];Semivolatile Organic Compounds by GC/MS [SW8270C];Semivolatile Organic Compounds by Isotope Dilution GCMS [E1625C];Semivolatile Organic Compounds by SPE & GC/MS [E526];Volatile Organic Compounds by GC/MS [SW8260B];Volatile Organic Compounds EPA Method 624 [E624];Base/Neutrals and Acids by GC/MS [E625.1];Data Unavailable [DU]"]
[null,null,null,"D91AVSM","Draft 1991-Determination of Acid Volatile in Sediment [D91AVSM]",null,null,null,null,null,null,"BIS2CEE","Bis (2-Chloroethyl) Ether",null,null,null,null,null,null,null,null,"Bis (2-Chloroethyl) Ether","kg/L,g/L,mg/L,ppth,ug/L,ng/L,pg/L,mg/cm2,g/day,g/year,kg/day,kg/month,kg/year,lb/day,lbs/week,lbs/month,lbs/year,mg/day,mg/kg,ug/kg,ng/g,ulbs/day,ug/day,t/day","Extractable Priority Pollutants [E625];Extractable Priority Pollutants by GC/MS SIM [E625SIM];GC/MS SIM Method [SIM];HISTORICAL: Semivolatile Organic Compounds by GC/MS [SW8270];HISTORICAL: Semivolatile Organic Compounds by GC/MS [SW8270A];Organochlorine Pesticides and PCBs [E608];Organochlorine Pesticides by Gas Chromatography [SW8081A];Semivolatile Organic Compounds by GC/MS - Open Scan [8270COS];Semivolatile Organic Compounds by GC/MS [SW8270C];Semivolatile Organic Compounds by Isotope Dilution GCMS [E1625C];Semivolatile Organic Compounds by SPE & GC/MS [E526];Volatile Organic Compounds by GC/MS [SW8260B];Volatile Organic Compounds by GC/MS SIM [8260SIM];Base/Neutrals and Acids by GC/MS [E625.1];Data Unavailable [DU]"]
[null,null,null,"N0502","Dustfall from the Atmosphere [N0502]",null,null,null,null,null,null,"BIS2CIE","Bis (2-Chloroisopropyl) Ether",null,null,null,null,null,null,null,null,"Bis (2-Chloroisopropyl) Ether","kg/L,g/L,mg/L,ppth,ug/L,ng/L,pg/L,mg/cm2,g/day,g/year,kg/day,kg/month,kg/year,lb/day,lbs/week,lbs/month,lbs/year,mg/day,mg/kg,ug/kg,ng/g,ulbs/day,ug/day,t/day","Extractable Priority Pollutants [E625];Extractable Priority Pollutants by GC/MS SIM [E625SIM];GC/MS SIM Method [SIM];HISTORICAL: Semivolatile Organic Compounds by GC/MS [SW8270];HISTORICAL: Semivolatile Organic Compounds by GC/MS [SW8270A];Semivolatile Organic Compounds by GC/MS - Open Scan [8270COS];Semivolatile Organic Compounds by GC/MS [SW8270C];Semivolatile Organic Compounds by Isotope Dilution GCMS [E1625C];Semivolatile Organic Compounds by SPE & GC/MS [E526];Volatile Organic Compounds by GC/MS [SW8260B];Volatile Organic Compounds by GC/MS SIM [8260SIM];Volatile Organic Compounds EPA Method 624 [E624];Base/Neutrals and Acids by GC/MS [E625.1];Data Unavailable [DU]"]
[null,null,null,"SW8011","EDB and DBCP by Microextration and GC [SW8011]",null,null,null,null,null,null,"BIS2EHP","Bis (2-Ethylhexyl) Phthalate",null,null,null,null,null,null,null,null,"Bis (2-Ethylhexyl) Phthalate","kg/L,g/L,mg/L,ppth,ug/L,ng/L,pg/L,mg/cm2,g/day,g/year,kg/day,kg/month,kg/year,lb/day,lbs/week,lbs/month,lbs/year,mg/day,mg/kg,ug/kg,ng/g,ulbs/day,ug/day,t/day","Combined Methods E601/E602 [E601-2];Extractable Priority Pollutants [E625];Extractable Priority Pollutants by GC/MS SIM [E625SIM];GC/MS SIM Method [SIM];Halogenated Volatile Organics by Headspace [3810HVO];HISTORICAL: Semivolatile Organic Compounds by GC/MS [SW8270];HISTORICAL: Semivolatile Organic Compounds by GC/MS [SW8270A];Organic Compounds in Drinking Water by LSE & CCGC/MS [E525.2];Organochlorine Pesticides and PCBs [E608];Organochlorine Pesticides by Gas Chromatography [SW8081A];Phthalate Esters [SW8060];Semivolatile Organic Compounds by GC/MS - Open Scan [8270COS];Semivolatile Organic Compounds by GC/MS [SW8270C];Semivolatile Organic Compounds by GC/MS SIM [8270SIM];Semivolatile Organic Compounds by Isotope Dilution GCMS [E1625C];Semivolatile Organic Compounds by SPE & GC/MS [E526];Standard Method (19th) 4500-N(org) B: Macro-Kjeldahl Method [A4500NB];Volatile Organic Compounds by GC/MS [SW8260B];Volatile Organic Compounds by GC/MS SIM [8260SIM];Volatile Organic Compounds EPA Method 624 [E624];Base/Neutrals and Acids by GC/MS [E625.1];Data Unavailable [DU]"]
[null,null,null,"E504","EDB and DBCP In Water by Microextraction and Gas Chromatography [E504]",null,null,null,null,null,null,"BCME","Bis (chloromethyl) Ether",null,null,null,null,null,null,null,null,"Bis (chloromethyl) Ether","kg/L,g/L,mg/L,ppth,ug/L,ng/L,pg/L,mg/cm2,g/day,g/year,kg/day,kg/month,kg/year,lb/day,lbs/week,lbs/month,lbs/year,mg/day,mg/kg,ug/kg,ng/g,ulbs/day,ug/day,t/day","Extractable Priority Pollutants [E625];Semivolatile Organic Compounds by GC/MS [SW8270C];Data Unavailable [DU]"]
[null,null,null,"E504.1","EDB, DBCP & 123TCP In Water by Microextraction & Gas Chromo. [E504.1]",null,null,null,null,null,null,"BI-211","Bismuth-211",null,null,null,null,null,null,null,null,"Bismuth-211","PCi/L","Gamm-Emitting Radionuclides in Drinking Water;Data Unavailable [DU]"]
[null,null,null,"E548","Endothall in Drinking Water by AD, LSE, & GC/ECD [E548]",null,null,null,null,null,null,"BI-212","Bismuth-212",null,null,null,null,null,null,null,null,"Bismuth-212","PCi/L","Gamm-Emitting Radionuclides in Drinking Water;Data Unavailable [DU]"]
[null,null,null,"E548.1","Endothall in Drinking Water by IEE, AMM, & GC/MS [E548.1]",null,null,null,null,null,"U","BOD5","BOD5 @ 20 Deg. C, Percent Removal",null,null,null,null,null,null,null,null,"BOD5 @ 20 Deg. C, Percent Removal","%","Data Unavailable [DU]"]
[null,null,null,"CDCHLPH","Env. Canada Method for Analysis of Chlorinated Phenolics, 1979 [CDCHLPH]",null,null,null,null,null,null,"SULPROFOS","Bolstar",null,null,null,null,null,null,null,null,"Bolstar",{"$f":"$AG$8","v":"kg/L,g/L,mg/L,ppth,ug/L,ng/L,pg/L,mg/cm2,g/day,g/year,kg/day,kg/month,kg/year,lb/day,lbs/week,lbs/month,lbs/year,mg/day,mg/kg,ug/kg,ng/g,ulbs/day,ug/day,t/day"},"Extractable Priority Pollutants [E625];Data Unavailable [DU]"]
[null,null,null,"SW9081","EPA 9081 Cation-Exchange Capacity of Soils [SW9081]",null,null,null,null,null,"L","B","Boron, Dissolved",null,null,null,null,null,null,null,null,"Boron, Dissolved","kg/L,g/L,mg/L,ppth,ug/L,ng/L,pg/L,mg/cm2,g/day,g/year,kg/day,kg/month,kg/year,lb/day,lbs/week,lbs/month,lbs/year,mg/day,mg/kg,ug/kg,ng/g,ulbs/day,ug/day,t/day","Boron (Colorimetric, Curcumin) [E212.3];HISTORICAL: Inductively Coupled Plasma-Emission [SW6010];Inductively Coupled Plasma Emission - modified for CLP [CL200.7];Inductively Coupled Plasma Emission [E200.7];Inductively Coupled Plasma/Mass Spectroscopy [E200.8];Inductively Coupled Plasma-Atomic Emission Spectroscopy [SW6010B];Inductively Coupled Plasma-Mass Spectrometry [SW6020];Metals by Atomic Absorption [E200.0];Standard Method (19th) 4500-B B: Boron by Curcumin Method [A4500BB];Data Unavailable [DU]"]
[null,null,null,"E625","Extractable Priority Pollutants [E625]",null,null,null,null,null,null,"B","Boron, Total",null,null,null,null,null,null,null,null,"Boron, Total","kg/L,g/L,mg/L,ppth,ug/L,ng/L,pg/L,mg/cm2,g/day,g/year,kg/day,kg/month,kg/year,lb/day,lbs/week,lbs/month,lbs/year,mg/day,mg/kg,ug/kg,ng/g,ulbs/day,ug/day,t/day","Boron (Colorimetric, Curcumin) [E212.3];HISTORICAL: Inductively Coupled Plasma-Emission [SW6010];Inductively Coupled Plasma Emission - modified for CLP [CL200.7];Inductively Coupled Plasma Emission [E200.7];Inductively Coupled Plasma/Mass Spectroscopy [E200.8];Inductively Coupled Plasma-Atomic Emission Spectroscopy [SW6010B];Inductively Coupled Plasma-Mass Spectrometry [SW6020];Metals by Atomic Absorption [E200.0];Standard Method (19th) 4500-B B: Boron by Curcumin Method [A4500BB];Data Unavailable [DU]"]
[null,null,null,"E625SIM","Extractable Priority Pollutants by GC/MS SIM [E625SIM]",null,null,null,null,null,"N","B","Boron, Total Recoverable",null,null,null,null,null,null,null,null,"Boron, Total Recoverable","kg/L,g/L,mg/L,ppth,ug/L,ng/L,pg/L,mg/cm2,g/day,g/year,kg/day,kg/month,kg/year,lb/day,lbs/week,lbs/month,lbs/year,mg/day,mg/kg,ug/kg,ng/g,ulbs/day,ug/day,t/day","Boron (Colorimetric, Curcumin) [E212.3];HISTORICAL: Inductively Coupled Plasma-Emission [SW6010];Inductively Coupled Plasma Emission - modified for CLP [CL200.7];Inductively Coupled Plasma Emission [E200.7];Inductively Coupled Plasma/Mass Spectroscopy [E200.8];Inductively Coupled Plasma-Atomic Emission Spectroscopy [SW6010B];Inductively Coupled Plasma-Mass Spectrometry [SW6020];Metals by Atomic Absorption [E200.0];Standard Method (19th) 4500-B B: Boron by Curcumin Method [A4500BB];Data Unavailable [DU]"]
[null,null,null,"SW9031","Extractable Sulfides [SW9031]",null,null,null,null,null,null,"BR","Bromide",null,null,null,null,null,null,null,null,"Bromide","kg/L,g/L,mg/L,ppth,ug/L,ng/L,pg/L,mg/cm2,g/day,g/year,kg/day,kg/month,kg/year,lb/day,lbs/week,lbs/month,lbs/year,mg/day,mg/kg,ug/kg,ng/g,ulbs/day,ug/day,t/day","Bromide [E320.1];Inorganic Anions by Ion Chromatography [E300.0];Data Unavailable [DU]"]
[null,null,null,"E1000.0","Fathead Minnow Larval Survival and Growth Test [E1000.0]",null,null,null,null,null,null,"BRACETICA ","Bromoacetic Acid",null,null,null,null,null,null,null,null,"Bromoacetic Acid","kg/L,g/L,mg/L,ppth,ug/L,ng/L,pg/L,mg/cm2,g/day,g/year,kg/day,kg/month,kg/year,lb/day,lbs/week,lbs/month,lbs/year,mg/day,mg/kg,ug/kg,ng/g,ulbs/day,ug/day,t/day","Data Unavailable [DU]"]
[null,null,null,"SW1010","Flash Point (Closed-Cup Tester) [SW1010]",null,null,null,null,null,null,"BRBZ","Bromobenzene",null,null,null,null,null,null,null,null,"Bromobenzene","kg/L,g/L,mg/L,ppth,ug/L,ng/L,pg/L,mg/cm2,g/day,g/year,kg/day,kg/month,kg/year,lb/day,lbs/week,lbs/month,lbs/year,mg/day,mg/kg,ug/kg,ng/g,ulbs/day,ug/day,t/day","GC/MS SIM Method [SIM];HISTORICAL: Volatile Organic Compounds by GC/MS [SW8260];Semivolatile Organic Compounds by GC/MS [SW8270C];Volatile Organic Compounds by GC/MS [SW8260B];Data Unavailable [DU]"]
[null,null,null,"ASTMD93","Flash Point, (Open Cup) [ASTMD93]",null,null,null,null,null,null,"BRCLME","Bromochloromethane",null,null,null,null,null,null,null,null,"Bromochloromethane","kg/L,g/L,mg/L,ppth,ug/L,ng/L,pg/L,mg/cm2,g/day,g/year,kg/day,kg/month,kg/year,lb/day,lbs/week,lbs/month,lbs/year,mg/day,mg/kg,ug/kg,ng/g,ulbs/day,ug/day,t/day","Extractable Priority Pollutants [E625];GC/MS SIM Method [SIM];HISTORICAL: Volatile Organic Compounds by GC/MS [SW8260];Semivolatile Organic Compounds by GC/MS [SW8270C];Volatile Organic Compounds by GC/MS [SW8260B];Volatile Organic Compounds EPA Method 624 [E624];Purgeables by GC/MS [E624.1];Data Unavailable [DU]"]
[null,null,null,"E340.1","Fluoride [E340.1]",null,null,null,null,null,null,"TBME","Bromoform",null,null,null,null,null,null,null,null,"Bromoform","kg/L,g/L,mg/L,ppth,ug/L,ng/L,pg/L,mg/cm2,g/day,g/year,kg/day,kg/month,kg/year,lb/day,lbs/week,lbs/month,lbs/year,mg/day,mg/kg,ug/kg,ng/g,ulbs/day,ug/day,t/day","Chlorinated and Halogenated Compounds by L-L Extraction, GC/ECD [E551.1];Extractable Priority Pollutants [E625];Extractable Priority Pollutants by GC/MS SIM [E625SIM];GC/MS SIM Method [SIM];HISTORICAL: Volatile Organic Compounds by GC/MS [SW8260];Semivolatile Organic Compounds by GC/MS [SW8270C];VOCs by GC/MS Fuel Additives Plus BTEX [8260FAB];Volatile Organic Compounds by GC/MS - Open Scan [8260BOS];Volatile Organic Compounds by GC/MS [SW8260B];Volatile Organic Compounds by Purge and Trap [E524.2];Volatile Organic Compounds EPA Method 624 [E624];Purgeables by GC/MS [E624.1];Data Unavailable [DU]"]
[null,null,null,"E340.2","Fluoride [E340.2]",null,null,null,null,null,null,"BRME","Bromomethane",null,null,null,null,null,null,null,null,"Bromomethane","kg/L,g/L,mg/L,ppth,ug/L,ng/L,pg/L,mg/cm2,g/day,g/year,kg/day,kg/month,kg/year,lb/day,lbs/week,lbs/month,lbs/year,mg/day,mg/kg,ug/kg,ng/g,ulbs/day,ug/day,t/day","Bromide [E320.1];Extractable Priority Pollutants [E625];Extractable Priority Pollutants by GC/MS SIM [E625SIM];HISTORICAL: Volatile Organic Compounds by GC/MS [SW8260];Semivolatile Organic Compounds by GC/MS [SW8270C];VOCs by GC/MS Fuel Additives Plus BTEX [8260FAB];Volatile Organic Compounds by GC/MS - Open Scan [8260BOS];Volatile Organic Compounds by GC/MS [SW8260B];Volatile Organic Compounds by GC/MS SIM [8260SIM];Volatile Organic Compounds by Purge and Trap [E524.2];Volatile Organic Compounds EPA Method 624 [E624];Purgeables by GC/MS [E624.1];Data Unavailable [DU]"]
[null,null,null,"E340.3","Fluoride [E340.3]",null,null,null,null,null,null,"BROXL","Bromoxynil",null,null,null,null,null,null,null,null,"Bromoxynil","kg/L,g/L,mg/L,ppth,ug/L,ng/L,pg/L,mg/cm2,g/day,g/year,kg/day,kg/month,kg/year,lb/day,lbs/week,lbs/month,lbs/year,mg/day,mg/kg,ug/kg,ng/g,ulbs/day,ug/day,t/day","Extractable Priority Pollutants [E625];Semivolatile Organic Compounds by GC/MS [SW8270C];Data Unavailable [DU]"]
[null,null,null,"E340.2M","Fluoride Modified [E340.2M]",null,null,null,null,null,null,"BBP","Butylbenzyl Phthalate",null,null,null,null,null,null,null,null,"Butylbenzyl Phthalate","kg/L,g/L,mg/L,ppth,ug/L,ng/L,pg/L,mg/cm2,g/day,g/year,kg/day,kg/month,kg/year,lb/day,lbs/week,lbs/month,lbs/year,mg/day,mg/kg,ug/kg,ng/g,ulbs/day,ug/day,t/day","Extractable Priority Pollutants [E625];Extractable Priority Pollutants by GC/MS SIM [E625SIM];GC/MS SIM Method [SIM];HISTORICAL: Semivolatile Organic Compounds by GC/MS [SW8270];HISTORICAL: Semivolatile Organic Compounds by GC/MS [SW8270A];Phthalate Esters [SW8060];Semivolatile Organic Compounds by GC/MS - Open Scan [8270COS];Semivolatile Organic Compounds by GC/MS [SW8270C];Semivolatile Organic Compounds by Isotope Dilution GCMS [E1625C];Volatile Organic Compounds by GC/MS [SW8260B];Volatile Organic Compounds by GC/MS SIM [8260SIM];Volatile Organic Compounds EPA Method 624 [E624];Base/Neutrals and Acids by GC/MS [E625.1];Data Unavailable [DU]"]
[null,null,null,"N2541","Formaldehyde by GC [N2541]",null,null,null,null,null,null,"593-45-3","C10C10N",null,null,null,null,null,null,null,null,"Cadmium, Dissolved","kg/L,g/L,mg/L,ppth,ug/L,ng/L,pg/L,mg/cm2,g/day,g/year,kg/day,kg/month,kg/year,lb/day,lbs/week,lbs/month,lbs/year,mg/day,mg/kg,ug/kg,ng/g,ulbs/day,ug/day,t/day","Trace Elements in Ambient Waters by ICP-MS [E1638];Trace Elements in Water by Preconcentration and ICP-MS [E1640];Atomic Absorption, Platform [E200.9];Cadmium (AA, Direct Aspiration) [E213.1];Cadmium (AA, Direct Aspiration) [SW7130];Cadmium (AA, Furnace Technique) [SW7131A];Cadmium (AA, Furnace) - modified for CLP [CL213.2];Cadmium (AA, Furnace) [E213.2];HISTORICAL: Inductively Coupled Plasma-Emission [SW6010];Inductively Coupled Plasma Emission - modified for CLP [CL200.7];Inductively Coupled Plasma Emission [E200.7];Inductively Coupled Plasma/Mass Spectroscopy [E200.8];Inductively Coupled Plasma-Atomic Emission Spectroscopy [SW6010B];Inductively Coupled Plasma-Mass Spectrometry [SW6020];Metals by Atomic Absorption [E200.0];Standard Method (19th) 3111 B: Metals, Direct Air-Acetylene Flame [A3111B];Standard Method (19th) 3113: Metals by Electrothermal AAS [A3113];Standard Method (19th) 3113: Metals by Furnace AAS [A3113B];Trace Elements in Ambient Waters by Stabilized [E1639];Data Unavailable [DU]"]
[null,null,null,"FREEZE","Freeze-dried Solids per PSEP Guidelines for Tissues (1997) [FREEZE]",null,null,null,null,null,"L","CD","Cadmium, Dissolved",null,null,null,null,null,null,null,null,"Cadmium, Total","kg/L,g/L,mg/L,ppth,ug/L,ng/L,pg/L,mg/cm2,g/day,g/year,kg/day,kg/month,kg/year,lb/day,lbs/week,lbs/month,lbs/year,mg/day,mg/kg,ug/kg,ng/g,ulbs/day,ug/day,t/day","Trace Elements in Ambient Waters by ICP-MS [E1638];Trace Elements in Water by Preconcentration and ICP-MS [E1640];Atomic Absorption, Platform [E200.9];Cadmium (AA, Direct Aspiration) [E213.1];Cadmium (AA, Direct Aspiration) [SW7130];Cadmium (AA, Furnace Technique) [SW7131A];Cadmium (AA, Furnace) - modified for CLP [CL213.2];Cadmium (AA, Furnace) [E213.2];HISTORICAL: Inductively Coupled Plasma-Emission [SW6010];Inductively Coupled Plasma Emission - modified for CLP [CL200.7];Inductively Coupled Plasma Emission [E200.7];Inductively Coupled Plasma/Mass Spectroscopy [E200.8];Inductively Coupled Plasma-Atomic Emission Spectroscopy [SW6010B];Inductively Coupled Plasma-Mass Spectrometry [SW6020];Metals by Atomic Absorption [E200.0];Standard Method (19th) 3111 B: Metals, Direct Air-Acetylene Flame [A3111B];Standard Method (19th) 3113: Metals by Electrothermal AAS [A3113];Standard Method (19th) 3113: Metals by Furnace AAS [A3113B];Trace Elements in Ambient Waters by Stabilized [E1639];Data Unavailable [DU]"]
[null,null,null,"CENPD","Fuel Identification and Quantification-COE [CENPD]",null,null,null,null,null,null,"CD","Cadmium, Total",null,null,null,null,null,null,null,null,"Cadmium, Total Recoverable","kg/L,g/L,mg/L,ppth,ug/L,ng/L,pg/L,mg/cm2,g/day,g/year,kg/day,kg/month,kg/year,lb/day,lbs/week,lbs/month,lbs/year,mg/day,mg/kg,ug/kg,ng/g,ulbs/day,ug/day,t/day","Trace Elements in Ambient Waters by ICP-MS [E1638];Trace Elements in Water by Preconcentration and ICP-MS [E1640];Atomic Absorption, Platform [E200.9];Cadmium (AA, Direct Aspiration) [E213.1];Cadmium (AA, Direct Aspiration) [SW7130];Cadmium (AA, Furnace Technique) [SW7131A];Cadmium (AA, Furnace) - modified for CLP [CL213.2];Cadmium (AA, Furnace) [E213.2];HISTORICAL: Inductively Coupled Plasma-Emission [SW6010];Inductively Coupled Plasma Emission - modified for CLP [CL200.7];Inductively Coupled Plasma Emission [E200.7];Inductively Coupled Plasma/Mass Spectroscopy [E200.8];Inductively Coupled Plasma-Atomic Emission Spectroscopy [SW6010B];Inductively Coupled Plasma-Mass Spectrometry [SW6020];Metals by Atomic Absorption [E200.0];Standard Method (19th) 3111 B: Metals, Direct Air-Acetylene Flame [A3111B];Standard Method (19th) 3113: Metals by Electrothermal AAS [A3113];Standard Method (19th) 3113: Metals by Furnace AAS [A3113B];Trace Elements in Ambient Waters by Stabilized [E1639];Data Unavailable [DU]"]
[null,null,null,"E901.1","Gamm-Emitting Radionuclides in Drinking Water",null,null,null,null,null,"N","CD","Cadmium, Total Recoverable",null,null,null,null,null,null,null,null,"Calcium, Dissolved","kg/L,g/L,mg/L,ppth,ug/L,ng/L,pg/L,mg/cm2,g/day,g/year,kg/day,kg/month,kg/year,lb/day,lbs/week,lbs/month,lbs/year,mg/day,mg/kg,ug/kg,ng/g,ulbs/day,ug/day,t/day","Calcium (AA, Direct Aspiration) - modified for CLP [CL215.1];Calcium (AA, Direct Aspiration) [E215.1];Calcium (AA, Direct Aspiration) [SW7140];Calcium (Titrimetric, EDTA ) [E215.2];Inductively Coupled Plasma Emission - modified for CLP [CL200.7];Inductively Coupled Plasma Emission [E200.7];Inductively Coupled Plasma/Mass Spectroscopy [E200.8];Inductively Coupled Plasma-Atomic Emission Spectroscopy [SW6010B];Metals by Atomic Absorption [E200.0];Standard Method (19th) 3111 B: Metals, Direct Air-Acetylene Flame [A3111B];Data Unavailable [DU]"]
[null,null,null,"AK101AA","Gasoline Range Organics (Aliphatics/Aromatics), ADEC [AK101AA]",null,null,null,null,null,"L","CA","Calcium, Dissolved",null,null,null,null,null,null,null,null,"Calcium, Total","kg/L,g/L,mg/L,ppth,ug/L,ng/L,pg/L,mg/cm2,g/day,g/year,kg/day,kg/month,kg/year,lb/day,lbs/week,lbs/month,lbs/year,mg/day,mg/kg,ug/kg,ng/g,ulbs/day,ug/day,t/day","Calcium (AA, Direct Aspiration) - modified for CLP [CL215.1];Calcium (AA, Direct Aspiration) [E215.1];Calcium (AA, Direct Aspiration) [SW7140];Calcium (Titrimetric, EDTA ) [E215.2];Inductively Coupled Plasma Emission - modified for CLP [CL200.7];Inductively Coupled Plasma Emission [E200.7];Inductively Coupled Plasma/Mass Spectroscopy [E200.8];Inductively Coupled Plasma-Atomic Emission Spectroscopy [SW6010B];Metals by Atomic Absorption [E200.0];Standard Method (19th) 3111 B: Metals, Direct Air-Acetylene Flame [A3111B];Data Unavailable [DU]"]
[null,null,null,"AK101","Gasoline Range Organics, Alaska Dept. of Environment. Conserv. [AK101]",null,null,null,null,null,null,"CA","Calcium, Total",null,null,null,null,null,null,null,null,"Calcium, Total Recoverable","kg/L,g/L,mg/L,ppth,ug/L,ng/L,pg/L,mg/cm2,g/day,g/year,kg/day,kg/month,kg/year,lb/day,lbs/week,lbs/month,lbs/year,mg/day,mg/kg,ug/kg,ng/g,ulbs/day,ug/day,t/day","Calcium (AA, Direct Aspiration) - modified for CLP [CL215.1];Calcium (AA, Direct Aspiration) [E215.1];Calcium (AA, Direct Aspiration) [SW7140];Calcium (Titrimetric, EDTA ) [E215.2];Inductively Coupled Plasma Emission - modified for CLP [CL200.7];Inductively Coupled Plasma Emission [E200.7];Inductively Coupled Plasma/Mass Spectroscopy [E200.8];Inductively Coupled Plasma-Atomic Emission Spectroscopy [SW6010B];Metals by Atomic Absorption [E200.0];Standard Method (19th) 3111 B: Metals, Direct Air-Acetylene Flame [A3111B];Data Unavailable [DU]"]
[null,null,null,"RSK147","GC Analysis of Gas Samples (Inter'l J. Env. Anal. Chem. 1991) [RSK147]",null,null,null,null,null,"N","CA","Calcium, Total Recoverable",null,null,null,null,null,null,null,null,"Carbamazepine","kg/L,g/L,mg/L,ppth,ug/L,ng/L,pg/L,mg/cm2,g/day,g/year,kg/day,kg/month,kg/year,lb/day,lbs/week,lbs/month,lbs/year,mg/day,mg/kg,ug/kg,ng/g,ulbs/day,ug/day,t/day","Pharmaceuticals, Hormones, and Personal Care Products using LC-MS-MS by Eaton Eurofin;Data Unavailable [DU]"]
[null,null,null,"BTSN","GC Determ. of Butyltins in Water (Chemosphere, Vol. 15, No. 4) [BTSN]",null,null,null,null,null,null,"CARBAMPINE","Carbamazepine",null,null,null,null,null,null,null,null,"Carbaryl","kg/L,g/L,mg/L,ppth,ug/L,ng/L,pg/L,mg/cm2,g/day,g/year,kg/day,kg/month,kg/year,lb/day,lbs/week,lbs/month,lbs/year,mg/day,mg/kg,ug/kg,ng/g,ulbs/day,ug/day,t/day","N-Methylcarbamoyloximes & N-Methylcarbamates in Water by HPLC [E531.1];Semivolatile Organic Compounds by GC/MS [SW8270C];Data Unavailable [DU]"]
[null,null,null,"SIM","GC/MS SIM Method [SIM]",null,null,null,null,null,null,"SEVIN","Carbaryl",null,null,null,null,null,null,null,null,"Carbazole","kg/L,g/L,mg/L,ppth,ug/L,ng/L,pg/L,mg/cm2,g/day,g/year,kg/day,kg/month,kg/year,lb/day,lbs/week,lbs/month,lbs/year,mg/day,mg/kg,ug/kg,ng/g,ulbs/day,ug/day,t/day","Base/Neutrals and Acids by GC/MS [E625.1];Data Unavailable [DU]"]
[null,null,null,"CA30791","GC/SCD Reduced Sulfur Analysis (based on SCAQMD Method 307-91) [CA30791]",null,null,null,null,null,null,"CARBAZOLE","Carbazole",null,null,null,null,null,null,null,null,"Carbofuran","kg/L,g/L,mg/L,ppth,ug/L,ng/L,pg/L,mg/cm2,g/day,g/year,kg/day,kg/month,kg/year,lb/day,lbs/week,lbs/month,lbs/year,mg/day,mg/kg,ug/kg,ng/g,ulbs/day,ug/day,t/day","N-Methylcarbamoyloximes & N-Methylcarbamates in Water by HPLC [E531.1];Pesticides, Carbamate and Urea [E632];Volatile Organic Compounds EPA Method 624 [E624];Data Unavailable [DU]"]
[null,null,null,"N5523","Glycols by NIOSH Method 5523 [N5523]",null,null,null,null,null,null,"CRBFN","Carbofuran",null,null,null,null,null,null,null,null,"Carbon disulfide","kg/L,g/L,mg/L,ppth,ug/L,ng/L,pg/L,mg/cm2,g/day,g/year,kg/day,kg/month,kg/year,lb/day,lbs/week,lbs/month,lbs/year,mg/day,mg/kg,ug/kg,ng/g,ulbs/day,ug/day,t/day","Extractable Priority Pollutants [E625];Volatile Organic Compounds by GC/MS [SW8260B];Volatile Organic Compounds EPA Method 624 [E624];Purgeables by GC/MS [E624.1];Data Unavailable [DU]"]
[null,null,null,"E547","Glyphosate in Drinking Water by HPCL, PCD, & FD [E547]",null,null,null,null,null,null,"CDS","Carbon disulfide",null,null,null,null,null,null,null,null,"Carbon Tetrachloride","kg/L,g/L,mg/L,ppth,ug/L,ng/L,pg/L,mg/cm2,g/day,g/year,kg/day,kg/month,kg/year,lb/day,lbs/week,lbs/month,lbs/year,mg/day,mg/kg,ug/kg,ng/g,ulbs/day,ug/day,t/day","Chloride (as CI) Modified [E325.3M];Extractable Priority Pollutants [E625];Extractable Priority Pollutants by GC/MS SIM [E625SIM];GC/MS SIM Method [SIM];HISTORICAL: Volatile Organic Compounds by GC/MS [SW8260];Organochlorine Pesticides and PCBs [E608];Organochlorine Pesticides by Gas Chromatography [SW8081A];Semivolatile Organic Compounds by GC/MS [SW8270C];Standard Method (18th) 5210: Biochemical Oxygen Demand [A5210];Sulfite [E377.1];VOCs by GC/MS Fuel Additives Plus BTEX [8260FAB];Volatile Organic Compounds by GC/MS - Open Scan [8260BOS];Volatile Organic Compounds by GC/MS [SW8260B];Volatile Organic Compounds by Purge and Trap [E524.2];Volatile Organic Compounds EPA Method 624 [E624];Purgeables by GC/MS [E624.1];Data Unavailable [DU]"]
[null,null,null,"E231.1","Gold (AA, Direct Aspiration) [E231.1]",null,null,null,null,null,null,"CTCL","Carbon Tetrachloride",null,null,null,null,null,null,null,null,"Carbonaceous Biochemical Oxygen Demand (CBOD) (5-day @ 20 Deg. C)","kg/L,g/L,mg/L,ppth,ug/L,ng/L,pg/L,mg/cm2,g/day,g/year,kg/day,kg/month,kg/year,lb/day,lbs/week,lbs/month,lbs/year,mg/day,mg/kg,ug/kg,ng/g,ulbs/day,ug/day,t/day","Biochemical Oxygen Demand [E405.1];Standard Method (18th & 19th) 5210 B: 5-Day BOD Test [A5210B];Standard Method (18th) 5210: Biochemical Oxygen Demand [A5210];Data Unavailable [DU]"]
[null,null,null,"E231.2","Gold (AA, Furnace) [E231.2]",null,null,null,null,null,null,"CBOD","Carbonaceous Biochemical Oxygen Demand (CBOD) (5-day @ 20 Deg. C)",null,null,null,null,null,null,null,null,"Carbonaceous Biochemical Oxygen Demand (CBOD) (5-day @ 20 Deg. C), Percent Removal","%","Data Unavailable [DU]"]
[null,null,null,"SW7010","Graphite Furnace Atomic Absorption Spectrophotometry [SW7010]",null,null,null,null,null,"U","CBOD","Carbonaceous Biochemical Oxygen Demand (CBOD) (5-day @ 20 Deg. C), Percent Removal",null,null,null,null,null,null,null,null,"Carbonate Ion (as CO3)",{"$f":"$AG$8","v":"kg/L,g/L,mg/L,ppth,ug/L,ng/L,pg/L,mg/cm2,g/day,g/year,kg/day,kg/month,kg/year,lb/day,lbs/week,lbs/month,lbs/year,mg/day,mg/kg,ug/kg,ng/g,ulbs/day,ug/day,t/day"},"Alkalinity, Total (as Carbonate) [E310.1];Carbonyl Compounds by GC/MS [E556];Standard Method (18th & 19th) 2320 B: Alkalinity by Titration [A2320B];Standard Method 4500-CO2 D: CO2 and Forms of Alkalinity by Calc. [A4500DA];Data Unavailable [DU]"]
[null,null,null,"E1003.0","Green Algae GrowthTest [E1003.0]",null,null,null,null,null,null,"CO3","Carbonate Ion (as CO3)",null,null,null,null,null,null,null,null,"Carbophenothion",{"$f":"$AG$8","v":"kg/L,g/L,mg/L,ppth,ug/L,ng/L,pg/L,mg/cm2,g/day,g/year,kg/day,kg/month,kg/year,lb/day,lbs/week,lbs/month,lbs/year,mg/day,mg/kg,ug/kg,ng/g,ulbs/day,ug/day,t/day"},"Data Unavailable [DU]"]
[null,null,null,"E900","Gross Alpha and Beta Radiation [E900]",null,null,null,null,null,null,"CARBOPHENOTH","Carbophenothion",null,null,null,null,null,null,null,null,"Carfentrazone ",{"$f":"$AG$8","v":"kg/L,g/L,mg/L,ppth,ug/L,ng/L,pg/L,mg/cm2,g/day,g/year,kg/day,kg/month,kg/year,lb/day,lbs/week,lbs/month,lbs/year,mg/day,mg/kg,ug/kg,ng/g,ulbs/day,ug/day,t/day"},"Data Unavailable [DU]"]
[null,null,null,"SW9310","Gross Alpha and Gross Beta [SW9310]",null,null,null,null,null,null,"CARFENTRAZ","Carfentrazone ",null,null,null,null,null,null,null,null,"Cation Total","meq/L","Inductively Coupled Plasma Emission [E200.7];Standard Method 1030F1: Cation-Anion Balance Calculation [A1030F1];Data Unavailable [DU]"]
[null,null,null,"H8000","HACH Chemical Oxygen Demand, Method 8000 [H8000]",null,null,null,null,null,null,"TOTCATIONS","Cation Total",null,null,null,null,null,null,null,null,"Cesium 137","PCi/L","Data Unavailable [DU]"]
[null,null,null,"H8160","HACH Conductivity, Method 8160 [H8160]",null,null,null,null,null,null,"CS-137","Cesium 137",null,null,null,null,null,null,null,null,"Chemical Oxygen Demand (COD)",{"$f":"$AG$8","v":"kg/L,g/L,mg/L,ppth,ug/L,ng/L,pg/L,mg/cm2,g/day,g/year,kg/day,kg/month,kg/year,lb/day,lbs/week,lbs/month,lbs/year,mg/day,mg/kg,ug/kg,ng/g,ulbs/day,ug/day,t/day"},"Chemical Oxygen Demand - Colorimetric [E410.4];Chemical Oxygen Demand [E410];HACH Chemical Oxygen Demand, Method 8000 [H8000];Standard Method (19th) 5220 B: COD by Open Reflux Method [A5220B];Standard Method (19th) 5220 C: COD Closed Reflux, Titrimetric [A5220C];Standard Method (19th) 5220 D: COD Closed Reflux, Colorimetric [A5220D];Data Unavailable [DU]"]
[null,null,null,"H10360","HACH Dissolved Oxygen by LDO, Method 10360 [H10360]",null,null,null,null,null,null,"COD","Chemical Oxygen Demand (COD)",null,null,null,null,null,null,null,null,"Chloramben             ","kg/L,g/L,mg/L,ppth,ug/L,ng/L,pg/L,mg/cm2,g/day,g/year,kg/day,kg/month,kg/year,lb/day,lbs/week,lbs/month,lbs/year,mg/day,mg/kg,ug/kg,ng/g,ulbs/day,ug/day,t/day","Chlorinated Herbicides by GC [SW8151A];Data Unavailable [DU]"]
[null,null,null,"H8146","HACH Ferrous Iron Field Test, Method 8146 [H8146]",null,null,null,null,null,null,"CLBEN","Chloramben ",null,null,null,null,null,null,null,null,"Chloramine-T","kg/L,g/L,mg/L,ppth,ug/L,ng/L,pg/L,mg/cm2,g/day,g/year,kg/day,kg/month,kg/year,lb/day,lbs/week,lbs/month,lbs/year,mg/day,mg/kg,ug/kg,ng/g,ulbs/day,ug/day,t/day","Data Unavailable [DU]"]
[null,null,null,"H10206","HACH Nitrate, Method 10206 [H10206]",null,null,null,null,null,null,"CHLORAMINET","Chloramine-T",null,null,null,null,null,null,null,null,"Chlorate","kg/L,g/L,mg/L,ppth,ug/L,ng/L,pg/L,mg/cm2,g/day,g/year,kg/day,kg/month,kg/year,lb/day,lbs/week,lbs/month,lbs/year,mg/day,mg/kg,ug/kg,ng/g,ulbs/day,ug/day,t/day","Inorganic Anions by Ion Chromatography [E300.0]"]
[null,null,null,"E552.1","Haloacetic Acids & Dalapon in Drinking Water by IELSE & GC [E552.1]",null,null,null,null,null,null,"CHLORATE","Chlorate",null,null,null,null,null,null,null,null,"Chlordane","kg/L,g/L,mg/L,ppth,ug/L,ng/L,pg/L,mg/cm2,g/day,g/year,kg/day,kg/month,kg/year,lb/day,lbs/week,lbs/month,lbs/year,mg/day,mg/kg,ug/kg,ng/g,ulbs/day,ug/day,t/day","Chlorinated Pesticides in Groundwater [E508];Extractable Priority Pollutants [E625];Extractable Priority Pollutants by GC/MS SIM [E625SIM];GC/MS SIM Method [SIM];HISTORICAL: Organochlorine Pesticides & PCBs as Aroclors by GC [SW8081];HISTORICAL: Organochlorine Pesticides and PCBs [SW8080];Organochlorine Pesticides and PCBs [E608];Organochlorine Pesticides and PCBs by GC/HSD [E608.3];Organochlorine Pesticides by Gas Chromatography [SW8081A];Semivolatile Organic Compounds by GC/MS [SW8270C];Semivolatile Organic Compounds by Isotope Dilution GCMS [E1625C];Volatile Organic Compounds EPA Method 624 [E624];Data Unavailable [DU]"]
[null,null,null,"E552.2","Haloacetic Acids & Dalapon in Drinking Water by LLE, Deriv. & GC [E552.2]",null,null,null,null,null,null,"CHLORDANE","Chlordane",null,null,null,null,null,null,null,null,"Chlorfenvinphos","kg/L,g/L,mg/L,ppth,ug/L,ng/L,pg/L,mg/cm2,g/day,g/year,kg/day,kg/month,kg/year,lb/day,lbs/week,lbs/month,lbs/year,mg/day,mg/kg,ug/kg,ng/g,ulbs/day,ug/day,t/day","Data Unavailable [DU]"]
[null,null,null,"SW8021B","Halogenated and Aromatic Volatiles by GC using Photoionization [SW8021B]",null,null,null,null,null,null,"CVP","Chlorfenvinphos",null,null,null,null,null,null,null,null,"Chloride","kg/L,g/L,mg/L,ppth,ug/L,ng/L,pg/L,mg/cm2,g/day,g/year,kg/day,kg/month,kg/year,lb/day,lbs/week,lbs/month,lbs/year,mg/day,mg/kg,ug/kg,ng/g,ulbs/day,ug/day,t/day","Chloride (as CI) Modified [E325.3M];Chloride (as Cl) [E325.1];Chloride (as Cl) [E325.3];Chloride (as Cl) Modified [E325.2M];Chloride (Titrimetric, Mercuric Nitrate) [SW9252];Chloride (Titrimetric, Silver Nitrate) [SW9253];Determination of Inorganic Anions by Ion Chromatography [SW9056];Inorganic Anions by Ion Chromatography [E300.0];Inorganic Anions by Ion Chromatography [E300.1];Inorganic Anions by Ion Chromatography, Part B [E300B];Standard Method (19th) 4500-Cl C: Mercuric Nitrate Method [A4500C];Standard Method (19th) 4500-Cl G: Chlorine: DPD Colorimetric [A4500CL];Standard Method (19th) 4500-Cl: Chloride (Argentometric Method) [A4500B];Data Unavailable [DU]"]
[null,null,null,"SW8010B","Halogenated Volatile Organics by Gas Chromatography [SW8010B]",null,null,null,null,null,null,"CL","Chloride",null,null,null,null,null,null,null,null,"Chlorine Usage","kg/L,g/L,mg/L,ppth,ug/L,ng/L,pg/L,mg/cm2,g/day,g/year,kg/day,kg/month,kg/year,lb/day,lbs/week,lbs/month,lbs/year,mg/day,mg/kg,ug/kg,ng/g,ulbs/day,ug/day,t/day","Data Unavailable [DU]"]
[null,null,null,"3810HVO","Halogenated Volatile Organics by Headspace [3810HVO]",null,null,null,null,null,null,"CHLORINEU","Chlorine Usage",null,null,null,null,null,null,null,null,"Chlorine, Free Available","kg/L,g/L,mg/L,ppth,ug/L,ng/L,pg/L,mg/cm2,g/day,g/year,kg/day,kg/month,kg/year,lb/day,lbs/week,lbs/month,lbs/year,mg/day,mg/kg,ug/kg,ng/g,ulbs/day,ug/day,t/day","Chlorine, Total Residual (Spectrophotometric, DPD) [E330.5];Chlorine, Total Residual (Titrimetric, Back, Iodometric) [E330.2];Chlorine, Total Residual (Titrimetric, DPD-FAS) [E330.4];Chlorine, Total Residual (Titrimetric, Iodometric) [E330.3];Standard Methods (20th) 4500 Cl- C: Iodometric Method II [A4500CA];Standard Method (19th) 4500-Cl D: Amperometric Titration [A4500LD];Standard Method (19th) 4500-Cl E: Low-Level Amperiometric Titration [A4500LE];Standard Method 4500-Cl F: Chlorine by DPD Ferrous Titrimetric [4500CLF];Standard Method (19th) 4500-Cl G: Chlorine: DPD Colorimetric [A4500CL];Data Unavailable [DU]"]
[null,null,null,"E130.1","Hardness, Total (Colorimetric, Automated EDTA) [E130.1]",null,null,null,null,null,null,"CL2","Chlorine, Free Available",null,null,null,null,null,null,null,null,"Chlorine, Total Residual","kg/L,g/L,mg/L,ppth,ug/L,ng/L,pg/L,mg/cm2,g/day,g/year,kg/day,kg/month,kg/year,lb/day,lbs/week,lbs/month,lbs/year,mg/day,mg/kg,ug/kg,ng/g,ulbs/day,ug/day,t/day","Chlorine, Total Residual (Spectrophotometric, DPD) [E330.5];Chlorine, Total Residual (Titrimetric, Back, Iodometric) [E330.2];Chlorine, Total Residual (Titrimetric, DPD-FAS) [E330.4];Chlorine, Total Residual (Titrimetric, Iodometric) [E330.3];Standard Methods (20th) 4500 Cl- C: Iodometric Method II [A4500CA];Standard Method (19th) 4500-Cl D: Amperometric Titration [A4500LD];Standard Method (19th) 4500-Cl E: Low-Level Amperiometric Titration [A4500LE];Standard Method 4500-Cl F: Chlorine by DPD Ferrous Titrimetric [4500CLF];Standard Method (19th) 4500-Cl G: Chlorine: DPD Colorimetric [A4500CL];Calculated Value [CALCVAL];Data Unavailable [DU]"]
[null,null,null,"E130.2","Hardness, Total (Titrimetric) [E130.2]",null,null,null,null,null,null,"CHLORINE","Chlorine, Total Residual",null,null,null,null,null,null,null,null,"Chloroacetic Acid","kg/L,g/L,mg/L,ppth,ug/L,ng/L,pg/L,mg/cm2,g/day,g/year,kg/day,kg/month,kg/year,lb/day,lbs/week,lbs/month,lbs/year,mg/day,mg/kg,ug/kg,ng/g,ulbs/day,ug/day,t/day","Data Unavailable [DU]"]
[null,null,null,"E1664A","HEM and SGT-HEM by Extraction and Gravimetry, Rev. A [E1664A]",null,null,null,null,null,null,"CAA ","Chloroacetic Acid",null,null,null,null,null,null,null,null,"Chlorobenzene","kg/L,g/L,mg/L,ppth,ug/L,ng/L,pg/L,mg/cm2,g/day,g/year,kg/day,kg/month,kg/year,lb/day,lbs/week,lbs/month,lbs/year,mg/day,mg/kg,ug/kg,ng/g,ulbs/day,ug/day,t/day","Extractable Priority Pollutants [E625];Extractable Priority Pollutants by GC/MS SIM [E625SIM];GC/MS SIM Method [SIM];HISTORICAL: Volatile Organic Compounds by GC/MS [SW8260];Semivolatile Organic Compounds by GC/MS [SW8270C];VOCs by GC/MS Fuel Additives Plus BTEX [8260FAB];Volatile Organic Compounds by GC/MS - Open Scan [8260BOS];Volatile Organic Compounds by GC/MS [SW8260B];Volatile Organic Compounds by Purge and Trap [E524.2];Volatile Organic Compounds EPA Method 624 [E624];Purgeables by GC/MS [E624.1];Data Unavailable [DU]"]
[null,null,null,"E1664B","HEM and SGT-HEM by Extraction and Gravimetry, Rev. B [E1664B]",null,null,null,null,null,null,"CLBZ","Chlorobenzene",null,null,null,null,null,null,null,null,"Chloroethane","kg/L,g/L,mg/L,ppth,ug/L,ng/L,pg/L,mg/cm2,g/day,g/year,kg/day,kg/month,kg/year,lb/day,lbs/week,lbs/month,lbs/year,mg/day,mg/kg,ug/kg,ng/g,ulbs/day,ug/day,t/day","Extractable Priority Pollutants [E625];Extractable Priority Pollutants by GC/MS SIM [E625SIM];GC/MS SIM Method [SIM];HISTORICAL: Volatile Organic Compounds by GC/MS [SW8260];Semivolatile Organic Compounds by GC/MS [SW8270C];Volatile Organic Compounds by GC/MS - Open Scan [8260BOS];Volatile Organic Compounds by GC/MS [SW8260B];Volatile Organic Compounds by Purge and Trap [E524.2];Volatile Organic Compounds EPA Method 624 [E624];Purgeables by GC/MS [E624.1];Data Unavailable [DU]"]
[null,null,null,"SW8280","HIST:Polychlorinated Dibenzodioxins/Polychlorinated Dibenzofurans [SW8280]",null,null,null,null,null,null,"CLEA","Chloroethane",null,null,null,null,null,null,null,null,"Chloroform","kg/L,g/L,mg/L,ppth,ug/L,ng/L,pg/L,mg/cm2,g/day,g/year,kg/day,kg/month,kg/year,lb/day,lbs/week,lbs/month,lbs/year,mg/day,mg/kg,ug/kg,ng/g,ulbs/day,ug/day,t/day","Carbonyl Compounds by GC/MS [E556];Chlorinated and Halogenated Compounds by L-L Extraction, GC/ECD [E551.1];Extractable Priority Pollutants [E625];Extractable Priority Pollutants by GC/MS SIM [E625SIM];GC/MS SIM Method [SIM];Halogenated Volatile Organics by Headspace [3810HVO];HISTORICAL: Volatile Organic Compounds by GC/MS [SW8260];Organochlorine Pesticides and PCBs [E608];Organochlorine Pesticides by Gas Chromatography [SW8081A];Semivolatile Organic Compounds by GC/MS [SW8270C];VOCs by GC/MS Fuel Additives Plus BTEX [8260FAB];Volatile Organic Compounds by GC/MS - Open Scan [8260BOS];Volatile Organic Compounds by GC/MS [SW8260B];Volatile Organic Compounds by Purge and Trap [E524.2];Volatile Organic Compounds EPA Method 624 [E624];Purgeables by GC/MS [E624.1];Data Unavailable [DU]"]
[null,null,null,"SW8020","HISTORICAL: Aromatic Volatile Organics [SW8020]",null,null,null,null,null,null,"TCLME","Chloroform",null,null,null,null,null,null,null,null,"Chloromethane","kg/L,g/L,mg/L,ppth,ug/L,ng/L,pg/L,mg/cm2,g/day,g/year,kg/day,kg/month,kg/year,lb/day,lbs/week,lbs/month,lbs/year,mg/day,mg/kg,ug/kg,ng/g,ulbs/day,ug/day,t/day","Chloride (as CI) Modified [E325.3M];Chloride (as Cl) [E325.1];Extractable Priority Pollutants [E625];Extractable Priority Pollutants by GC/MS SIM [E625SIM];GC/MS SIM Method [SIM];HISTORICAL: Volatile Organic Compounds by GC/MS [SW8260];Semivolatile Organic Compounds by GC/MS [SW8270C];Volatile Organic Compounds by GC/MS - Open Scan [8260BOS];Volatile Organic Compounds by GC/MS [SW8260B];Volatile Organic Compounds by GC/MS SIM [8260SIM];Volatile Organic Compounds by Purge and Trap [E524.2];Volatile Organic Compounds EPA Method 624 [E624];Purgeables by GC/MS [E624.1];Data Unavailable [DU]"]
[null,null,null,"SW7060","HISTORICAL: Arsenic (AA, Furnace Technique) [SW7060]",null,null,null,null,null,null,"CLME","Chloromethane",null,null,null,null,null,null,null,null,"Chlorophyll a","mg/L,ug/L,mg/m3,mg/cm2","Standard Method (19th) 10200 H: Chlorophyll [A10200H];Data Unavailable [DU]"]
[null,null,null,"SW7061","HISTORICAL: Arsenic by Hydride Generation [SW7061]",null,null,null,null,null,null,"CHLOROPHYLLA","Chlorophyll a",null,null,null,null,null,null,null,null,"Chloroprene",{"$f":"$AG$8","v":"kg/L,g/L,mg/L,ppth,ug/L,ng/L,pg/L,mg/cm2,g/day,g/year,kg/day,kg/month,kg/year,lb/day,lbs/week,lbs/month,lbs/year,mg/day,mg/kg,ug/kg,ng/g,ulbs/day,ug/day,t/day"},"Volatile Organic Compounds by GC/MS [SW8260B];Purgeables by GC/MS [E624.1];Data Unavailable [DU]"]
[null,null,null,"SW7131","HISTORICAL: Cadmium (AA, Furnace Technique) [SW7131]",null,null,null,null,null,null,"CHLOROPRENE","Chloroprene",null,null,null,null,null,null,null,null,"Chlorotrifluoroethene","ug/L","Volatile Organic Compounds by GC/MS [SW8260B];Data Unavailable [DU]"]
[null,null,null,"SW8150","HISTORICAL: Chlorinated Herbicides by GC [SW8150]",null,null,null,null,null,null,"CTFE","Chlorotrifluoroethene",null,null,null,null,null,null,null,null,"Chlorpropham",{"$f":"$AG$8","v":"kg/L,g/L,mg/L,ppth,ug/L,ng/L,pg/L,mg/cm2,g/day,g/year,kg/day,kg/month,kg/year,lb/day,lbs/week,lbs/month,lbs/year,mg/day,mg/kg,ug/kg,ng/g,ulbs/day,ug/day,t/day"},"Organic Compounds in Drinking Water by LSE & CCGC/MS [E525.2];Data Unavailable [DU]"]
[null,null,null,"SW8151","HISTORICAL: Chlorinated Herbicides by GC [SW8151]",null,null,null,null,null,null,"CHLORPROPHAM","Chlorpropham",null,null,null,null,null,null,null,null,"Chlorpyrifos","kg/L,g/L,mg/L,ppth,ug/L,ng/L,pg/L,mg/cm2,g/day,g/year,kg/day,kg/month,kg/year,lb/day,lbs/week,lbs/month,lbs/year,mg/day,mg/kg,ug/kg,ng/g,ulbs/day,ug/day,t/day","Determination of Organophosphorus Pesticides [E614];Extractable Priority Pollutants [E625];HISTORICAL: Organophosphorus Compounds by GC [SW8141];Nitrogen- & Phosphorus-Containing Pest. in Water by GC [E507];Organic Compounds in Drinking Water by LSE & CCGC/MS [E525.2];Organophosphorus Compounds by Gas Chromatography [SW8141A];Data Unavailable [DU]"]
[null,null,null,"SW7196","HISTORICAL: Chromium, Hexavalent (Colorimetric) [SW7196]",null,null,null,null,null,null,"CLPYRIFOS","Chlorpyrifos",null,null,null,null,null,null,null,null,"Chlorpyrifos Methyl","kg/L,g/L,mg/L,ppth,ug/L,ng/L,pg/L,mg/cm2,g/day,g/year,kg/day,kg/month,kg/year,lb/day,lbs/week,lbs/month,lbs/year,mg/day,mg/kg,ug/kg,ng/g,ulbs/day,ug/day,t/day","Determination of Organophosphorus Pesticides [E614];Extractable Priority Pollutants [E625];HISTORICAL: Organophosphorus Compounds by GC [SW8141];Nitrogen- & Phosphorus-Containing Pest. in Water by GC [E507];Organic Compounds in Drinking Water by LSE & CCGC/MS [E525.2];Organophosphorus Compounds by Gas Chromatography [SW8141A];Data Unavailable [DU]"]
[null,null,null,"SWVOL","HISTORICAL: Combined Methods SW8010/SW8020, Same Column [SWVOL]",null,null,null,null,null,null,"CLPYRIFOSME","Chlorpyrifos Methyl",null,null,null,null,null,null,null,null,"Chromium (III)","kg/L,g/L,mg/L,ppth,ug/L,ng/L,pg/L,mg/cm2,g/day,g/year,kg/day,kg/month,kg/year,lb/day,lbs/week,lbs/month,lbs/year,mg/day,mg/kg,ug/kg,ng/g,ulbs/day,ug/day,t/day","Calculation for Trivalent Chromium: Total Cr - Hexavalent Cr [CALCCR3];Trace Elements in Ambient Waters by Stabilized [E1639];Chromium (AA, Direct Aspiration) [E218.1];Chromium (AA, Direct Aspiration) [SW7190];Inductively Coupled Plasma Emission - modified for CLP [CL200.7];Inductively Coupled Plasma Emission [E200.7];Inductively Coupled Plasma/Mass Spectroscopy [E200.8];Inductively Coupled Plasma-Atomic Emission Spectroscopy [SW6010B];Metals by Atomic Absorption [E200.0];Standard Method (19th) 3113: Metals by Electrothermal AAS [A3113];Standard Method (19th) 3500-Cr D: Chromium by Colorimetric Method [A3500CD];Data Unavailable [DU]"]
[null,null,null,"SW8290D","HISTORICAL: Draft PC Dibenzodioxins/PC Dibenzofuran [SW8290D]",null,null,null,null,null,null,"CR3","Chromium (III)",null,null,null,null,null,null,null,null,"Chromium (III) Dissolved","kg/L,g/L,mg/L,ppth,ug/L,ng/L,pg/L,mg/cm2,g/day,g/year,kg/day,kg/month,kg/year,lb/day,lbs/week,lbs/month,lbs/year,mg/day,mg/kg,ug/kg,ng/g,ulbs/day,ug/day,t/day","Calculation for Trivalent Chromium: Total Cr - Hexavalent Cr [CALCCR3];Trace Elements in Ambient Waters by Stabilized [E1639];Chromium (AA, Direct Aspiration) [E218.1];Chromium (AA, Direct Aspiration) [SW7190];Inductively Coupled Plasma Emission - modified for CLP [CL200.7];Inductively Coupled Plasma Emission [E200.7];Inductively Coupled Plasma/Mass Spectroscopy [E200.8];Inductively Coupled Plasma-Atomic Emission Spectroscopy [SW6010B];Metals by Atomic Absorption [E200.0];Standard Method (19th) 3113: Metals by Electrothermal AAS [A3113];Standard Method (19th) 3500-Cr D: Chromium by Colorimetric Method [A3500CD];Data Unavailable [DU]"]
[null,null,null,"SW9076D","HISTORICAL: Draft Total Cl in Petrol. Products by Ox. Combst. [SW9076D]",null,null,null,null,null,"L","CR3","Chromium (III) Dissolved",null,null,null,null,null,null,null,null,"Chromium (III) Total Recoverable","kg/L,g/L,mg/L,ppth,ug/L,ng/L,pg/L,mg/cm2,g/day,g/year,kg/day,kg/month,kg/year,lb/day,lbs/week,lbs/month,lbs/year,mg/day,mg/kg,ug/kg,ng/g,ulbs/day,ug/day,t/day","Calculation for Trivalent Chromium: Total Cr - Hexavalent Cr [CALCCR3];Trace Elements in Ambient Waters by Stabilized [E1639];Chromium (AA, Direct Aspiration) [E218.1];Chromium (AA, Direct Aspiration) [SW7190];Inductively Coupled Plasma Emission - modified for CLP [CL200.7];Inductively Coupled Plasma Emission [E200.7];Inductively Coupled Plasma/Mass Spectroscopy [E200.8];Inductively Coupled Plasma-Atomic Emission Spectroscopy [SW6010B];Metals by Atomic Absorption [E200.0];Standard Method (19th) 3113: Metals by Electrothermal AAS [A3113];Standard Method (19th) 3500-Cr D: Chromium by Colorimetric Method [A3500CD];Data Unavailable [DU]"]
[null,null,null,"N5500","HISTORICAL: Ethylene Glycol by NIOSH Method 5500 [N5500]",null,null,null,null,null,"N","CR3","Chromium (III) Total Recoverable",null,null,null,null,null,null,null,null,"Chromium (Total)","kg/L,g/L,mg/L,ppth,ug/L,ng/L,pg/L,mg/cm2,g/day,g/year,kg/day,kg/month,kg/year,lb/day,lbs/week,lbs/month,lbs/year,mg/day,mg/kg,ug/kg,ng/g,ulbs/day,ug/day,t/day","Chromium (AA, Direct Aspiration) [E218.1];Chromium (AA, Direct Aspiration) [SW7190];Chromium (AA, Furnace) [E218.2];Chromium by Chelation - Extraction [E218.3];HISTORICAL: Inductively Coupled Plasma-Emission [SW6010];Inductively Coupled Plasma Emission - modified for CLP [CL200.7];Inductively Coupled Plasma Emission [E200.7];Inductively Coupled Plasma/Mass Spectroscopy [E200.8];Inductively Coupled Plasma-Atomic Emission Spectroscopy [SW6010B];Inductively Coupled Plasma-Mass Spectrometry [SW6020];Metals by Atomic Absorption [E200.0];Standard Method (19th) 3111 B: Metals, Direct Air-Acetylene Flame [A3111B];Standard Method (19th) 3113: Metals by Furnace AAS [A3113B];Standard Method (20th) 3500-Cr B: Colorimetric Method [A3500CB];Standard Method (19th) 3500-Cr D: Chromium by Colorimetric Method [A3500CD];Trace Elements in Water by Preconcentration and ICP-MS [E1640];Data Unavailable [DU]"]
[null,null,null,"SW8240","HISTORICAL: GC/MS for Volatile Organics [SW8240]",null,null,null,null,null,null,"CR","Chromium (Total)",null,null,null,null,null,null,null,null,"Chromium (VI)","kg/L,g/L,mg/L,ppth,ug/L,ng/L,pg/L,mg/cm2,g/day,g/year,kg/day,kg/month,kg/year,lb/day,lbs/week,lbs/month,lbs/year,mg/day,mg/kg,ug/kg,ng/g,ulbs/day,ug/day,t/day","Chromium Hexavalent (AA, Chelation-Extraction) [E218.4];Chromium Hexavalent, Dissolved (AA, Furnace) [E218.5];Chromium, Hexavalent (Colorimetric) [SW7196A];Chromium, Hexavalent (Ion Chromatography) [SW7199];Dissolved Hexavalent Chromium in Water by IC [E218.6];Inductively Coupled Plasma Emission - modified for CLP [CL200.7];Inductively Coupled Plasma Emission [E200.7];Inductively Coupled Plasma/Mass Spectroscopy [E200.8];Metals by Atomic Absorption [E200.0];Standard Method (19th) 3500-Cr D: Chromium by Colorimetric Method [A3500CD];Standard Method (20th) 3500-Cr B: Colorimetric Method [A3500CB];Data Unavailable [DU]"]
[null,null,null,"SW8010","HISTORICAL: Halogenated Volatile Organics by Gas Chromatography [SW8010]",null,null,null,null,null,null,"CR6","Chromium (VI)",null,null,null,null,null,null,null,null,"Chromium (VI) Dissolved","kg/L,g/L,mg/L,ppth,ug/L,ng/L,pg/L,mg/cm2,g/day,g/year,kg/day,kg/month,kg/year,lb/day,lbs/week,lbs/month,lbs/year,mg/day,mg/kg,ug/kg,ng/g,ulbs/day,ug/day,t/day","Chromium Hexavalent (AA, Chelation-Extraction) [E218.4];Chromium Hexavalent, Dissolved (AA, Furnace) [E218.5];Chromium, Hexavalent (Colorimetric) [SW7196A];Chromium, Hexavalent (Ion Chromatography) [SW7199];Dissolved Hexavalent Chromium in Water by IC [E218.6];Inductively Coupled Plasma Emission - modified for CLP [CL200.7];Inductively Coupled Plasma Emission [E200.7];Inductively Coupled Plasma/Mass Spectroscopy [E200.8];Metals by Atomic Absorption [E200.0];Standard Method (19th) 3500-Cr D: Chromium by Colorimetric Method [A3500CD];Standard Method (20th) 3500-Cr B: Colorimetric Method [A3500CB];Data Unavailable [DU]"]
[null,null,null,"SW8010A","HISTORICAL: Halogenated Volatile Organics by Gas Chromatography [SW8010A]",null,null,null,null,null,"L","CR6","Chromium (VI) Dissolved",null,null,null,null,null,null,null,null,"Chromium (VI) Total Recoverable","kg/L,g/L,mg/L,ppth,ug/L,ng/L,pg/L,mg/cm2,g/day,g/year,kg/day,kg/month,kg/year,lb/day,lbs/week,lbs/month,lbs/year,mg/day,mg/kg,ug/kg,ng/g,ulbs/day,ug/day,t/day","Chromium Hexavalent (AA, Chelation-Extraction) [E218.4];Chromium Hexavalent, Dissolved (AA, Furnace) [E218.5];Chromium, Hexavalent (Colorimetric) [SW7196A];Chromium, Hexavalent (Ion Chromatography) [SW7199];Dissolved Hexavalent Chromium in Water by IC [E218.6];Inductively Coupled Plasma Emission - modified for CLP [CL200.7];Inductively Coupled Plasma Emission [E200.7];Inductively Coupled Plasma/Mass Spectroscopy [E200.8];Metals by Atomic Absorption [E200.0];Standard Method (19th) 3500-Cr D: Chromium by Colorimetric Method [A3500CD];Standard Method (20th) 3500-Cr B: Colorimetric Method [A3500CB];Trace Elements in Water by Preconcentration and ICP-MS [E1640];Data Unavailable [DU]"]
[null,null,null,"SW8021","HISTORICAL: Halogenated Volatiles by GC using Photoionization [SW8021]",null,null,null,null,null,"N","CR6","Chromium (VI) Total Recoverable",null,null,null,null,null,null,null,null,"Chromium, Dissolved","kg/L,g/L,mg/L,ppth,ug/L,ng/L,pg/L,mg/cm2,g/day,g/year,kg/day,kg/month,kg/year,lb/day,lbs/week,lbs/month,lbs/year,mg/day,mg/kg,ug/kg,ng/g,ulbs/day,ug/day,t/day","Chromium (AA, Direct Aspiration) [E218.1];Chromium (AA, Direct Aspiration) [SW7190];Chromium (AA, Furnace) [E218.2];Chromium by Chelation - Extraction [E218.3];HISTORICAL: Inductively Coupled Plasma-Emission [SW6010];Inductively Coupled Plasma Emission - modified for CLP [CL200.7];Inductively Coupled Plasma Emission [E200.7];Inductively Coupled Plasma/Mass Spectroscopy [E200.8];Inductively Coupled Plasma-Atomic Emission Spectroscopy [SW6010B];Inductively Coupled Plasma-Mass Spectrometry [SW6020];Metals by Atomic Absorption [E200.0];Standard Method (19th) 3111 B: Metals, Direct Air-Acetylene Flame [A3111B];Standard Method (19th) 3113: Metals by Furnace AAS [A3113B];Standard Method (20th) 3500-Cr B: Colorimetric Method [A3500CB];Standard Method (19th) 3500-Cr D: Chromium by Colorimetric Method [A3500CD];Data Unavailable [DU]"]
[null,null,null,"SW8021A","HISTORICAL: Halogenated Volatiles by GC using Photoionization [SW8021A]",null,null,null,null,null,"L","CR","Chromium, Dissolved",null,null,null,null,null,null,null,null,"Chromium, Total Recoverable","kg/L,g/L,mg/L,ppth,ug/L,ng/L,pg/L,mg/cm2,g/day,g/year,kg/day,kg/month,kg/year,lb/day,lbs/week,lbs/month,lbs/year,mg/day,mg/kg,ug/kg,ng/g,ulbs/day,ug/day,t/day","Chromium (AA, Direct Aspiration) [E218.1];Chromium (AA, Direct Aspiration) [SW7190];Chromium (AA, Furnace) [E218.2];Chromium by Chelation - Extraction [E218.3];HISTORICAL: Inductively Coupled Plasma-Emission [SW6010];Inductively Coupled Plasma Emission - modified for CLP [CL200.7];Inductively Coupled Plasma Emission [E200.7];Inductively Coupled Plasma/Mass Spectroscopy [E200.8];Inductively Coupled Plasma-Atomic Emission Spectroscopy [SW6010B];Inductively Coupled Plasma-Mass Spectrometry [SW6020];Metals by Atomic Absorption [E200.0];Standard Method (19th) 3111 B: Metals, Direct Air-Acetylene Flame [A3111B];Standard Method (19th) 3113: Metals by Furnace AAS [A3113B];Standard Method (20th) 3500-Cr B: Colorimetric Method [A3500CB];Standard Method (19th) 3500-Cr D: Chromium by Colorimetric Method [A3500CD];Data Unavailable [DU]"]
[null,null,null,"E1664","HISTORICAL: HEM and SGT-HEM by Extraction and Gravimetry [E1664]",null,null,null,null,null,"N","CR","Chromium, Total Recoverable",null,null,null,null,null,null,null,null,"Chronic Toxicity-Atlantic Mysid, A.bahia-Growth","% effect,% survival,Pass/Fail (Pass = 0; Fail = 1),TUc","Chronic Toxicity of Effluents/Receiving Water to Marine and Estuarine Organisms (EPA-821-R-02-014) [E821014];Data Unavailable [DU]"]
[null,null,null,"SW1020","HISTORICAL: Ignitability [SW1020]",null,null,null,null,null,null,"CHAMYABAHSG","Chronic Toxicity-Atlantic Mysid, A.bahia-Growth",null,null,null,null,null,null,null,null,"Chronic Toxicity-Atlantic Mysid, A.bahia-Survival","% effect,% survival,Pass/Fail (Pass = 0; Fail = 1),TUc","Chronic Toxicity of Effluents/Receiving Water to Marine and Estuarine Organisms (EPA-821-R-02-014) [E821014];Data Unavailable [DU]"]
[null,null,null,"SW6010A","HISTORICAL: Inductively Coupled Plasma-Atomic Emission Spct. [SW6010A]",null,null,null,null,null,null,"CHAMYABAHS","Chronic Toxicity-Atlantic Mysid, A.bahia-Survival",null,null,null,null,null,null,null,null,"Chronic Toxicity-Bivalve or Oyster-Larval development","% effect,% survival,Pass/Fail (Pass = 0; Fail = 1),TUc","Chronic Toxicity of Effluents/Receiving Water to West Coast Marine/Estuar. Organ. (EPA-600-R-95-136) [E600136];ASTM Guide for Conducting Static Toxicity Tests with Microalgae (ASTM E1218-04(2012)) [D121804];Data Unavailable [DU]"]
[null,null,null,"SW6010","HISTORICAL: Inductively Coupled Plasma-Emission [SW6010]",null,null,null,null,null,null,"CHBIOYSTLARD","Chronic Toxicity-Bivalve or Oyster-Larval development",null,null,null,null,null,null,null,null,"Chronic Toxicity-C.dubia-Reproduction","% effect,% survival,Pass/Fail (Pass = 0; Fail = 1),TUc","Chronic Toxicity of Effluents/ Receiving Water to Freshwater Organisms (EPA-821-R-02-013) [E821013];Data Unavailable [DU]"]
[null,null,null,"SW7470","HISTORICAL: Mercury in Liquid Waste (Manual Cold-Vapor Technique) [SW7470]",null,null,null,null,null,null,"CHCDUBIAR","Chronic Toxicity-C.dubia-Reproduction",null,null,null,null,null,null,null,null,"Chronic Toxicity-C.dubia-Survival","% effect,% survival,Pass/Fail (Pass = 0; Fail = 1),TUc","Chronic Toxicity of Effluents/ Receiving Water to Freshwater Organisms (EPA-821-R-02-013) [E821013];Data Unavailable [DU]"]
[null,null,null,"SW7471","HISTORICAL: Mercury in Solid/Semisolid Waste (Manual C-V Tech.) [SW7471]",null,null,null,null,null,null,"CHCDUBIAS","Chronic Toxicity-C.dubia-Survival",null,null,null,null,null,null,null,null,"Chronic Toxicity-Fathead Minnow-Growth","% effect,% survival,Pass/Fail (Pass = 0; Fail = 1),TUc","Chronic Toxicity of Effluents/ Receiving Water to Freshwater Organisms (EPA-821-R-02-013) [E821013];Data Unavailable [DU]"]
[null,null,null,"SW7471A","HISTORICAL: Mercury in Solid/Semisolid Waste (Manual C-V Tech.) [SW7471A]",null,null,null,null,null,null,"CHFATMINNOWG","Chronic Toxicity-Fathead Minnow-Growth",null,null,null,null,null,null,null,null,"Chronic Toxicity-Fathead Minnow-Survival","% effect,% survival,Pass/Fail (Pass = 0; Fail = 1),TUc","Chronic Toxicity of Effluents/ Receiving Water to Freshwater Organisms (EPA-821-R-02-013) [E821013];Data Unavailable [DU]"]
[null,null,null,"SW8015","HISTORICAL: Non-Halogenated Volatile Organics [SW8015]",null,null,null,null,null,null,"CHFATMINNOWS","Chronic Toxicity-Fathead Minnow-Survival",null,null,null,null,null,null,null,null,"Chronic Toxicity-Giant Kelp-Germination","% effect,% survival,Pass/Fail (Pass = 0; Fail = 1),TUc","Chronic Toxicity of Effluents/Receiving Water to West Coast Marine/Estuar. Organ. (EPA-600-R-95-136) [E600136];ASTM Guide for Conducting Static Toxicity Tests with Microalgae (ASTM E1218-04(2012)) [D121804];Data Unavailable [DU]"]
[null,null,null,"SW9071","HISTORICAL: Oil and Grease Extraction Method for Sludge Samples [SW9071]",null,null,null,null,null,null,"CHGKELPG","Chronic Toxicity-Giant Kelp-Germination",null,null,null,null,null,null,null,null,"Chronic Toxicity-Giant Kelp-Germ-tube length","% effect,% survival,Pass/Fail (Pass = 0; Fail = 1),TUc","Chronic Toxicity of Effluents/Receiving Water to West Coast Marine/Estuar. Organ. (EPA-600-R-95-136) [E600136];ASTM Guide for Conducting Static Toxicity Tests with Microalgae (ASTM E1218-04(2012)) [D121804];Data Unavailable [DU]"]
[null,null,null,"SW8081","HISTORICAL: Organochlorine Pesticides & PCBs as Aroclors by GC [SW8081]",null,null,null,null,null,null,"CHGKELPGTL","Chronic Toxicity-Giant Kelp-Germ-tube length",null,null,null,null,null,null,null,null,"Chronic Toxicity-Green Alga-Growth","% effect,% survival,Pass/Fail (Pass = 0; Fail = 1),TUc","Chronic Toxicity of Effluents/ Receiving Water to Freshwater Organisms (EPA-821-R-02-013) [E821013];Data Unavailable [DU]"]
[null,null,null,"SW8080","HISTORICAL: Organochlorine Pesticides and PCBs [SW8080]",null,null,null,null,null,null,"CHGRALGAS","Chronic Toxicity-Green Alga-Growth",null,null,null,null,null,null,null,null,"Chronic Toxicity-Inland Silverside-Growth","% effect,% survival,Pass/Fail (Pass = 0; Fail = 1),TUc","Chronic Toxicity of Effluents/Receiving Water to Marine and Estuarine Organisms (EPA-821-R-02-014) [E821014];Data Unavailable [DU]"]
[null,null,null,"SW8141","HISTORICAL: Organophosphorus Compounds by GC [SW8141]",null,null,null,null,null,null,"CHINSILVERG","Chronic Toxicity-Inland Silverside-Growth",null,null,null,null,null,null,null,null,"Chronic Toxicity-Inland Silverside-Survival","% effect,% survival,Pass/Fail (Pass = 0; Fail = 1),TUc","Chronic Toxicity of Effluents/Receiving Water to Marine and Estuarine Organisms (EPA-821-R-02-014) [E821014];Data Unavailable [DU]"]
[null,null,null,"PAHSIM","HISTORICAL: PAH Specific Ion Monitoring [PAHSIM]",null,null,null,null,null,null,"CHINSILVERS","Chronic Toxicity-Inland Silverside-Survival",null,null,null,null,null,null,null,null,"Chronic Toxicity-Pacific Mysid, H.costata-Growth","% effect,% survival,Pass/Fail (Pass = 0; Fail = 1),TUc","Chronic Toxicity of Effluents/Receiving Water to West Coast Marine/Estuar. Organ. (EPA-600-R-95-136) [E600136];ASTM Guide for Conducting Static Toxicity Tests with Microalgae (ASTM E1218-04(2012)) [D121804];Data Unavailable [DU]"]
[null,null,null,"SW9045A","HISTORICAL: pH [SW9045A]",null,null,null,null,null,null,"CHPMYHCOSTG","Chronic Toxicity-Pacific Mysid, H.costata-Growth",null,null,null,null,null,null,null,null,"Chronic Toxicity-Pacific Mysid, H.costata-Survival","% effect,% survival,Pass/Fail (Pass = 0; Fail = 1),TUc","Chronic Toxicity of Effluents/Receiving Water to West Coast Marine/Estuar. Organ. (EPA-600-R-95-136) [E600136];ASTM Guide for Conducting Static Toxicity Tests with Microalgae (ASTM E1218-04(2012)) [D121804];Data Unavailable [DU]"]
[null,null,null,"SW9040","HISTORICAL: pH, Electrometric Measurement [SW9040]",null,null,null,null,null,null,"CHPMYHCOSTS","Chronic Toxicity-Pacific Mysid, H.costata-Survival",null,null,null,null,null,null,null,null,"Chronic Toxicity-Red Abalone-Larval development","% effect,% survival,Pass/Fail (Pass = 0; Fail = 1),TUc","Chronic Toxicity of Effluents/Receiving Water to West Coast Marine/Estuar. Organ. (EPA-600-R-95-136) [E600136];ASTM Guide for Conducting Static Toxicity Tests with Microalgae (ASTM E1218-04(2012)) [D121804];Data Unavailable [DU]"]
[null,null,null,"SW8270","HISTORICAL: Semivolatile Organic Compounds by GC/MS [SW8270]",null,null,null,null,null,null,"CHRABALONLAR","Chronic Toxicity-Red Abalone-Larval development",null,null,null,null,null,null,null,null,"Chronic Toxicity-Sea Urchin or Sand Dollar-Fertilization","% effect,% survival,Pass/Fail (Pass = 0; Fail = 1),TUc","Chronic Toxicity of Effluents/Receiving Water to West Coast Marine/Estuar. Organ. (EPA-600-R-95-136) [E600136];ASTM Guide for Conducting Static Toxicity Tests with Microalgae (ASTM E1218-04(2012)) [D121804];Data Unavailable [DU]"]
[null,null,null,"SW8270A","HISTORICAL: Semivolatile Organic Compounds by GC/MS [SW8270A]",null,null,null,null,null,null,"CHRSEAUSDLAF","Chronic Toxicity-Sea Urchin or Sand Dollar-Fertilization",null,null,null,null,null,null,null,null,"Chronic Toxicity-Sea Urchin or Sand Dollar-Larval develop","% effect,% survival,Pass/Fail (Pass = 0; Fail = 1),TUc","Chronic Toxicity of Effluents/Receiving Water to West Coast Marine/Estuar. Organ. (EPA-600-R-95-136) [E600136];ASTM Guide for Conducting Static Toxicity Tests with Microalgae (ASTM E1218-04(2012)) [D121804];Data Unavailable [DU]"]
[null,null,null,"SW8270B","HISTORICAL: Semivolatile Organic Compounds by GC/MS [SW8270B]",null,null,null,null,null,null,"CHRSEAUSDLAR","Chronic Toxicity-Sea Urchin or Sand Dollar-Larval develop",null,null,null,null,null,null,null,null,"Chronic Toxicity-Sheepshead Minnow-Growth","% effect,% survival,Pass/Fail (Pass = 0; Fail = 1),TUc","Chronic Toxicity of Effluents/ Receiving Water to Freshwater Organisms (EPA-821-R-02-013) [E821013];Data Unavailable [DU]"]
[null,null,null,"SW7760","HISTORICAL: Silver (AA, Direct Aspiration) [SW7760]",null,null,null,null,null,null,"CHSHMINNOWG","Chronic Toxicity-Sheepshead Minnow-Growth",null,null,null,null,null,null,null,null,"Chronic Toxicity-Sheepshead Minnow-Survival","% effect,% survival,Pass/Fail (Pass = 0; Fail = 1),TUc","Chronic Toxicity of Effluents/ Receiving Water to Freshwater Organisms (EPA-821-R-02-013) [E821013];Data Unavailable [DU]"]
[null,null,null,"SW9045B","HISTORICAL: Soil and Waste pH [SW9045B]",null,null,null,null,null,null,"CHSHMINNOWS","Chronic Toxicity-Sheepshead Minnow-Survival",null,null,null,null,null,null,null,null,"Chronic Toxicity-Topsmelt-Growth","% effect,% survival,Pass/Fail (Pass = 0; Fail = 1),TUc","Chronic Toxicity of Effluents/Receiving Water to West Coast Marine/Estuar. Organ. (EPA-600-R-95-136) [E600136];ASTM Guide for Conducting Static Toxicity Tests with Microalgae (ASTM E1218-04(2012)) [D121804];Data Unavailable [DU]"]
[null,null,null,"SW8321","HISTORICAL: Solvent Extractable Non-VOCs by HPLC/TSP/MS or UV [SW8321]",null,null,null,null,null,null,"CHTOPSMELTG","Chronic Toxicity-Topsmelt-Growth",null,null,null,null,null,null,null,null,"Chronic Toxicity-Topsmelt-Survival","% effect,% survival,Pass/Fail (Pass = 0; Fail = 1),TUc","Chronic Toxicity of Effluents/Receiving Water to West Coast Marine/Estuar. Organ. (EPA-600-R-95-136) [E600136];ASTM Guide for Conducting Static Toxicity Tests with Microalgae (ASTM E1218-04(2012)) [D121804];Data Unavailable [DU]"]
[null,null,null,"SW9050","HISTORICAL: Specific Conductance [SW9050]",null,null,null,null,null,null,"CHTOPSMELTS","Chronic Toxicity-Topsmelt-Survival",null,null,null,null,null,null,null,null,"Chrysene",{"$f":"$AG$8","v":"kg/L,g/L,mg/L,ppth,ug/L,ng/L,pg/L,mg/cm2,g/day,g/year,kg/day,kg/month,kg/year,lb/day,lbs/week,lbs/month,lbs/year,mg/day,mg/kg,ug/kg,ng/g,ulbs/day,ug/day,t/day"},"Extractable Priority Pollutants [E625];Extractable Priority Pollutants by GC/MS SIM [E625SIM];GC/MS SIM Method [SIM];HISTORICAL: Semivolatile Organic Compounds by GC/MS [SW8270];HISTORICAL: Semivolatile Organic Compounds by GC/MS [SW8270A];Organic Compounds in Drinking Water by LSE & CCGC/MS [E525.2];Polynuclear Aromatic Hydrocarbons [E610];Semivolatile Organic Compounds by GC/MS - Open Scan [8270COS];Semivolatile Organic Compounds by GC/MS [SW8270C];Semivolatile Organic Compounds by GC/MS SIM [8270SIM];Semivolatile Organic Compounds by Isotope Dilution GCMS [E1625C];Volatile Organic Compounds by GC/MS [SW8260B];Volatile Organic Compounds by GC/MS SIM [8260SIM];Volatile Organic Compounds EPA Method 624 [E624];Base/Neutrals and Acids by GC/MS [E625.1];Data Unavailable [DU]"]
[null,null,null,"AKD","HISTORICAL: State of Alaska Method for Diesel [AKD]",null,null,null,null,null,null,"CHRYSENE","Chrysene",null,null,null,null,null,null,null,null,"Chrysene-d12","kg/L,g/L,mg/L,ppth,ug/L,ng/L,pg/L,mg/cm2,g/day,g/year,kg/day,kg/month,kg/year,lb/day,lbs/week,lbs/month,lbs/year,mg/day,mg/kg,ug/kg,ng/g,ulbs/day,ug/day,t/day","Extractable Priority Pollutants [E625];Extractable Priority Pollutants by GC/MS SIM [E625SIM];GC/MS SIM Method [SIM];HISTORICAL: Semivolatile Organic Compounds by GC/MS [SW8270];HISTORICAL: Semivolatile Organic Compounds by GC/MS [SW8270A];Organic Compounds in Drinking Water by LSE & CCGC/MS [E525.2];Polynuclear Aromatic Hydrocarbons [E610];Semivolatile Organic Compounds by GC/MS - Open Scan [8270COS];Semivolatile Organic Compounds by GC/MS [SW8270C];Semivolatile Organic Compounds by GC/MS SIM [8270SIM];Semivolatile Organic Compounds by Isotope Dilution GCMS [E1625C];Volatile Organic Compounds by GC/MS [SW8260B];Volatile Organic Compounds by GC/MS SIM [8260SIM];Volatile Organic Compounds EPA Method 624 [E624];Data Unavailable [DU]"]
[null,null,null,"AKG","HISTORICAL: State of Alaska Method for Gasoline [AKG]",null,null,null,null,null,null,"CHRYSENED12","Chrysene-d12",null,null,null,null,null,null,null,null,"cis-1,2-Dichloroethene","kg/L,g/L,mg/L,ppth,ug/L,ng/L,pg/L,mg/cm2,g/day,g/year,kg/day,kg/month,kg/year,lb/day,lbs/week,lbs/month,lbs/year,mg/day,mg/kg,ug/kg,ng/g,ulbs/day,ug/day,t/day","Extractable Priority Pollutants [E625];GC/MS SIM Method [SIM];HISTORICAL: Volatile Organic Compounds by GC/MS [SW8260];Semivolatile Organic Compounds by GC/MS [SW8270C];VOCs by GC/MS Fuel Additives Plus BTEX [8260FAB];Volatile Organic Compounds by GC/MS [SW8260B];Volatile Organic Compounds by Purge and Trap [E524.2];Volatile Organic Compounds EPA Method 624 [E624];Data Unavailable [DU]"]
[null,null,null,"SW9010","HISTORICAL: Total and Amenable Cyanide [SW9010]",null,null,null,null,null,null,"DCE12C","cis-1,2-Dichloroethene",null,null,null,null,null,null,null,null,"cis-1,3-Dichloropropene","kg/L,g/L,mg/L,ppth,ug/L,ng/L,pg/L,mg/cm2,g/day,g/year,kg/day,kg/month,kg/year,lb/day,lbs/week,lbs/month,lbs/year,mg/day,mg/kg,ug/kg,ng/g,ulbs/day,ug/day,t/day","Extractable Priority Pollutants [E625];GC/MS SIM Method [SIM];HISTORICAL: Volatile Organic Compounds by GC/MS [SW8260];VOCs by GC/MS Fuel Additives Plus BTEX [8260FAB];Volatile Organic Compounds by GC/MS [SW8260B];Volatile Organic Compounds EPA Method 624 [E624];Purgeables by GC/MS [E624.1];Data Unavailable [DU]"]
[null,null,null,"SW9010A","HISTORICAL: Total and Amenable Cyanide [SW9010A]",null,null,null,null,null,null,"DCP13C","cis-1,3-Dichloropropene",null,null,null,null,null,null,null,null,"cis-Nonachlor","kg/L,g/L,mg/L,ppth,ug/L,ng/L,pg/L,mg/cm2,g/day,g/year,kg/day,kg/month,kg/year,lb/day,lbs/week,lbs/month,lbs/year,mg/day,mg/kg,ug/kg,ng/g,ulbs/day,ug/day,t/day","Extractable Priority Pollutants [E625];Organochlorine Pesticides and PCBs [E608];Standard Method 5540 C: Determ. of Methylene Blue Active Subst. [A5540C];Organochlorine Pesticides and PCBs by GC/HSD [E608.3];Data Unavailable [DU]"]
[null,null,null,"SW9020","HISTORICAL: Total Organic Halides (TOX) [SW9020]",null,null,null,null,null,null,"NCC","cis-Nonachlor",null,null,null,null,null,null,null,null,"Cobalt Thiocyanate Active Substances (CTAS)","kg/L,g/L,mg/L,ppth,ug/L,ng/L,pg/L,mg/cm2,g/day,g/year,kg/day,kg/month,kg/year,lb/day,lbs/week,lbs/month,lbs/year,mg/day,mg/kg,ug/kg,ng/g,ulbs/day,ug/day,t/day","Semivolatile Organic Compounds by GC/MS [SW8270C];Standard Method 5540 C: Determ. of Methylene Blue Active Subst. [A5540C];Standard Method 5540 D: Nonionic Surfactants as CTAS [A5540D];Data Unavailable [DU]"]
[null,null,null,"SW9020A","HISTORICAL: Total Organic Halides (TOX) [SW9020A]",null,null,null,null,null,null,"CTAS","Cobalt Thiocyanate Active Substances (CTAS)",null,null,null,null,null,null,null,null,"Cobalt, Dissolved","kg/L,g/L,mg/L,ppth,ug/L,ng/L,pg/L,mg/cm2,g/day,g/year,kg/day,kg/month,kg/year,lb/day,lbs/week,lbs/month,lbs/year,mg/day,mg/kg,ug/kg,ng/g,ulbs/day,ug/day,t/day","Cobalt (AA, Direct Aspiration) [E219.1];Cobalt (AA, Furnace Technique) [E219.2];Inductively Coupled Plasma Emission [E200.7];Inductively Coupled Plasma/Mass Spectroscopy [E200.8];Standard Method (19th) 3111 B: Metals, Direct Air-Acetylene Flame [A3111B];Standard Method (19th) 3113: Metals by Electrothermal AAS [A3113];Standard Method (19th) 3113: Metals by Furnace AAS [A3113B];Data Unavailable [DU]"]
[null,null,null,"SW9012","HISTORICAL: Total/Amenable Cyanide (Colorimetric, Automated UV) [SW9012]",null,null,null,null,null,"L","CO","Cobalt, Dissolved",null,null,null,null,null,null,null,null,"Cobalt, Total","kg/L,g/L,mg/L,ppth,ug/L,ng/L,pg/L,mg/cm2,g/day,g/year,kg/day,kg/month,kg/year,lb/day,lbs/week,lbs/month,lbs/year,mg/day,mg/kg,ug/kg,ng/g,ulbs/day,ug/day,t/day","Cobalt (AA, Direct Aspiration) [E219.1];Cobalt (AA, Furnace Technique) [E219.2];Inductively Coupled Plasma Emission [E200.7];Inductively Coupled Plasma/Mass Spectroscopy [E200.8];Standard Method (19th) 3111 B: Metals, Direct Air-Acetylene Flame [A3111B];Standard Method (19th) 3113: Metals by Electrothermal AAS [A3113];Standard Method (19th) 3113: Metals by Furnace AAS [A3113B];Data Unavailable [DU]"]
[null,null,null,"SW8240A","HISTORICAL: Volatile Organic Compounds (SW-846 Method) [SW8240A]",null,null,null,null,null,null,"CO","Cobalt, Total",null,null,null,null,null,null,null,null,"Cobalt, Total Recoverable","kg/L,g/L,mg/L,ppth,ug/L,ng/L,pg/L,mg/cm2,g/day,g/year,kg/day,kg/month,kg/year,lb/day,lbs/week,lbs/month,lbs/year,mg/day,mg/kg,ug/kg,ng/g,ulbs/day,ug/day,t/day","Cobalt (AA, Direct Aspiration) [E219.1];Cobalt (AA, Furnace Technique) [E219.2];Inductively Coupled Plasma Emission [E200.7];Inductively Coupled Plasma/Mass Spectroscopy [E200.8];Standard Method (19th) 3111 B: Metals, Direct Air-Acetylene Flame [A3111B];Standard Method (19th) 3113: Metals by Electrothermal AAS [A3113];Standard Method (19th) 3113: Metals by Furnace AAS [A3113B];Data Unavailable [DU]"]
[null,null,null,"SW8260","HISTORICAL: Volatile Organic Compounds by GC/MS [SW8260]",null,null,null,null,null,"N","CO","Cobalt, Total Recoverable",null,null,null,null,null,null,null,null,"Color, ADMI","ADMI Color Unit","Color (Colorimetric-Platinum-Cobalt) [E110.2];Standard Method (19th) 2120 B: Color by Visual Comparison [A2120B];Data Unavailable [DU]"]
[null,null,null,"SW8260A","HISTORICAL: Volatile Organic Compounds by GC/MS [SW8260A]",null,null,null,null,null,"U","COLOR","Color, ADMI",null,null,null,null,null,null,null,null,"Color, Pt-Co (filtered)","Pt-Co Color Unit","Color (Colorimetric-Platinum-Cobalt) [E110.2];Standard Method (19th) 2120 B: Color by Visual Comparison [A2120B];Data Unavailable [DU]"]
[null,null,null,"SCID","Hydrocarbon Screening Method [SCID]",null,null,null,null,null,"L","COLOR","Color, Pt-Co (filtered)",null,null,null,null,null,null,null,null,"Color, Pt-Co (unfiltered)","Pt-Co Color Unit","Color (Colorimetric-Platinum-Cobalt) [E110.2];Standard Method (19th) 2120 B: Color by Visual Comparison [A2120B];Data Unavailable [DU]"]
[null,null,null,"IENTENT","IDEXX Enterolert Test for Enterococci [IENTENT]",null,null,null,null,null,"N","COLOR","Color, Pt-Co (unfiltered)",null,null,null,null,null,null,null,null,"Copper Impact Ratio","%","Trace Elements in Ambient Waters by ICP-MS [E1638];Trace Elements in Water by Preconcentration and ICP-MS [E1640];Copper (AA, Direct Aspiration) [E220.1];Copper (AA, Direct Aspiration) [SW7210];Copper (AA, Furnace Technique) [SW7211];Copper (AA, Furnace) [E220.2];HISTORICAL: Inductively Coupled Plasma-Emission [SW6010];Inductively Coupled Plasma Emission - modified for CLP [CL200.7];Inductively Coupled Plasma Emission [E200.7];Inductively Coupled Plasma/Mass Spectroscopy [E200.8];Inductively Coupled Plasma-Atomic Emission Spectroscopy [SW6010B];Inductively Coupled Plasma-Mass Spectrometry [SW6020];Metals by Atomic Absorption [E200.0];Standard Method (19th) 3111 B: Metals, Direct Air-Acetylene Flame [A3111B];Standard Method (19th) 3113: Metals by Electrothermal AAS [A3113];Standard Method (19th) 3113: Metals by Furnace AAS [A3113B];Data Unavailable [DU]"]
[null,null,null,"CL200.7","Inductively Coupled Plasma Emission - modified for CLP [CL200.7]",null,null,null,null,null,null,"CUIMRATIO","Copper Impact Ratio",null,null,null,null,null,null,null,null,"Copper, Dissolved",{"$f":"$AG$8","v":"kg/L,g/L,mg/L,ppth,ug/L,ng/L,pg/L,mg/cm2,g/day,g/year,kg/day,kg/month,kg/year,lb/day,lbs/week,lbs/month,lbs/year,mg/day,mg/kg,ug/kg,ng/g,ulbs/day,ug/day,t/day"},"Trace Elements in Ambient Waters by ICP-MS [E1638];Trace Elements in Water by Preconcentration and ICP-MS [E1640];Copper (AA, Direct Aspiration) [E220.1];Copper (AA, Direct Aspiration) [SW7210];Copper (AA, Furnace Technique) [SW7211];Copper (AA, Furnace) [E220.2];HISTORICAL: Inductively Coupled Plasma-Emission [SW6010];Inductively Coupled Plasma Emission - modified for CLP [CL200.7];Inductively Coupled Plasma Emission [E200.7];Inductively Coupled Plasma/Mass Spectroscopy [E200.8];Inductively Coupled Plasma-Atomic Emission Spectroscopy [SW6010B];Inductively Coupled Plasma-Mass Spectrometry [SW6020];Metals by Atomic Absorption [E200.0];Standard Method (19th) 3111 B: Metals, Direct Air-Acetylene Flame [A3111B];Standard Method (19th) 3113: Metals by Electrothermal AAS [A3113];Standard Method (19th) 3113: Metals by Furnace AAS [A3113B];Data Unavailable [DU]"]
[null,null,null,"E200.7","Inductively Coupled Plasma Emission [E200.7]",null,null,null,null,null,"L","CU","Copper, Dissolved",null,null,null,null,null,null,null,null,"Copper, Filtered","kg/L,g/L,mg/L,ppth,ug/L,ng/L,pg/L,mg/cm2,g/day,g/year,kg/day,kg/month,kg/year,lb/day,lbs/week,lbs/month,lbs/year,mg/day,mg/kg,ug/kg,ng/g,ulbs/day,ug/day,t/day","Trace Elements in Ambient Waters by ICP-MS [E1638];Trace Elements in Water by Preconcentration and ICP-MS [E1640];Copper (AA, Direct Aspiration) [E220.1];Copper (AA, Direct Aspiration) [SW7210];Copper (AA, Furnace Technique) [SW7211];Copper (AA, Furnace) [E220.2];HISTORICAL: Inductively Coupled Plasma-Emission [SW6010];Inductively Coupled Plasma Emission - modified for CLP [CL200.7];Inductively Coupled Plasma Emission [E200.7];Inductively Coupled Plasma/Mass Spectroscopy [E200.8];Inductively Coupled Plasma-Atomic Emission Spectroscopy [SW6010B];Inductively Coupled Plasma-Mass Spectrometry [SW6020];Metals by Atomic Absorption [E200.0];Standard Method (19th) 3111 B: Metals, Direct Air-Acetylene Flame [A3111B];Standard Method (19th) 3113: Metals by Electrothermal AAS [A3113];Standard Method (19th) 3113: Metals by Furnace AAS [A3113B];Data Unavailable [DU]"]
[null,null,null,"E200.8","Inductively Coupled Plasma/Mass Spectroscopy [E200.8]",null,null,null,null,null,"F","CU","Copper, Filtered",null,null,null,null,null,null,null,null,"Copper, Total","kg/L,g/L,mg/L,ppth,ug/L,ng/L,pg/L,mg/cm2,g/day,g/year,kg/day,kg/month,kg/year,lb/day,lbs/week,lbs/month,lbs/year,mg/day,mg/kg,ug/kg,ng/g,ulbs/day,ug/day,t/day","Trace Elements in Ambient Waters by ICP-MS [E1638];Trace Elements in Water by Preconcentration and ICP-MS [E1640];Copper (AA, Direct Aspiration) [E220.1];Copper (AA, Direct Aspiration) [SW7210];Copper (AA, Furnace Technique) [SW7211];Copper (AA, Furnace) [E220.2];HISTORICAL: Inductively Coupled Plasma-Emission [SW6010];Inductively Coupled Plasma Emission - modified for CLP [CL200.7];Inductively Coupled Plasma Emission [E200.7];Inductively Coupled Plasma/Mass Spectroscopy [E200.8];Inductively Coupled Plasma-Atomic Emission Spectroscopy [SW6010B];Inductively Coupled Plasma-Mass Spectrometry [SW6020];Metals by Atomic Absorption [E200.0];Standard Method (19th) 3111 B: Metals, Direct Air-Acetylene Flame [A3111B];Standard Method (19th) 3113: Metals by Electrothermal AAS [A3113];Standard Method (19th) 3113: Metals by Furnace AAS [A3113B];Data Unavailable [DU]"]
[null,null,null,"SW6010B","Inductively Coupled Plasma-Atomic Emission Spectroscopy [SW6010B]",null,null,null,null,null,null,"CU","Copper, Total",null,null,null,null,null,null,null,null,"Copper, Total Recoverable","kg/L,g/L,mg/L,ppth,ug/L,ng/L,pg/L,mg/cm2,g/day,g/year,kg/day,kg/month,kg/year,lb/day,lbs/week,lbs/month,lbs/year,mg/day,mg/kg,ug/kg,ng/g,ulbs/day,ug/day,t/day","Trace Elements in Ambient Waters by ICP-MS [E1638];Trace Elements in Water by Preconcentration and ICP-MS [E1640];Copper (AA, Direct Aspiration) [E220.1];Copper (AA, Direct Aspiration) [SW7210];Copper (AA, Furnace Technique) [SW7211];Copper (AA, Furnace) [E220.2];HISTORICAL: Inductively Coupled Plasma-Emission [SW6010];Inductively Coupled Plasma Emission - modified for CLP [CL200.7];Inductively Coupled Plasma Emission [E200.7];Inductively Coupled Plasma/Mass Spectroscopy [E200.8];Inductively Coupled Plasma-Atomic Emission Spectroscopy [SW6010B];Inductively Coupled Plasma-Mass Spectrometry [SW6020];Metals by Atomic Absorption [E200.0];Standard Method (19th) 3111 B: Metals, Direct Air-Acetylene Flame [A3111B];Standard Method (19th) 3113: Metals by Electrothermal AAS [A3113];Standard Method (19th) 3113: Metals by Furnace AAS [A3113B];Data Unavailable [DU]"]
[null,null,null,"SW6020","Inductively Coupled Plasma-Mass Spectrometry [SW6020]",null,null,"`",null,null,"N","CU","Copper, Total Recoverable",null,null,null,null,null,null,null,null,"Coumaphos","kg/L,g/L,mg/L,ppth,ug/L,ng/L,pg/L,mg/cm2,g/day,g/year,kg/day,kg/month,kg/year,lb/day,lbs/week,lbs/month,lbs/year,mg/day,mg/kg,ug/kg,ng/g,ulbs/day,ug/day,t/day","Daphnid Survival and Reproduction Test [E1002.0];Determination of Organophosphorus Pesticides [E614];Fathead Minnow Larval Survival and Growth Test [E1000.0];Data Unavailable [DU]"]
[null,null,null,"E300.0","Inorganic Anions by Ion Chromatography [E300.0]",null,null,null,null,null,null,"COUMAPHOS","Coumaphos",null,null,null,null,null,null,null,null,"Crotoxyphos","kg/L,g/L,mg/L,ppth,ug/L,ng/L,pg/L,mg/cm2,g/day,g/year,kg/day,kg/month,kg/year,lb/day,lbs/week,lbs/month,lbs/year,mg/day,mg/kg,ug/kg,ng/g,ulbs/day,ug/day,t/day","Total Cyanide [E335.2];Total Cyanide by Semi-automated Colorimetry [E335.4];Data Unavailable [DU]"]
[null,null,null,"E300.1","Inorganic Anions by Ion Chromatography [E300.1]",null,null,null,null,null,null,"CROTOX","Crotoxyphos",null,null,null,null,null,null,null,null,"CT (Cl residual * contact time)","mg-min/L","Data Unavailable [DU]"]
[null,null,null,"E300A","Inorganic Anions by Ion Chromatography, Part A [E300A]",null,null,null,null,null,null,"CT","CT (Cl residual * contact time)",null,null,null,null,null,null,null,null,"Cyanide, Free Available",{"$f":"$AG$8","v":"kg/L,g/L,mg/L,ppth,ug/L,ng/L,pg/L,mg/cm2,g/day,g/year,kg/day,kg/month,kg/year,lb/day,lbs/week,lbs/month,lbs/year,mg/day,mg/kg,ug/kg,ng/g,ulbs/day,ug/day,t/day"},"Cyanide Extraction Procedure for Solids and Oils [SW9013];Cynanides, Amenable to Chlorination [E335.1];Standard Method (19th) 4500-CN E: Colorimetric Method [A4500E];Standard Method (19th) 4500-CN E: Total CN [A4500CE];Standard Method (19th) 4500-CN I: Weak Acid Dissociable CN [A4500CN];Data Unavailable [DU]"]
[null,null,null,"E300B","Inorganic Anions by Ion Chromatography, Part B [E300B]",null,null,null,null,null,null,"CYNF","Cyanide, Free Available",null,null,null,null,null,null,null,null,"Cyanide, Total (as CN)",{"$f":"$AG$8","v":"kg/L,g/L,mg/L,ppth,ug/L,ng/L,pg/L,mg/cm2,g/day,g/year,kg/day,kg/month,kg/year,lb/day,lbs/week,lbs/month,lbs/year,mg/day,mg/kg,ug/kg,ng/g,ulbs/day,ug/day,t/day"},"Cyanide Extraction Procedure for Solids and Oils [SW9013];Standard Method (19th) 4500-CN C: CN, Total after Distillation [A4500CC];Standard Method (19th) 4500-CN E: Colorimetric Method [A4500E];Standard Method (19th) 4500-CN E: Total CN [A4500CE];Standard Method (19th) 4500-CN I: Weak Acid Dissociable CN [A4500CN];Titrimetric and Manual Spectrophotometric Determ. for Cyanide [SW9014];Total and Amenable Cyanide (Auto. Colorimetric/Off-line Distill.) [SW9012A];Total and Amenable Cyanide: Distillation [SW9010B];Total Cyanide - modified for CLP [CL335.2];Total Cyanide (Colorimetric, Automated UV) [E335.3];Total Cyanide [E335.2];Total Cyanide by Semi-automated Colorimetry [E335.4];Data Unavailable [DU]"]
[null,null,null,"E1632","Inorganic Arsenic - Hydride Generation FAA [E1632]",null,null,null,null,null,null,"CN","Cyanide, Total (as CN)",null,null,null,null,null,null,null,null,"Cyclohexane",{"$f":"$AG$8","v":"kg/L,g/L,mg/L,ppth,ug/L,ng/L,pg/L,mg/cm2,g/day,g/year,kg/day,kg/month,kg/year,lb/day,lbs/week,lbs/month,lbs/year,mg/day,mg/kg,ug/kg,ng/g,ulbs/day,ug/day,t/day"},"Volatile Organic Compounds by GC/MS [SW8260B];Data Unavailable [DU]"]
[null,null,null,"IS10028","In-Situ Inc. Dissolved Oxygen Measurement by Optical Probe, Method 1002-8-2009 [IS10028]",null,null,null,null,null,null,"CYHEXANE","Cyclohexane",null,null,null,null,null,null,null,null,"Cyclotrimethylenetrinitramine (RDX)","ug/L","Nitroaromatics, Nitramines, and Nitrate Esters by HPLC [SW8330B];Data Unavailable [DU]"]
[null,null,null,"E345.1","Iodide (as I) [E345.1]",null,null,null,null,null,null,"RDX","Cyclotrimethylenetrinitramine (RDX)",null,null,null,null,null,null,null,null,"Cyfluthrin, Freely Dissolved",{"$f":"$AG$8","v":"kg/L,g/L,mg/L,ppth,ug/L,ng/L,pg/L,mg/cm2,g/day,g/year,kg/day,kg/month,kg/year,lb/day,lbs/week,lbs/month,lbs/year,mg/day,mg/kg,ug/kg,ng/g,ulbs/day,ug/day,t/day"},"Data Unavailable [DU]"]
[null,null,null,"E235.1","Iridium (AA, Direct Aspiration ) [E235.1]",null,null,null,null,null,"L","CYFLU","Cyfluthrin, Freely Dissolved",null,null,null,null,null,null,null,null,"Cyfluthrin, Total","kg/L,g/L,mg/L,ppth,ug/L,ng/L,pg/L,mg/cm2,g/day,g/year,kg/day,kg/month,kg/year,lb/day,lbs/week,lbs/month,lbs/year,mg/day,mg/kg,ug/kg,ng/g,ulbs/day,ug/day,t/day","Data Unavailable [DU]"]
[null,null,null,"E235.2","Iridium (AA, Furnace) [E235.2]",null,null,null,null,null,null,"CYFLU","Cyfluthrin, Total",null,null,null,null,null,null,null,null,"Cypermethrin, Freely Dissolved","kg/L,g/L,mg/L,ppth,ug/L,ng/L,pg/L,mg/cm2,g/day,g/year,kg/day,kg/month,kg/year,lb/day,lbs/week,lbs/month,lbs/year,mg/day,mg/kg,ug/kg,ng/g,ulbs/day,ug/day,t/day","Data Unavailable [DU]"]
[null,null,null,"E236.1","Iron (AA, Direct Aspiration) [E236.1]",null,null,null,null,null,"L","CYPERM","Cypermethrin, Freely Dissolved",null,null,null,null,null,null,null,null,"Cypermethrin, Total","kg/L,g/L,mg/L,ppth,ug/L,ng/L,pg/L,mg/cm2,g/day,g/year,kg/day,kg/month,kg/year,lb/day,lbs/week,lbs/month,lbs/year,mg/day,mg/kg,ug/kg,ng/g,ulbs/day,ug/day,t/day","Data Unavailable [DU]"]
[null,null,null,"SW7380","Iron (AA, Direct Aspiration) [SW7380]",null,null,null,null,null,null,"CYPERM","Cypermethrin, Total",null,null,null,null,null,null,null,null,"Dalapon","kg/L,g/L,mg/L,ppth,ug/L,ng/L,pg/L,mg/cm2,g/day,g/year,kg/day,kg/month,kg/year,lb/day,lbs/week,lbs/month,lbs/year,mg/day,mg/kg,ug/kg,ng/g,ulbs/day,ug/day,t/day","Chlorinated Acids in Water by LLE [E515.3];Chlorinated Acids in Water by LLME [E515.4];Chlorinated Herbicides by GC [SW8151A];Determination of Chlorinated Acids in Water by GC/ECD [E515.1];Data Unavailable [DU]"]
[null,null,null,"E236.2","Iron (AA, Furnace Technique) [E236.2]",null,null,null,null,null,null,"DALAPON","Dalapon",null,null,null,null,null,null,null,null,"DDT/DDD/DDE, Sum of P,P & O,P Isomers","kg/L,g/L,mg/L,ppth,ug/L,ng/L,pg/L,mg/cm2,g/day,g/year,kg/day,kg/month,kg/year,lb/day,lbs/week,lbs/month,lbs/year,mg/day,mg/kg,ug/kg,ng/g,ulbs/day,ug/day,t/day","Extractable Priority Pollutants [E625];Organochlorine Pesticides and PCBs [E608];Organochlorine Pesticides by Gas Chromatography [SW8081A];Polychlorinated Biphenyls (PCBs) by Gas Chromatography [SW8082];Organochlorine Pesticides and PCBs by GC/HSD [E608.3];Data Unavailable [DU]"]
[null,null,null,"SW7381","Iron (AA, Furnace Technique) [SW7381]",null,null,null,null,null,null,"DDTTOT","DDT/DDD/DDE, Sum of P,P & O,P Isomers",null,null,null,null,null,null,null,null,"delta-BHC","kg/L,g/L,mg/L,ppth,ug/L,ng/L,pg/L,mg/cm2,g/day,g/year,kg/day,kg/month,kg/year,lb/day,lbs/week,lbs/month,lbs/year,mg/day,mg/kg,ug/kg,ng/g,ulbs/day,ug/day,t/day","Chlorinated Pesticides in Groundwater [E508];Extractable Priority Pollutants [E625];Extractable Priority Pollutants by GC/MS SIM [E625SIM];GC/MS SIM Method [SIM];HISTORICAL: Organochlorine Pesticides & PCBs as Aroclors by GC [SW8081];HISTORICAL: Organochlorine Pesticides and PCBs [SW8080];Organochlorine Pesticides and PCBs [E608];Organochlorine Pesticides and PCBs by GC/HSD [E608.3];Organochlorine Pesticides by Gas Chromatography [SW8081A];Semivolatile Organic Compounds by GC/MS [SW8270C];Semivolatile Organic Compounds by Isotope Dilution GCMS [E1625C];Data Unavailable [DU]"]
[null,null,null,"A3500FB","Iron by Atomic Absorption Spectrometric Method [A3500FB]",null,null,null,null,null,null,"BHCDELTA","delta-BHC",null,null,null,null,null,null,null,null,"Demeton","kg/L,g/L,mg/L,ppth,ug/L,ng/L,pg/L,mg/cm2,g/day,g/year,kg/day,kg/month,kg/year,lb/day,lbs/week,lbs/month,lbs/year,mg/day,mg/kg,ug/kg,ng/g,ulbs/day,ug/day,t/day","Determination of Organophosphorus Pesticides [E614];Extractable Priority Pollutants [E625];Extractable Priority Pollutants by GC/MS SIM [E625SIM];HISTORICAL: Organophosphorus Compounds by GC [SW8141];Organophosphorus Compounds by Gas Chromatography [SW8141A];Data Unavailable [DU]"]
[null,null,null,"CP900","Isotopic Thorium by Alpha Spectroscopy",null,null,null,null,null,null,"DEMETON","Demeton",null,null,null,null,null,null,null,null,"Demeton-O","kg/L,g/L,mg/L,ppth,ug/L,ng/L,pg/L,mg/cm2,g/day,g/year,kg/day,kg/month,kg/year,lb/day,lbs/week,lbs/month,lbs/year,mg/day,mg/kg,ug/kg,ng/g,ulbs/day,ug/day,t/day","Determination of Organophosphorus Pesticides [E614];Organophosphorus Compounds by Gas Chromatography [SW8141A];Data Unavailable [DU]"]
[null,null,null,"E239.1","Lead (AA, Direct Aspiration) [E239.1]",null,null,null,null,null,null,"DEMETONO","Demeton-O",null,null,null,null,null,null,null,null,"Demeton-S","kg/L,g/L,mg/L,ppth,ug/L,ng/L,pg/L,mg/cm2,g/day,g/year,kg/day,kg/month,kg/year,lb/day,lbs/week,lbs/month,lbs/year,mg/day,mg/kg,ug/kg,ng/g,ulbs/day,ug/day,t/day","Determination of Organophosphorus Pesticides [E614];Organophosphorus Compounds by Gas Chromatography [SW8141A];Data Unavailable [DU]"]
[null,null,null,"SW7420","Lead (AA, Direct Aspiration) [SW7420]",null,null,null,null,null,null,"DEMETONS","Demeton-S",null,null,null,null,null,null,null,null,"Depth to Groundwater","Feet","Data Unavailable [DU]"]
[null,null,null,"SW7421","Lead (AA, Furnace Technique) [SW7421]",null,null,null,null,null,null,"GWDEPTH","Depth to Groundwater",null,null,null,null,null,null,null,null,"Di (2-ethylhexyl) adipate",{"$f":"$AG$8","v":"kg/L,g/L,mg/L,ppth,ug/L,ng/L,pg/L,mg/cm2,g/day,g/year,kg/day,kg/month,kg/year,lb/day,lbs/week,lbs/month,lbs/year,mg/day,mg/kg,ug/kg,ng/g,ulbs/day,ug/day,t/day"},"Extractable Priority Pollutants [E625];Extractable Priority Pollutants by GC/MS SIM [E625SIM];Organic Compounds in Drinking Water by LSE & CCGC/MS [E525.2];Organochlorine Pesticides and PCBs [E608];Semivolatile Organic Compounds by Isotope Dilution GCMS [E1625C];Volatile Organic Compounds by GC/MS - Open Scan [8260BOS];Volatile Organic Compounds EPA Method 624 [E624];Data Unavailable [DU]"]
[null,null,null,"CL239.2","Lead (AA, Furnace) - modified for CLP [CL239.2]",null,null,null,null,null,null,"DOA","Di (2-ethylhexyl) adipate",null,null,null,null,null,null,null,null,"Diazinon","kg/L,g/L,mg/L,ppth,ug/L,ng/L,pg/L,mg/cm2,g/day,g/year,kg/day,kg/month,kg/year,lb/day,lbs/week,lbs/month,lbs/year,mg/day,mg/kg,ug/kg,ng/g,ulbs/day,ug/day,t/day","Determination of Organophosphorus Pesticides [E614];Extractable Priority Pollutants [E625];HISTORICAL: Organophosphorus Compounds by GC [SW8141];Nitrogen- & Phosphorus-Containing Pest. in Water by GC [E507];Organic Compounds in Drinking Water by LSE & CCGC/MS [E525.2];Organophosphorus Compounds by Gas Chromatography [SW8141A];Semivolatile Organic Compounds by GC/MS [SW8270C];Data Unavailable [DU]"]
[null,null,null,"E239.2","Lead (AA, Furnace) [E239.2]",null,null,null,null,null,null,"DIAZ","Diazinon",null,null,null,null,null,null,null,null,"Dibenzo(a,h)anthracene","kg/L,g/L,mg/L,ppth,ug/L,ng/L,pg/L,mg/cm2,g/day,g/year,kg/day,kg/month,kg/year,lb/day,lbs/week,lbs/month,lbs/year,mg/day,mg/kg,ug/kg,ng/g,ulbs/day,ug/day,t/day","Extractable Priority Pollutants [E625];Extractable Priority Pollutants by GC/MS SIM [E625SIM];GC/MS SIM Method [SIM];HISTORICAL: Semivolatile Organic Compounds by GC/MS [SW8270];HISTORICAL: Semivolatile Organic Compounds by GC/MS [SW8270A];Organic Compounds in Drinking Water by LSE & CCGC/MS [E525.2];Polynuclear Aromatic Hydrocarbons [E610];Semivolatile Organic Compounds by GC/MS - Open Scan [8270COS];Semivolatile Organic Compounds by GC/MS [SW8270C];Semivolatile Organic Compounds by GC/MS SIM [8270SIM];Semivolatile Organic Compounds by Isotope Dilution GCMS [E1625C];Volatile Organic Compounds by GC/MS [SW8260B];Volatile Organic Compounds by GC/MS SIM [8260SIM];Base/Neutrals and Acids by GC/MS [E625.1];Data Unavailable [DU]"]
[null,null,null,"SW7430","Lithium (AA, Direct Aspiration) [SW7430]",null,null,null,null,null,null,"DBAHA","Dibenzo(a,h)anthracene",null,null,null,null,null,null,null,null,"Dibenzofuran","kg/L,g/L,mg/L,ppth,ug/L,ng/L,pg/L,mg/cm2,g/day,g/year,kg/day,kg/month,kg/year,lb/day,lbs/week,lbs/month,lbs/year,mg/day,mg/kg,ug/kg,ng/g,ulbs/day,ug/day,t/day","Extractable Priority Pollutants [E625];GC/MS SIM Method [SIM];Semivolatile Organic Compounds by GC/MS [SW8270C];Volatile Organic Compounds by GC/MS [SW8260B];Volatile Organic Compounds EPA Method 624 [E624];Data Unavailable [DU]"]
[null,null,null,"LPFE3","Lovely/Phillips (1987) Rapid Assay for Microbially Reducible Fe3+ [LPFE3]",null,null,null,null,null,null,"DBF","Dibenzofuran",null,null,null,null,null,null,null,null,"Dibromoacetic Acid","kg/L,g/L,mg/L,ppth,ug/L,ng/L,pg/L,mg/cm2,g/day,g/year,kg/day,kg/month,kg/year,lb/day,lbs/week,lbs/month,lbs/year,mg/day,mg/kg,ug/kg,ng/g,ulbs/day,ug/day,t/day","Data Unavailable [DU]"]
[null,null,null,"CL242.1","Magnesium (AA, Direct Aspiration) - modified for CLP [CL242.1]",null,null,null,null,null,null,"DBRACETICA ","Dibromoacetic Acid",null,null,null,null,null,null,null,null,"Dibromochloromethane","kg/L,g/L,mg/L,ppth,ug/L,ng/L,pg/L,mg/cm2,g/day,g/year,kg/day,kg/month,kg/year,lb/day,lbs/week,lbs/month,lbs/year,mg/day,mg/kg,ug/kg,ng/g,ulbs/day,ug/day,t/day","Chlorinated and Halogenated Compounds by L-L Extraction, GC/ECD [E551.1];Extractable Priority Pollutants by GC/MS SIM [E625SIM];GC/MS SIM Method [SIM];HISTORICAL: Volatile Organic Compounds by GC/MS [SW8260];Organochlorine Pesticides and PCBs [E608];Organochlorine Pesticides by Gas Chromatography [SW8081A];Semivolatile Organic Compounds by GC/MS [SW8270C];Volatile Organic Compounds by GC/MS - Open Scan [8260BOS];Volatile Organic Compounds by GC/MS [SW8260B];Volatile Organic Compounds by Purge and Trap [E524.2];Volatile Organic Compounds EPA Method 624 [E624];Purgeables by GC/MS [E624.1];Data Unavailable [DU]"]
[null,null,null,"E242.1","Magnesium (AA, Direct Aspiration) [E242.1]",null,null,null,null,null,null,"DBCME","Dibromochloromethane",null,null,null,null,null,null,null,null,"Dibromodichloromethane","kg/L,g/L,mg/L,ppth,ug/L,ng/L,pg/L,mg/cm2,g/day,g/year,kg/day,kg/month,kg/year,lb/day,lbs/week,lbs/month,lbs/year,mg/day,mg/kg,ug/kg,ng/g,ulbs/day,ug/day,t/day","Purgeables by GC/MS [E624.1];Data Unavailable [DU]"]
[null,null,null,"SW7450","Magnesium (AA, Direct Aspiration) [SW7450]",null,null,null,null,null,null,"DBDCM","Dibromodichloromethane",null,null,null,null,null,null,null,null,"Dibromofluoromethane","kg/L,g/L,mg/L,ppth,ug/L,ng/L,pg/L,mg/cm2,g/day,g/year,kg/day,kg/month,kg/year,lb/day,lbs/week,lbs/month,lbs/year,mg/day,mg/kg,ug/kg,ng/g,ulbs/day,ug/day,t/day","Volatile Organic Compounds by GC/MS [SW8260B];Volatile Organic Compounds EPA Method 624 [E624];Purgeables by GC/MS [E624.1];Data Unavailable [DU]"]
[null,null,null,"E243.1","Manganese (AA, Direct Aspiration) [E243.1]",null,null,null,null,null,null,"DBFM","Dibromofluoromethane",null,null,null,null,null,null,null,null,"Dibromomethane","kg/L,g/L,mg/L,ppth,ug/L,ng/L,pg/L,mg/cm2,g/day,g/year,kg/day,kg/month,kg/year,lb/day,lbs/week,lbs/month,lbs/year,mg/day,mg/kg,ug/kg,ng/g,ulbs/day,ug/day,t/day","EDB, DBCP & 123TCP In Water by Microextraction & Gas Chromo. [E504.1];GC/MS SIM Method [SIM];HISTORICAL: Volatile Organic Compounds by GC/MS [SW8260];Semivolatile Organic Compounds by GC/MS [SW8270C];Volatile Organic Compounds by GC/MS [SW8260B];Volatile Organic Compounds EPA Method 624 [E624];Data Unavailable [DU]"]
[null,null,null,"SW7460","Manganese (AA, Direct Aspiration) [SW7460]",null,null,null,null,null,null,"DBMA","Dibromomethane",null,null,null,null,null,null,null,null,"Dibutyltin","kg/L,g/L,mg/L,ppth,ug/L,ng/L,pg/L,mg/cm2,g/day,g/year,kg/day,kg/month,kg/year,lb/day,lbs/week,lbs/month,lbs/year,mg/day,mg/kg,ug/kg,ng/g,ulbs/day,ug/day,t/day","Extractable Priority Pollutants [E625];GC Determ. of Butyltins in Water (Chemosphere, Vol. 15, No. 4) [BTSN];Organochlorine Pesticides and PCBs by GC/HSD [E608.3];Data Unavailable [DU]"]
[null,null,null,"E243.2","Manganese (AA, Furnace Technique) [E243.2]",null,null,null,null,null,null,"DBTSN","Dibutyltin",null,null,null,null,null,null,null,null,"Dicamba","kg/L,g/L,mg/L,ppth,ug/L,ng/L,pg/L,mg/cm2,g/day,g/year,kg/day,kg/month,kg/year,lb/day,lbs/week,lbs/month,lbs/year,mg/day,mg/kg,ug/kg,ng/g,ulbs/day,ug/day,t/day","Chlorinated Acids in Water by LLE [E515.3];Chlorinated Herbicides by GC [SW8151A];Determination of Chlorinated Acids in Water by GC/ECD [E515.1];Organochlorine Pesticides and PCBs [E608];Data Unavailable [DU]"]
[null,null,null,"SW7461","Manganese (AA, Furnace Technique) [SW7461]",null,null,null,null,null,null,"DICAMBA","Dicamba",null,null,null,null,null,null,null,null,"Dichloroacetic Acid","kg/L,g/L,mg/L,ppth,ug/L,ng/L,pg/L,mg/cm2,g/day,g/year,kg/day,kg/month,kg/year,lb/day,lbs/week,lbs/month,lbs/year,mg/day,mg/kg,ug/kg,ng/g,ulbs/day,ug/day,t/day","Data Unavailable [DU]"]
[null,null,null,"E18","Measurement of Gaseous Organic Compound Emissions by GC [E18]",null,null,null,null,null,null,"DCAA ","Dichloroacetic Acid",null,null,null,null,null,null,null,null,"Dichlorobenzenes, Sum","kg/L,g/L,mg/L,ppth,ug/L,ng/L,pg/L,mg/cm2,g/day,g/year,kg/day,kg/month,kg/year,lb/day,lbs/week,lbs/month,lbs/year,mg/day,mg/kg,ug/kg,ng/g,ulbs/day,ug/day,t/day","Extractable Priority Pollutants [E625];Extractable Priority Pollutants by GC/MS SIM [E625SIM];Organochlorine Pesticides and PCBs [E608];Semivolatile Organic Compounds by GC/MS [SW8270C];Semivolatile Organic Compounds by Isotope Dilution GCMS [E1625C];Volatile Organic Compounds by GC/MS [SW8260B];Volatile Organic Compounds EPA Method 624 [E624];Data Unavailable [DU]"]
[null,null,null,"E245.7","Mercury - CVA Fluorescence Spectrometry [E245.7]",null,null,null,null,null,null,"DCB","Dichlorobenzenes, Sum",null,null,null,null,null,null,null,null,"Dichlorobromomethane","kg/L,g/L,mg/L,ppth,ug/L,ng/L,pg/L,mg/cm2,g/day,g/year,kg/day,kg/month,kg/year,lb/day,lbs/week,lbs/month,lbs/year,mg/day,mg/kg,ug/kg,ng/g,ulbs/day,ug/day,t/day","Chlorinated and Halogenated Compounds by L-L Extraction, GC/ECD [E551.1];Extractable Priority Pollutants [E625];Extractable Priority Pollutants by GC/MS SIM [E625SIM];GC/MS SIM Method [SIM];HISTORICAL: Organochlorine Pesticides & PCBs as Aroclors by GC [SW8081];HISTORICAL: Semivolatile Organic Compounds by GC/MS [SW8270];HISTORICAL: Volatile Organic Compounds by GC/MS [SW8260];Organochlorine Pesticides and PCBs [E608];Organochlorine Pesticides by Gas Chromatography [SW8081A];Semivolatile Organic Compounds by GC/MS [SW8270C];VOCs by GC/MS Fuel Additives Plus BTEX [8260FAB];Volatile Organic Compounds by GC/MS - Open Scan [8260BOS];Volatile Organic Compounds by GC/MS [SW8260B];Volatile Organic Compounds by GC/MS Fuel Additives [8260FA];Volatile Organic Compounds by GC/MS SIM [8260SIM];Volatile Organic Compounds by Purge and Trap [E524.2];Volatile Organic Compounds EPA Method 624 [E624];Data Unavailable [DU]"]
[null,null,null,"CL245.2","Mercury (Cold Vapor, Automated) - modified for CLP [CL245.2]",null,null,null,null,null,null,"BDCME","Dichlorobromomethane",null,null,null,null,null,null,null,null,"Dichlorodifluoromethane","kg/L,g/L,mg/L,ppth,ug/L,ng/L,pg/L,mg/cm2,g/day,g/year,kg/day,kg/month,kg/year,lb/day,lbs/week,lbs/month,lbs/year,mg/day,mg/kg,ug/kg,ng/g,ulbs/day,ug/day,t/day","GC/MS SIM Method [SIM];HISTORICAL: Volatile Organic Compounds by GC/MS [SW8260];Semivolatile Organic Compounds by GC/MS [SW8270C];VOCs by GC/MS Fuel Additives Plus BTEX [8260FAB];Volatile Organic Compounds by GC/MS [SW8260B];Volatile Organic Compounds EPA Method 624 [E624];Purgeables by GC/MS [E624.1];Data Unavailable [DU]"]
[null,null,null,"E245.2","Mercury (Cold Vapor, Automated) [E245.2]",null,null,null,null,null,null,"FC12","Dichlorodifluoromethane",null,null,null,null,null,null,null,null,"Dichlorofenthion","kg/L,g/L,mg/L,ppth,ug/L,ng/L,pg/L,mg/cm2,g/day,g/year,kg/day,kg/month,kg/year,lb/day,lbs/week,lbs/month,lbs/year,mg/day,mg/kg,ug/kg,ng/g,ulbs/day,ug/day,t/day","Volatile Organic Compounds EPA Method 624 [E624];Data Unavailable [DU]"]
[null,null,null,"CL245.1","Mercury (Cold Vapor, Manual) - modified for CLP [CL245.1]",null,null,null,null,null,null,"FENTHION2CL","Dichlorofenthion",null,null,null,null,null,null,null,null,"Dichloroprop","kg/L,g/L,mg/L,ppth,ug/L,ng/L,pg/L,mg/cm2,g/day,g/year,kg/day,kg/month,kg/year,lb/day,lbs/week,lbs/month,lbs/year,mg/day,mg/kg,ug/kg,ng/g,ulbs/day,ug/day,t/day","Chlorinated Herbicides by GC [SW8151A];Determination of Chlorinated Acids in Water by GC/ECD [E515.1];Data Unavailable [DU]"]
[null,null,null,"E245.1","Mercury (Cold Vapor, Manual) [E245.1]",null,null,null,null,null,null,"DCPROP","Dichloroprop",null,null,null,null,null,null,null,null,"Dichlorvos","kg/L,g/L,mg/L,ppth,ug/L,ng/L,pg/L,mg/cm2,g/day,g/year,kg/day,kg/month,kg/year,lb/day,lbs/week,lbs/month,lbs/year,mg/day,mg/kg,ug/kg,ng/g,ulbs/day,ug/day,t/day","Determination of Organophosphorus Pesticides [E614];Extractable Priority Pollutants [E625];Data Unavailable [DU]"]
[null,null,null,"CL245.5","Mercury (Cold Vapor, Sediments) - modified for CLP [CL245.5]",null,null,null,null,null,null,"DICHLORVOS","Dichlorvos",null,null,null,null,null,null,null,null,"Dicrotophos","kg/L,g/L,mg/L,ppth,ug/L,ng/L,pg/L,mg/cm2,g/day,g/year,kg/day,kg/month,kg/year,lb/day,lbs/week,lbs/month,lbs/year,mg/day,mg/kg,ug/kg,ng/g,ulbs/day,ug/day,t/day","Data Unavailable [DU]"]
[null,null,null,"E245.5","Mercury (Cold Vapor, Sediments) [E245.5]",null,null,null,null,null,null,"BIDRIN","Dicrotophos",null,null,null,null,null,null,null,null,"Didecyl Dimethyl Ammonium Chloride (DDAC)","kg/L,g/L,mg/L,ppth,ug/L,ng/L,pg/L,mg/cm2,g/day,g/year,kg/day,kg/month,kg/year,lb/day,lbs/week,lbs/month,lbs/year,mg/day,mg/kg,ug/kg,ng/g,ulbs/day,ug/day,t/day","Data Unavailable [DU]"]
[null,null,null,"SW7470A","Mercury in Liquid Waste (Manual Cold-Vapor Technique) [SW7470A]",null,null,null,null,null,null,"DDAC","Didecyl Dimethyl Ammonium Chloride (DDAC)",null,null,null,null,null,null,null,null,"Dieldrin","kg/L,g/L,mg/L,ppth,ug/L,ng/L,pg/L,mg/cm2,g/day,g/year,kg/day,kg/month,kg/year,lb/day,lbs/week,lbs/month,lbs/year,mg/day,mg/kg,ug/kg,ng/g,ulbs/day,ug/day,t/day","Organochlorine Pesticides and PCBs by GC/HSD [E608.3];Data Unavailable [DU]"]
[null,null,null,"SW7471B","Mercury in Solid or Semisolid Waste (Manual Cold-Vapor Tech) [SW7471B]",null,null,null,null,null,null,"DIELDRIN","Dieldrin",null,null,null,null,null,null,null,null,"Diesel Oil","kg/L,g/L,mg/L,ppth,ug/L,ng/L,pg/L,mg/cm2,g/day,g/year,kg/day,kg/month,kg/year,lb/day,lbs/week,lbs/month,lbs/year,mg/day,mg/kg,ug/kg,ng/g,ulbs/day,ug/day,t/day","CA LUFT Method for Diesel Range Organics [CATPH-D];Extractable Priority Pollutants [E625];HISTORICAL: Non-Halogenated Volatile Organics [SW8015];Modified SW8015 for Gasoline or Diesel Determination [M8015];Non-Halogenated Organics Using GC/FID [SW8015B];Total Petroleum Hydrocarbons (TPH) by GC/MS [8260TPH];Volatiles by GC/Gasoline Range Organics (SW8021B/8015) [SW8021F];Data Unavailable [DU]"]
[null,null,null,"E1631","Mercury in Water by Oxidation, P&T, and Cold Vapor [E1631]",null,null,null,null,null,null,"PHCD","Diesel Oil",null,null,null,null,null,null,null,null,"Diethyl Phthalate","kg/L,g/L,mg/L,ppth,ug/L,ng/L,pg/L,mg/cm2,g/day,g/year,kg/day,kg/month,kg/year,lb/day,lbs/week,lbs/month,lbs/year,mg/day,mg/kg,ug/kg,ng/g,ulbs/day,ug/day,t/day","Extractable Priority Pollutants [E625];Extractable Priority Pollutants by GC/MS SIM [E625SIM];GC/MS SIM Method [SIM];HISTORICAL: Semivolatile Organic Compounds by GC/MS [SW8270];HISTORICAL: Semivolatile Organic Compounds by GC/MS [SW8270A];Organic Compounds in Drinking Water by LSE & CCGC/MS [E525.2];Organochlorine Pesticides and PCBs [E608];Phthalate Esters [SW8060];Semivolatile Organic Compounds by GC/MS - Open Scan [8270COS];Semivolatile Organic Compounds by GC/MS [SW8270C];Semivolatile Organic Compounds by Isotope Dilution GCMS [E1625C];Semivolatile Organic Compounds by SPE & GC/MS [E526];Volatile Organic Compounds by GC/MS [SW8260B];Volatile Organic Compounds by GC/MS SIM [8260SIM];Volatile Organic Compounds EPA Method 624 [E624];Base/Neutrals and Acids by GC/MS [E625.1];Data Unavailable [DU]"]
[null,null,null,"E200.0","Metals by Atomic Absorption [E200.0]",null,null,null,null,null,null,"DEPH","Diethyl Phthalate",null,null,null,null,null,null,null,null,"Diethylene glycol","mg/L","Non-Halogenated Organics Using GC/FID [SW8015B];Data Unavailable [DU]"]
[null,null,null,"E1600","Method 1600: Enterococci in Water by Membrane Filtration Using membrane-Enterococcus Indoxyl-B-D-Glucoside Agar [E1600]",null,null,null,null,null,null,"ET2GLY","Diethylene glycol",null,null,null,null,null,null,null,null,"Dilution Rate","%","Data Unavailable [DU]"]
[null,null,null,"UL09","Method UL09, Rocky Mountain Arsenal [UL09]",null,null,null,null,null,null,"DILRATE","Dilution Rate",null,null,null,null,null,null,null,null,"Dimethoate",{"$f":"$AG$8","v":"kg/L,g/L,mg/L,ppth,ug/L,ng/L,pg/L,mg/cm2,g/day,g/year,kg/day,kg/month,kg/year,lb/day,lbs/week,lbs/month,lbs/year,mg/day,mg/kg,ug/kg,ng/g,ulbs/day,ug/day,t/day"},"Determination of Organophosphorus Pesticides [E614];Extractable Priority Pollutants [E625];Organic Compounds in Drinking Water by LSE & CCGC/MS [E525.2];Data Unavailable [DU]"]
[null,null,null,"UW46","Method UW46, Rocky Mountain Arsenal [UW46]",null,null,null,null,null,null,"DIMETHAT","Dimethoate",null,null,null,null,null,null,null,null,"Dimethyl Phthalate","kg/L,g/L,mg/L,ppth,ug/L,ng/L,pg/L,mg/cm2,g/day,g/year,kg/day,kg/month,kg/year,lb/day,lbs/week,lbs/month,lbs/year,mg/day,mg/kg,ug/kg,ng/g,ulbs/day,ug/day,t/day","Extractable Priority Pollutants [E625];Extractable Priority Pollutants by GC/MS SIM [E625SIM];GC/MS SIM Method [SIM];HISTORICAL: Semivolatile Organic Compounds by GC/MS [SW8270];HISTORICAL: Semivolatile Organic Compounds by GC/MS [SW8270A];Organic Compounds in Drinking Water by LSE & CCGC/MS [E525.2];Organochlorine Pesticides and PCBs [E608];Phthalate Esters [SW8060];Semivolatile Organic Compounds by GC/MS - Open Scan [8270COS];Semivolatile Organic Compounds by GC/MS [SW8270C];Semivolatile Organic Compounds by Isotope Dilution GCMS [E1625C];Semivolatile Organic Compounds by SPE & GC/MS [E526];Volatile Organic Compounds by GC/MS [SW8260B];Volatile Organic Compounds by GC/MS SIM [8260SIM];Volatile Organic Compounds EPA Method 624 [E624];Base/Neutrals and Acids by GC/MS [E625.1];Data Unavailable [DU]"]
[null,null,null,"E1630","Methyl Mercury in Water by Distillation [E1630]",null,null,null,null,null,null,"DMPH","Dimethyl Phthalate",null,null,null,null,null,null,null,null,"Di-n-butyl Phthalate","kg/L,g/L,mg/L,ppth,ug/L,ng/L,pg/L,mg/cm2,g/day,g/year,kg/day,kg/month,kg/year,lb/day,lbs/week,lbs/month,lbs/year,mg/day,mg/kg,ug/kg,ng/g,ulbs/day,ug/day,t/day","Extractable Priority Pollutants [E625];Extractable Priority Pollutants by GC/MS SIM [E625SIM];GC/MS SIM Method [SIM];Halogenated Volatile Organics by Headspace [3810HVO];HISTORICAL: Semivolatile Organic Compounds by GC/MS [SW8270];HISTORICAL: Semivolatile Organic Compounds by GC/MS [SW8270A];Organic Compounds in Drinking Water by LSE & CCGC/MS [E525.2];Organochlorine Pesticides and PCBs [E608];Phthalate Esters [SW8060];Semivolatile Organic Compounds by GC/MS - Open Scan [8270COS];Semivolatile Organic Compounds by GC/MS [SW8270C];Semivolatile Organic Compounds by Isotope Dilution GCMS [E1625C];Semivolatile Organic Compounds by SPE & GC/MS [E526];Standard Method (18th & 19th) 2320 B: Alkalinity by Titration [A2320B];Volatile Organic Compounds by GC/MS [SW8260B];Volatile Organic Compounds by GC/MS SIM [8260SIM];Volatile Organic Compounds EPA Method 624 [E624];Base/Neutrals and Acids by GC/MS [E625.1];Data Unavailable [DU]"]
[null,null,null,"E425.1","Methylene Blue Active Substances (MBAS) [E425.1]",null,null,null,null,null,null,"DNBP","Di-n-butyl Phthalate",null,null,null,null,null,null,null,null,"Di-n-octyl Phthalate","kg/L,g/L,mg/L,ppth,ug/L,ng/L,pg/L,mg/cm2,g/day,g/year,kg/day,kg/month,kg/year,lb/day,lbs/week,lbs/month,lbs/year,mg/day,mg/kg,ug/kg,ng/g,ulbs/day,ug/day,t/day","Extractable Priority Pollutants [E625];Extractable Priority Pollutants by GC/MS SIM [E625SIM];GC/MS SIM Method [SIM];HISTORICAL: Semivolatile Organic Compounds by GC/MS [SW8270];HISTORICAL: Semivolatile Organic Compounds by GC/MS [SW8270A];Phthalate Esters [SW8060];Semivolatile Organic Compounds by GC/MS - Open Scan [8270COS];Semivolatile Organic Compounds by GC/MS [SW8270C];Semivolatile Organic Compounds by Isotope Dilution GCMS [E1625C];Volatile Organic Compounds by GC/MS [SW8260B];Base/Neutrals and Acids by GC/MS [E625.1];Data Unavailable [DU]"]
[null,null,null,"ME418.1","Modified E418.1 TRPH (Alaska) [ME418.1]",null,null,null,null,null,null,"DNOP","Di-n-octyl Phthalate",null,null,null,null,null,null,null,null,"Dinoseb","kg/L,g/L,mg/L,ppth,ug/L,ng/L,pg/L,mg/cm2,g/day,g/year,kg/day,kg/month,kg/year,lb/day,lbs/week,lbs/month,lbs/year,mg/day,mg/kg,ug/kg,ng/g,ulbs/day,ug/day,t/day","Chlorinated Acids in Water by LLE [E515.3];Chlorinated Acids in Water by LLME [E515.4];Chlorinated Herbicides by GC [SW8151A];Determination of Chlorinated Acids in Water by GC/ECD [E515.1];Data Unavailable [DU]"]
[null,null,null,"OR418.1","Modified for State of Oregon Total Petroleum Hydrocarbons [OR418.1]",null,null,null,null,null,null,"DINOSEB","Dinoseb",null,null,null,null,null,null,null,null,"Dioxane","kg/L,g/L,mg/L,ppth,ug/L,ng/L,pg/L,mg/cm2,g/day,g/year,kg/day,kg/month,kg/year,lb/day,lbs/week,lbs/month,lbs/year,mg/day,mg/kg,ug/kg,ng/g,ulbs/day,ug/day,t/day","GC/MS SIM Method [SIM];HISTORICAL: Semivolatile Organic Compounds by GC/MS [SW8270];Semivolatile Organic Compounds by GC/MS [SW8270C];Semivolatile Organic Compounds by GC/MS SIM [8270SIM];Semivolatile Organic Compounds by Isotope Dilution GCMS [E1625C];Volatile Organic Compounds by GC/MS [SW8260B];Volatile Organic Compounds EPA Method 624 [E624];Data Unavailable [DU]"]
[null,null,null,"WA418.1","Modified for State of Washington Total Petroleum Hydrocarbons [WA418.1]",null,null,null,null,null,null,"DIOXANE14","Dioxane",null,null,null,null,null,null,null,null,"Dioxathion","kg/L,g/L,mg/L,ppth,ug/L,ng/L,pg/L,mg/cm2,g/day,g/year,kg/day,kg/month,kg/year,lb/day,lbs/week,lbs/month,lbs/year,mg/day,mg/kg,ug/kg,ng/g,ulbs/day,ug/day,t/day","Data Unavailable [DU]"]
[null,null,null,"M8015","Modified SW8015 for Gasoline or Diesel Determination [M8015]",null,null,null,null,null,null,"DIOXATHION","Dioxathion",null,null,null,null,null,null,null,null,"Diphenyl ether","ug/L","Base/Neutrals and Acids by GC/MS [E625.1];Data Unavailable [DU]"]
[null,null,null,"M8100","Modified SW8100 for Diesel Range Organics Determination [M8100]",null,null,null,null,null,null,"DPE","Diphenyl ether",null,null,null,null,null,null,null,null,"Diquat",{"$f":"$AG$8","v":"kg/L,g/L,mg/L,ppth,ug/L,ng/L,pg/L,mg/cm2,g/day,g/year,kg/day,kg/month,kg/year,lb/day,lbs/week,lbs/month,lbs/year,mg/day,mg/kg,ug/kg,ng/g,ulbs/day,ug/day,t/day"},"Diquat and Paraquat by LSE and HPLC [E549.2];Organic Compounds in Drinking Water by LSE & CCGC/MS [E525.2];Data Unavailable [DU]"]
[null,null,null,"E246.1","Molybdenum (AA, Direct Aspiration) [E246.1]",null,null,null,null,null,null,"DIQUAT","Diquat",null,null,null,null,null,null,null,null,"Discharge Volume","gallons","Data Unavailable [DU]"]
[null,null,null,"SW7480","Molybdenum (AA, Direct Aspiration) [SW7480]",null,null,null,null,null,null,"DISVOL","Discharge Volume",null,null,null,null,null,null,null,null,"Dissolved Inorganic Carbon",{"$f":"$AG$8","v":"kg/L,g/L,mg/L,ppth,ug/L,ng/L,pg/L,mg/cm2,g/day,g/year,kg/day,kg/month,kg/year,lb/day,lbs/week,lbs/month,lbs/year,mg/day,mg/kg,ug/kg,ng/g,ulbs/day,ug/day,t/day"},"Standard Methods 5310D: Wet-Oxidation Method [A5310D];ASTM Method Total and Organic Carbon in Water Oxidation (1982) [D412982];ASTM Method Total Organic Carbon (TOC) [D4129];Determination of TOC in Soil by Modified Lloyd Kahn Method [KAHNTOC];Standard Method (19th) 5310 B: TOC by Combustion-Infrared [A5310B];Standard Method (19th) 5310 C: TOC by Persulfate-UV Oxidation [A5310C];Total Organic Carbon  (TOC) [SW9060];Total Organic Carbon (Combustion or Oxidation) [E415.1];Total Organic Carbon (UV Absorbance) [E415.3];Total Organic Carbon (UV Promoted, Persulfate Oxidation) [E415.2];Walkley-Black Method, Organic Carbon (TOC) [WBLACK];Data Unavailable [DU]"]
[null,null,null,"E246.2","Molybdenum (AA, Furnace Technique) [E246.2]",null,null,null,null,null,null,"DIC","Dissolved Inorganic Carbon",null,null,null,null,null,null,null,null,"Dissolved Organic Carbon",{"$f":"$AG$8","v":"kg/L,g/L,mg/L,ppth,ug/L,ng/L,pg/L,mg/cm2,g/day,g/year,kg/day,kg/month,kg/year,lb/day,lbs/week,lbs/month,lbs/year,mg/day,mg/kg,ug/kg,ng/g,ulbs/day,ug/day,t/day"},"Standard Methods 5310D: Wet-Oxidation Method [A5310D];ASTM Method Total and Organic Carbon in Water Oxidation (1982) [D412982];ASTM Method Total Organic Carbon (TOC) [D4129];Determination of TOC in Soil by Modified Lloyd Kahn Method [KAHNTOC];Standard Method (19th) 5310 B: TOC by Combustion-Infrared [A5310B];Standard Method (19th) 5310 C: TOC by Persulfate-UV Oxidation [A5310C];Total Organic Carbon  (TOC) [SW9060];Total Organic Carbon (Combustion or Oxidation) [E415.1];Total Organic Carbon (UV Absorbance) [E415.3];Total Organic Carbon (UV Promoted, Persulfate Oxidation) [E415.2];Walkley-Black Method, Organic Carbon (TOC) [WBLACK];Data Unavailable [DU]"]
[null,null,null,"SW7481","Molybdenum (AA, Furnace Technique) [SW7481]",null,null,null,null,null,null,"DOC","Dissolved Organic Carbon",null,null,null,null,null,null,null,null,"Dissolved Oxygen","mg/L,lb/day","Diss. Oxygen & Methane (Inter'l J. Env. Anal. Chem. 1988) [DOCH4];Oxygen, Dissolved [E360.1];Oxygen, Dissolved [E360.2];Standard Method (19th) 4500-O G:Diss. O by Membrane Electrode [A4500OG];HACH Dissolved Oxygen by LDO, Method 10360 [H10360];In-Situ Inc. Dissolved Oxygen Measurement by Optical Probe, Method 1002-8-2009 [IS10028];Data Unavailable [DU]"]
[null,null,null,"MTTPH-D","Montana Total Petroleum Hydrocarbons-Diesel Range [MTTPH-D]",null,null,null,null,null,null,"DO","Dissolved Oxygen",null,null,null,null,null,null,null,null,"Dissolved Oxygen, saturation","%","Oxygen, Dissolved [E360.1];Oxygen, Dissolved [E360.2];Standard Method (19th) 4500-O G:Diss. O by Membrane Electrode [A4500OG];Data Unavailable [DU]"]
[null,null,null,"MTTPH-G","Montana Total Petroleum Hydrocarbons-Gasoline Range [MTTPH-G]",null,null,null,null,null,null,"OXYGEN","Dissolved Oxygen, saturation",null,null,null,null,null,null,null,null,"Disulfoton",{"$f":"$AG$8","v":"kg/L,g/L,mg/L,ppth,ug/L,ng/L,pg/L,mg/cm2,g/day,g/year,kg/day,kg/month,kg/year,lb/day,lbs/week,lbs/month,lbs/year,mg/day,mg/kg,ug/kg,ng/g,ulbs/day,ug/day,t/day"},"Determination of Organophosphorus Pesticides [E614];Extractable Priority Pollutants [E625];Organic Compounds in Drinking Water by LSE & CCGC/MS [E525.2];Data Unavailable [DU]"]
[null,null,null,"SW9071B","n-Hexane Extract. Mat. (HEM) for Sludge, Sed., and Solids [SW9071B]",null,null,null,null,null,null,"DISUL","Disulfoton",null,null,null,null,null,null,null,null,"Diuron",{"$f":"$AG$8","v":"kg/L,g/L,mg/L,ppth,ug/L,ng/L,pg/L,mg/cm2,g/day,g/year,kg/day,kg/month,kg/year,lb/day,lbs/week,lbs/month,lbs/year,mg/day,mg/kg,ug/kg,ng/g,ulbs/day,ug/day,t/day"},"Data Unavailable [DU]"]
[null,null,null,"E249.1","Nickel (AA, Direct Aspiration) [E249.1]",null,null,null,null,null,null,"DIURON","Diuron",null,null,null,null,null,null,null,null,"Duration of Discharge","minutes","Data Unavailable [DU]"]
[null,null,null,"SW7520","Nickel (AA, Direct Aspiration) [SW7520]",null,null,null,null,null,null,"DURDISCH","Duration Of Discharge",null,null,null,null,null,null,null,null,"Dyfonate",{"$f":"$AG$8","v":"kg/L,g/L,mg/L,ppth,ug/L,ng/L,pg/L,mg/cm2,g/day,g/year,kg/day,kg/month,kg/year,lb/day,lbs/week,lbs/month,lbs/year,mg/day,mg/kg,ug/kg,ng/g,ulbs/day,ug/day,t/day"},"Data Unavailable [DU]"]
[null,null,null,"SW7521","Nickel (AA, Furnace Method) [SW7521]",null,null,null,null,null,null,"FONOFOS","Dyfonate",null,null,null,null,null,null,null,null,"E.coli","CFU/100 mL,MPN/100 mL,PFU/100 mL","Standard Method (19th) 9223 B: Chromogenic Substrate Coliform [A9223B];Standard Method (19th) 9230 B: Fecal Strep Multiple Tube Tech. [A9230B];Standard Method 9230 D: Fluorogenic Substrate Enterococcus Test [A9230D];Standard Method 9221 B&E: Total & Fecal Coliform [A9221BE];Standard Method 9221 B: Total Coliform Fermentation Technique [A9221B];Standard Method 9221 E: Fecal Coliform [A9221E];Standard Method 9221 F: Escherichia coli (Proposed) [A9221F];Standard Method 9222 D: Fecal Coliform [A9222D];Total Coliform: Membrane-Filter Technique [SW9132];Total Coliform: Multiple Tube Fermentation Technique [SW9131];Data Unavailable [DU]"]
[null,null,null,"E249.2","Nickel (AA, Furnace) [E249.2]",null,null,null,null,null,null,"ECOLI","E.coli",null,null,null,null,null,null,null,null,"Electrical Conductivity @ 25 Deg. C","mmhos/cm,umhos/cm","ASA (1982) 10-3.3: Electrical Conductivity [ASA1033];HACH Conductivity, Method 8160 [H8160];Specific Conductance [E120.1];Specific Conductance [SW9050A];Standard Method (19th) 2510 B: Specific Conductance [A2510B];Data Unavailable [DU]"]
[null,null,null,"SW8090","Nitroaromatics and Cyclic Ketones [SW8090]",null,null,null,null,null,null,"SC","Electrical Conductivity @ 25 Deg. C",null,null,null,null,null,null,null,null,"Endosulfan I",{"$f":"$AG$8","v":"kg/L,g/L,mg/L,ppth,ug/L,ng/L,pg/L,mg/cm2,g/day,g/year,kg/day,kg/month,kg/year,lb/day,lbs/week,lbs/month,lbs/year,mg/day,mg/kg,ug/kg,ng/g,ulbs/day,ug/day,t/day"},"Chlorinated Pesticides in Groundwater [E508];Extractable Priority Pollutants [E625];Extractable Priority Pollutants by GC/MS SIM [E625SIM];Halogenated Volatile Organics by Headspace [3810HVO];HISTORICAL: Organochlorine Pesticides & PCBs as Aroclors by GC [SW8081];HISTORICAL: Organochlorine Pesticides and PCBs [SW8080];Organochlorine Pesticides and PCBs [E608];Organochlorine Pesticides and PCBs by GC/HSD [E608.3];Organochlorine Pesticides by Gas Chromatography [SW8081A];Semivolatile Organic Compounds by GC/MS [SW8270C];Volatile Organic Compounds by GC/MS SIM [8260SIM];Data Unavailable [DU]"]
[null,null,null,"SW8091","Nitroaromatics and Cyclic Ketones by GC [SW8091]",null,null,null,null,null,null,"ENDOSULFANA","Endosulfan I",null,null,null,null,null,null,null,null,"Endosulfan II","kg/L,g/L,mg/L,ppth,ug/L,ng/L,pg/L,mg/cm2,g/day,g/year,kg/day,kg/month,kg/year,lb/day,lbs/week,lbs/month,lbs/year,mg/day,mg/kg,ug/kg,ng/g,ulbs/day,ug/day,t/day","Chlorinated Pesticides in Groundwater [E508];Extractable Priority Pollutants [E625];Extractable Priority Pollutants by GC/MS SIM [E625SIM];Halogenated Volatile Organics by Headspace [3810HVO];HISTORICAL: Organochlorine Pesticides & PCBs as Aroclors by GC [SW8081];HISTORICAL: Organochlorine Pesticides and PCBs [SW8080];Organochlorine Pesticides and PCBs [E608];Organochlorine Pesticides and PCBs by GC/HSD [E608.3];Organochlorine Pesticides by Gas Chromatography [SW8081A];Semivolatile Organic Compounds by GC/MS [SW8270C];Volatile Organic Compounds by GC/MS SIM [8260SIM];Data Unavailable [DU]"]
[null,null,null,"SW8330","Nitroaromatics and Nitramines by HPLC [SW8330]",null,null,null,null,null,null,"ENDOSULFANB","Endosulfan II",null,null,null,null,null,null,null,null,"Endosulfan Sulfate","kg/L,g/L,mg/L,ppth,ug/L,ng/L,pg/L,mg/cm2,g/day,g/year,kg/day,kg/month,kg/year,lb/day,lbs/week,lbs/month,lbs/year,mg/day,mg/kg,ug/kg,ng/g,ulbs/day,ug/day,t/day","Chlorinated Pesticides in Groundwater [E508];Extractable Priority Pollutants [E625];Extractable Priority Pollutants by GC/MS SIM [E625SIM];Halogenated Volatile Organics by Headspace [3810HVO];HISTORICAL: Organochlorine Pesticides & PCBs as Aroclors by GC [SW8081];HISTORICAL: Organochlorine Pesticides and PCBs [SW8080];Organochlorine Pesticides and PCBs [E608];Organochlorine Pesticides and PCBs by GC/HSD [E608.3];Organochlorine Pesticides by Gas Chromatography [SW8081A];Semivolatile Organic Compounds by GC/MS [SW8270C];Volatile Organic Compounds by GC/MS SIM [8260SIM];Data Unavailable [DU]"]
[null,null,null,"SW8330B","Nitroaromatics, Nitramines, and Nitrate Esters by HPLC [SW8330B]",null,null,null,null,null,null,"ENDOSULFANS","Endosulfan Sulfate",null,null,null,null,null,null,null,null,"Endosulfans, Sum","kg/L,g/L,mg/L,ppth,ug/L,ng/L,pg/L,mg/cm2,g/day,g/year,kg/day,kg/month,kg/year,lb/day,lbs/week,lbs/month,lbs/year,mg/day,mg/kg,ug/kg,ng/g,ulbs/day,ug/day,t/day","GC/MS SIM Method [SIM];HISTORICAL: Organochlorine Pesticides & PCBs as Aroclors by GC [SW8081];Organochlorine Pesticides and PCBs [E608];Organochlorine Pesticides by Gas Chromatography [SW8081A];Semivolatile Organic Compounds by Isotope Dilution GCMS [E1625C];Data Unavailable [DU]"]
[null,null,null,"E507","Nitrogen- & Phosphorus-Containing Pest. in Water by GC [E507]",null,null,null,null,null,null,"ENDOSULFANT","Endosulfans, Sum",null,null,null,null,null,null,null,null,"Endothal","kg/L,g/L,mg/L,ppth,ug/L,ng/L,pg/L,mg/cm2,g/day,g/year,kg/day,kg/month,kg/year,lb/day,lbs/week,lbs/month,lbs/year,mg/day,mg/kg,ug/kg,ng/g,ulbs/day,ug/day,t/day","Chlorinated Acids in Water by LLME [E515.4];Endothall in Drinking Water by IEE, AMM, & GC/MS [E548.1];Data Unavailable [DU]"]
[null,null,null,"E350.1","Nitrogen, Ammonia (as N) [E350.1]",null,null,null,null,null,null,"ENDOTHAL","Endothal",null,null,null,null,null,null,null,null,"Endrin","kg/L,g/L,mg/L,ppth,ug/L,ng/L,pg/L,mg/cm2,g/day,g/year,kg/day,kg/month,kg/year,lb/day,lbs/week,lbs/month,lbs/year,mg/day,mg/kg,ug/kg,ng/g,ulbs/day,ug/day,t/day","Chlorinated Pesticides in Groundwater [E508];Extractable Priority Pollutants [E625];Extractable Priority Pollutants by GC/MS SIM [E625SIM];GC/MS SIM Method [SIM];HISTORICAL: Organochlorine Pesticides & PCBs as Aroclors by GC [SW8081];Organochlorine Pesticides and PCBs [E608];Organochlorine Pesticides by Gas Chromatography [SW8081A];Semivolatile Organic Compounds by GC/MS [SW8270C];Semivolatile Organic Compounds by Isotope Dilution GCMS [E1625C];Volatile Organic Compounds by GC/MS SIM [8260SIM];Organochlorine Pesticides and PCBs by GC/HSD [E608.3];Data Unavailable [DU]"]
[null,null,null,"E350.2","Nitrogen, Ammonia (as N) [E350.2]",null,null,null,null,null,null,"ENDRIN","Endrin",null,null,null,null,null,null,null,null,"Endrin Aldehyde","kg/L,g/L,mg/L,ppth,ug/L,ng/L,pg/L,mg/cm2,g/day,g/year,kg/day,kg/month,kg/year,lb/day,lbs/week,lbs/month,lbs/year,mg/day,mg/kg,ug/kg,ng/g,ulbs/day,ug/day,t/day","Chlorinated Pesticides in Groundwater [E508];Extractable Priority Pollutants [E625];Extractable Priority Pollutants by GC/MS SIM [E625SIM];GC/MS SIM Method [SIM];HISTORICAL: Organochlorine Pesticides & PCBs as Aroclors by GC [SW8081];HISTORICAL: Organochlorine Pesticides and PCBs [SW8080];Organochlorine Pesticides and PCBs [E608];Organochlorine Pesticides by Gas Chromatography [SW8081A];Semivolatile Organic Compounds by GC/MS [SW8270C];Volatile Organic Compounds by GC/MS SIM [8260SIM];Volatile Organic Compounds EPA Method 624 [E624];Organochlorine Pesticides and PCBs by GC/HSD [E608.3];Data Unavailable [DU]"]
[null,null,null,"E350.3","Nitrogen, Ammonia (as N) [E350.3]",null,null,null,null,null,null,"ENDRINALD","Endrin Aldehyde",null,null,null,null,null,null,null,null,"Endrin ketone","kg/L,g/L,mg/L,ppth,ug/L,ng/L,pg/L,mg/cm2,g/day,g/year,kg/day,kg/month,kg/year,lb/day,lbs/week,lbs/month,lbs/year,mg/day,mg/kg,ug/kg,ng/g,ulbs/day,ug/day,t/day","Extractable Priority Pollutants [E625];GC/MS SIM Method [SIM];HISTORICAL: Organochlorine Pesticides and PCBs [SW8080];Organochlorine Pesticides and PCBs [E608];Organochlorine Pesticides by Gas Chromatography [SW8081A];Data Unavailable [DU]"]
[null,null,null,"E350.1M","Nitrogen, Ammonia (as N) Modified [E350.1M]",null,null,null,null,null,null,"ENDRINKET","Endrin ketone",null,null,null,null,null,null,null,null,"Enterococci","CFU/100 mL,MPN/100 mL,PFU/100 mL","Method 1600: Enterococci in Water by Membrane Filtration Using membrane-Enterococcus Indoxyl-B-D-Glucoside Agar [E1600];Standard Method (19th) 9230 B: Fecal Strep Multiple Tube Tech. [A9230B];Standard Method 9230 D: Fluorogenic Substrate Enterococcus Test [A9230D];Standard Method 9215 B: Heterotrophic Plate Count-Pour Plate [A9215B];Standard Method 9221 B&E: Total & Fecal Coliform [A9221BE];Standard Method 9221 E: Fecal Coliform [A9221E];Standard Method 9221 F: Escherichia coli (Proposed) [A9221F];Total Coliform: Membrane-Filter Technique [SW9132];IDEXX Enterolert Test for Enterococci [IENTENT];Data Unavailable [DU]"]
[null,null,null,"E351.1","Nitrogen, Kjeldahl, Total [E351.1]",null,null,null,null,null,null,"ENTCOCCUS","Enterococci",null,null,null,null,null,null,null,null,"EPN",{"$f":"$AG$8","v":"kg/L,g/L,mg/L,ppth,ug/L,ng/L,pg/L,mg/cm2,g/day,g/year,kg/day,kg/month,kg/year,lb/day,lbs/week,lbs/month,lbs/year,mg/day,mg/kg,ug/kg,ng/g,ulbs/day,ug/day,t/day"},"Data Unavailable [DU]"]
[null,null,null,"E351.2","Nitrogen, Kjeldahl, Total [E351.2]",null,null,null,null,null,null,"EPN","EPN",null,null,null,null,null,null,null,null,"Esfenvalerate, Freely Dissolved","kg/L,g/L,mg/L,ppth,ug/L,ng/L,pg/L,mg/cm2,g/day,g/year,kg/day,kg/month,kg/year,lb/day,lbs/week,lbs/month,lbs/year,mg/day,mg/kg,ug/kg,ng/g,ulbs/day,ug/day,t/day","Data Unavailable [DU]"]
[null,null,null,"E351.3","Nitrogen, Kjeldahl, Total [E351.3]",null,null,null,null,null,"L","ESFENVAL","Esfenvalerate, Freely Dissolved",null,null,null,null,null,null,null,null,"Esfenvalerate, Total","kg/L,g/L,mg/L,ppth,ug/L,ng/L,pg/L,mg/cm2,g/day,g/year,kg/day,kg/month,kg/year,lb/day,lbs/week,lbs/month,lbs/year,mg/day,mg/kg,ug/kg,ng/g,ulbs/day,ug/day,t/day","Data Unavailable [DU]"]
[null,null,null,"E351.4","Nitrogen, Kjeldahl, Total [E351.4]",null,null,null,null,null,null,"ESFENVAL","Esfenvalerate, Total",null,null,null,null,null,null,null,null,"Ethanol","kg/L,g/L,mg/L,ppth,ug/L,ng/L,pg/L,mg/cm2,g/day,g/year,kg/day,kg/month,kg/year,lb/day,lbs/week,lbs/month,lbs/year,mg/day,mg/kg,ug/kg,ng/g,ulbs/day,ug/day,t/day","Volatile Organic Compounds by GC/MS [SW8260B];Data Unavailable [DU]"]
[null,null,null,"E351.4M","Nitrogen, Kjeldahl, Total Modified [E351.4M]",null,null,null,null,null,null,"ETHANOL","Ethanol",null,null,null,null,null,null,null,null,"Ethion","kg/L,g/L,mg/L,ppth,ug/L,ng/L,pg/L,mg/cm2,g/day,g/year,kg/day,kg/month,kg/year,lb/day,lbs/week,lbs/month,lbs/year,mg/day,mg/kg,ug/kg,ng/g,ulbs/day,ug/day,t/day","Determination of Organophosphorus Pesticides [E614];EDB and DBCP In Water by Microextraction and Gas Chromatography [E504];Data Unavailable [DU]"]
[null,null,null,"E352.1","Nitrogen, Nitrate (as N) [E352.1]",null,null,null,null,null,null,"ETHION","Ethion",null,null,null,null,null,null,null,null,"Ethoprop","kg/L,g/L,mg/L,ppth,ug/L,ng/L,pg/L,mg/cm2,g/day,g/year,kg/day,kg/month,kg/year,lb/day,lbs/week,lbs/month,lbs/year,mg/day,mg/kg,ug/kg,ng/g,ulbs/day,ug/day,t/day","Extractable Priority Pollutants [E625];Data Unavailable [DU]"]
[null,null,null,"E353.2M","Nitrogen, Nitrate-Nitrate Modified [E353.2M]",null,null,null,null,null,null,"ETHOPROP","Ethoprop",null,null,null,null,null,null,null,null,"Ethylbenzene","kg/L,g/L,mg/L,ppth,ug/L,ng/L,pg/L,mg/cm2,g/day,g/year,kg/day,kg/month,kg/year,lb/day,lbs/week,lbs/month,lbs/year,mg/day,mg/kg,ug/kg,ng/g,ulbs/day,ug/day,t/day","Extractable Priority Pollutants [E625];Extractable Priority Pollutants by GC/MS SIM [E625SIM];GC/MS SIM Method [SIM];HISTORICAL: Volatile Organic Compounds by GC/MS [SW8260];Organochlorine Pesticides and PCBs [E608];Semivolatile Organic Compounds by GC/MS [SW8270C];VOCs by GC/MS Fuel Additives Plus BTEX [8260FAB];Volatile Organic Compounds by GC/MS - Open Scan [8260BOS];Volatile Organic Compounds by GC/MS [SW8260B];Volatile Organic Compounds by GC/MS plus Oxygenates [8260+OX];Volatile Organic Compounds by GC/MS SIM [8260SIM];Volatile Organic Compounds by Purge and Trap [E524.2];Volatile Organic Compounds EPA Method 624 [E624];Purgeables by GC/MS [E624.1];Data Unavailable [DU]"]
[null,null,null,"E353.1","Nitrogen, Nitrate-Nitrite [E353.1]",null,null,null,null,null,null,"EBZ","Ethylbenzene",null,null,null,null,null,null,null,null,"Ethylene glycol","kg/L,g/L,mg/L,ppth,ug/L,ng/L,pg/L,mg/cm2,g/day,g/year,kg/day,kg/month,kg/year,lb/day,lbs/week,lbs/month,lbs/year,mg/day,mg/kg,ug/kg,ng/g,ulbs/day,ug/day,t/day","Data Unavailable [DU]"]
[null,null,null,"E353.2","Nitrogen, Nitrate-Nitrite [E353.2]",null,null,null,null,null,null,"ETEGLY ","Ethylene glycol",null,null,null,null,null,null,null,null,"Ethyl-Tert Butyl Ether (ETBE)","kg/L,g/L,mg/L,ppth,ug/L,ng/L,pg/L,mg/cm2,g/day,g/year,kg/day,kg/month,kg/year,lb/day,lbs/week,lbs/month,lbs/year,mg/day,mg/kg,ug/kg,ng/g,ulbs/day,ug/day,t/day","GC/MS SIM Method [SIM];Semivolatile Organic Compounds by GC/MS [SW8270C];Volatile Organic Compounds by GC/MS [SW8260B];Data Unavailable [DU]"]
[null,null,null,"E353.3","Nitrogen, Nitrate-Nitrite [E353.3]",null,null,null,null,null,null,"ETBE","Ethyl-Tert Butyl Ether (ETBE)",null,null,null,null,null,null,null,null,"Fecal Coliform","CFU/100 mL,MPN/100 mL,PFU/100 mL","Standard Method (19th) 9223 B: Chromogenic Substrate Coliform [A9223B];Standard Method (19th) 9230 B: Fecal Strep Multiple Tube Tech. [A9230B];Standard Method 9230 D: Fluorogenic Substrate Enterococcus Test [A9230D];Standard Method 9221 B&E: Total & Fecal Coliform [A9221BE];Standard Method 9221 B: Total Coliform Fermentation Technique [A9221B];Standard Method 9221 E: Fecal Coliform [A9221E];Standard Method 9222 B: Total Coliform Membrane Filter Procedure [A9222B];Standard Method 9222 D: Fecal Coliform [A9222D];Total Coliform: Membrane-Filter Technique [SW9132];Total Coliform: Multiple Tube Fermentation Technique [SW9131];Data Unavailable [DU]"]
[null,null,null,"E354.1","Nitrogen, Nitrite [E354.1]",null,null,null,null,null,null,"FCOLIFORM","Fecal Coliform",null,null,null,null,null,null,null,null,"Fecal Streptococci","CFU/100 mL,MPN/100 mL,PFU/100 mL","Standard Method (19th) 9223 B: Chromogenic Substrate Coliform [A9223B];Standard Method (19th) 9230 B: Fecal Strep Multiple Tube Tech. [A9230B];Standard Method 9230 D: Fluorogenic Substrate Enterococcus Test [A9230D];Standard Method 9221 B&E: Total & Fecal Coliform [A9221BE];Standard Method 9221 B: Total Coliform Fermentation Technique [A9221B];Standard Method 9221 E: Fecal Coliform [A9221E];Standard Method 9222 B: Total Coliform Membrane Filter Procedure [A9222B];Standard Method 9222 D: Fecal Coliform [A9222D];Total Coliform: Membrane-Filter Technique [SW9132];Total Coliform: Multiple Tube Fermentation Technique [SW9131];Data Unavailable [DU]"]
[null,null,null,"SW8332","Nitroglycerine by HPLC [SW8332]",null,null,null,null,null,null,"FECSTREP","Fecal Streptococci",null,null,null,null,null,null,null,null,"Fenitrothion",{"$f":"$AG$8","v":"kg/L,g/L,mg/L,ppth,ug/L,ng/L,pg/L,mg/cm2,g/day,g/year,kg/day,kg/month,kg/year,lb/day,lbs/week,lbs/month,lbs/year,mg/day,mg/kg,ug/kg,ng/g,ulbs/day,ug/day,t/day"},"Data Unavailable [DU]"]
[null,null,null,"E521","Nitrosamines in Drinking Water by Solid Phase Extraction by GCMS [E521]",null,null,null,null,null,null,"FENTROION","Fenitrothion",null,null,null,null,null,null,null,null,"Fensulfothion",{"$f":"$AG$8","v":"kg/L,g/L,mg/L,ppth,ug/L,ng/L,pg/L,mg/cm2,g/day,g/year,kg/day,kg/month,kg/year,lb/day,lbs/week,lbs/month,lbs/year,mg/day,mg/kg,ug/kg,ng/g,ulbs/day,ug/day,t/day"},"Extractable Priority Pollutants [E625];Data Unavailable [DU]"]
[null,null,null,"E531.1","N-Methylcarbamoyloximes & N-Methylcarbamates in Water by HPLC [E531.1]",null,null,null,null,null,null,"FENSTHION","Fensulfothion",null,null,null,null,null,null,null,null,"Fenthion",{"$f":"$AG$8","v":"kg/L,g/L,mg/L,ppth,ug/L,ng/L,pg/L,mg/cm2,g/day,g/year,kg/day,kg/month,kg/year,lb/day,lbs/week,lbs/month,lbs/year,mg/day,mg/kg,ug/kg,ng/g,ulbs/day,ug/day,t/day"},"Extractable Priority Pollutants [E625];Data Unavailable [DU]"]
[null,null,null,"E531.2","N-Methylcarbamoyloximes & N-Methylcarbamates in Water by HPLC [E531.2]",null,null,null,null,null,null,"FENTHION","Fenthion",null,null,null,null,null,null,null,null,"Fenuron",{"$f":"$AG$8","v":"kg/L,g/L,mg/L,ppth,ug/L,ng/L,pg/L,mg/cm2,g/day,g/year,kg/day,kg/month,kg/year,lb/day,lbs/week,lbs/month,lbs/year,mg/day,mg/kg,ug/kg,ng/g,ulbs/day,ug/day,t/day"},"Data Unavailable [DU]"]
[null,null,null,"SW8015B","Non-Halogenated Organics Using GC/FID [SW8015B]",null,null,null,null,null,null,"FENURON","Fenuron",null,null,null,null,null,null,null,null,"Fixed Dissolved Solids (FDS)",{"$f":"$AG$8","v":"kg/L,g/L,mg/L,ppth,ug/L,ng/L,pg/L,mg/cm2,g/day,g/year,kg/day,kg/month,kg/year,lb/day,lbs/week,lbs/month,lbs/year,mg/day,mg/kg,ug/kg,ng/g,ulbs/day,ug/day,t/day"},"Standard Method (19th) 2540 E: Fixd/Volatile Solids Ignited [A2540E];Data Unavailable [DU]"]
[null,null,null,"JAEM1","ODB by MPN - J. App. & Env. Micro., 1990, vol. 56, num. 12 [JAEM1]",null,null,null,null,null,null,"FDS","Fixed Dissolved Solids (FDS)",null,null,null,null,null,null,null,null,"Floating Particulates, Dry Weight ","mg/L","Standard Method 2530 B: Particulate Floatables (1997) [A2530B]"]
[null,null,null,"E413.2","Oil and Grease, Total Recoverable (Spectrophotometric IR) [E413.2]",null,null,null,null,null,null,"FLOATPART","Floating Particulates, Dry Weight ",null,null,null,null,null,null,null,null,"Flow","%,Million gallons,cfs,gallons/minute,gallons/hour,GPD,MGD,gallons/week,gallons/month,MGM,L/day,gal/min per lamp","Calculated Value [CALCVAL];Data Unavailable [DU]"]
[null,null,null,"E413.1","Oil and Grease, Total Recoverable [E413.1]",null,null,null,null,null,null,"FLOW","Flow",null,null,null,null,null,null,null,null,"Fluometuron",{"$f":"$AG$8","v":"kg/L,g/L,mg/L,ppth,ug/L,ng/L,pg/L,mg/cm2,g/day,g/year,kg/day,kg/month,kg/year,lb/day,lbs/week,lbs/month,lbs/year,mg/day,mg/kg,ug/kg,ng/g,ulbs/day,ug/day,t/day"},"Semivolatile Organic Compounds by GC/MS [SW8270C];Data Unavailable [DU]"]
[null,null,null,"OAHPLC","Organic Acids by HPLC/UV [OAHPLC]",null,null,null,null,null,null,"FLUOMETURON","Fluometuron",null,null,null,null,null,null,null,null,"Fluoranthene","kg/L,g/L,mg/L,ppth,ug/L,ng/L,pg/L,mg/cm2,g/day,g/year,kg/day,kg/month,kg/year,lb/day,lbs/week,lbs/month,lbs/year,mg/day,mg/kg,ug/kg,ng/g,ulbs/day,ug/day,t/day","Extractable Priority Pollutants [E625];Extractable Priority Pollutants by GC/MS SIM [E625SIM];GC/MS SIM Method [SIM];HISTORICAL: Semivolatile Organic Compounds by GC/MS [SW8270];HISTORICAL: Semivolatile Organic Compounds by GC/MS [SW8270A];Organochlorine Pesticides and PCBs [E608];Polynuclear Aromatic Hydrocarbons [E610];Semivolatile Organic Compounds by GC/MS - Open Scan [8270COS];Semivolatile Organic Compounds by GC/MS [SW8270C];Semivolatile Organic Compounds by GC/MS SIM [8270SIM];Semivolatile Organic Compounds by Isotope Dilution GCMS [E1625C];Semivolatile Organic Compounds by SPE & GC/MS [E526];Volatile Organic Compounds by GC/MS [SW8260B];Volatile Organic Compounds by GC/MS SIM [8260SIM];Volatile Organic Compounds EPA Method 624 [E624];Base/Neutrals and Acids by GC/MS [E625.1];Data Unavailable [DU]"]
[null,null,null,"E525.1","Organic Compounds in Drinking Water by LSE & CCGC/MS [E525.1]",null,null,null,null,null,null,"FLA","Fluoranthene",null,null,null,null,null,null,null,null,"Fluorene","kg/L,g/L,mg/L,ppth,ug/L,ng/L,pg/L,mg/cm2,g/day,g/year,kg/day,kg/month,kg/year,lb/day,lbs/week,lbs/month,lbs/year,mg/day,mg/kg,ug/kg,ng/g,ulbs/day,ug/day,t/day","Extractable Priority Pollutants [E625];Extractable Priority Pollutants by GC/MS SIM [E625SIM];GC/MS SIM Method [SIM];HISTORICAL: Semivolatile Organic Compounds by GC/MS [SW8270];HISTORICAL: Semivolatile Organic Compounds by GC/MS [SW8270A];Inorganic Anions by Ion Chromatography [E300.0];Organic Compounds in Drinking Water by LSE & CCGC/MS [E525.2];Polynuclear Aromatic Hydrocarbons [E610];Semivolatile Organic Compounds by GC/MS - Open Scan [8270COS];Semivolatile Organic Compounds by GC/MS [SW8270C];Semivolatile Organic Compounds by GC/MS SIM [8270SIM];Semivolatile Organic Compounds by Isotope Dilution GCMS [E1625C];Volatile Organic Compounds by GC/MS [SW8260B];Volatile Organic Compounds by GC/MS SIM [8260SIM];Base/Neutrals and Acids by GC/MS [E625.1];Data Unavailable [DU]"]
[null,null,null,"E525.2","Organic Compounds in Drinking Water by LSE & CCGC/MS [E525.2]",null,null,null,null,null,null,"FL","Fluorene",null,null,null,null,null,null,null,null,"Fluoride, Total","kg/L,g/L,mg/L,ppth,ug/L,ng/L,pg/L,mg/cm2,g/day,g/year,kg/day,kg/month,kg/year,lb/day,lbs/week,lbs/month,lbs/year,mg/day,mg/kg,ug/kg,ng/g,ulbs/day,ug/day,t/day","Fluoride [E340.1];Fluoride [E340.2];Fluoride Modified [E340.2M];Inorganic Anions by Ion Chromatography [E300.0];Inorganic Anions by Ion Chromatography, Part B [E300B];Standard Method (19th) 4500-F C: Flouride by Ion-Select. Electrode [A4500FC];Data Unavailable [DU]"]
[null,null,null,"CCOPB","Organic Lead  Method (California Code, Title 22, Chpt 11, App 11) [CCOPB]",null,null,null,null,null,null,"F","Fluoride, Total",null,null,null,null,null,null,null,null,"Fluridone","kg/L,g/L,mg/L,ppth,ug/L,ng/L,pg/L,mg/cm2,g/day,g/year,kg/day,kg/month,kg/year,lb/day,lbs/week,lbs/month,lbs/year,mg/day,mg/kg,ug/kg,ng/g,ulbs/day,ug/day,t/day","Data Unavailable [DU]"]
[null,null,null,"E608","Organochlorine Pesticides and PCBs [E608]",null,null,null,null,null,null,"FLURIDONE","Fluridone",null,null,null,null,null,null,null,null,"Formaldehyde","kg/L,g/L,mg/L,ppth,ug/L,ng/L,pg/L,mg/cm2,g/day,g/year,kg/day,kg/month,kg/year,lb/day,lbs/week,lbs/month,lbs/year,mg/day,mg/kg,ug/kg,ng/g,ulbs/day,ug/day,t/day","Carbonyl Compounds by GC/MS [E556];Determination of Carbonyl Compounds by HPLC [SW8315A];Formaldehyde by GC [N2541];Data Unavailable [DU]"]
[null,null,null,"SW8080A","Organochlorine Pesticides and PCBs by GC [SW8080A]",null,null,null,null,null,null,"FORMALD","Formaldehyde",null,null,null,null,null,null,null,null,"Freeboard","Feet,inches,meters","Data Unavailable [DU]"]
[null,null,null,"E608.3","Organochlorine Pesticides and PCBs by GC/HSD [E608.3]",null,null,null,null,null,null,"FREEBOARD","Freeboard",null,null,null,null,null,null,null,null,"gamma-BHC",{"$f":"$AG$8","v":"kg/L,g/L,mg/L,ppth,ug/L,ng/L,pg/L,mg/cm2,g/day,g/year,kg/day,kg/month,kg/year,lb/day,lbs/week,lbs/month,lbs/year,mg/day,mg/kg,ug/kg,ng/g,ulbs/day,ug/day,t/day"},"1990 EML Procedures Manual, Pu-11, HASL-300 [ISOPU];Chlorinated Pesticides in Groundwater [E508];Extractable Priority Pollutants [E625];Extractable Priority Pollutants by GC/MS SIM [E625SIM];GC/MS SIM Method [SIM];HISTORICAL: Organochlorine Pesticides & PCBs as Aroclors by GC [SW8081];HISTORICAL: Organochlorine Pesticides and PCBs [SW8080];Organochlorine Pesticides and PCBs [E608];Organochlorine Pesticides and PCBs by GC/HSD [E608.3];Organochlorine Pesticides by Gas Chromatography [SW8081A];Semivolatile Organic Compounds by GC/MS [SW8270C];Volatile Organic Compounds by GC/MS SIM [8260SIM];Data Unavailable [DU]"]
[null,null,null,"SW8081A","Organochlorine Pesticides by Gas Chromatography [SW8081A]",null,null,null,null,null,null,"BHCGAMMA","gamma-BHC",null,null,null,null,null,null,null,null,"gamma-Chlordane",{"$f":"$AG$8","v":"kg/L,g/L,mg/L,ppth,ug/L,ng/L,pg/L,mg/cm2,g/day,g/year,kg/day,kg/month,kg/year,lb/day,lbs/week,lbs/month,lbs/year,mg/day,mg/kg,ug/kg,ng/g,ulbs/day,ug/day,t/day"},"Extractable Priority Pollutants [E625];HISTORICAL: Organochlorine Pesticides and PCBs [SW8080];Organochlorine Pesticides and PCBs [E608];Organochlorine Pesticides by Gas Chromatography [SW8081A];Organochlorine Pesticides and PCBs by GC/HSD [E608.3];Data Unavailable [DU]"]
[null,null,null,"E505","Organohalide Pest. & Com. PCBs in Water by Microext. & GC [E505]",null,null,null,null,null,null,"CHLORDANEG","gamma-Chlordane",null,null,null,null,null,null,null,null,"Gasoline",{"$f":"$AG$8","v":"kg/L,g/L,mg/L,ppth,ug/L,ng/L,pg/L,mg/cm2,g/day,g/year,kg/day,kg/month,kg/year,lb/day,lbs/week,lbs/month,lbs/year,mg/day,mg/kg,ug/kg,ng/g,ulbs/day,ug/day,t/day"},"Modified SW8015 for Gasoline or Diesel Determination [M8015];Non-Halogenated Organics Using GC/FID [SW8015B];Total Recoverable Phenolics by Semi-automated Colorimetry [E420.4];Volatile Organic Compounds by GC/MS [SW8260B];Data Unavailable [DU]"]
[null,null,null,"SW8141A","Organophosphorus Compounds by Gas Chromatography [SW8141A]",null,null,null,null,null,null,"PHCG","Gasoline",null,null,null,null,null,null,null,null,"Glyoxal",{"$f":"$AG$8","v":"kg/L,g/L,mg/L,ppth,ug/L,ng/L,pg/L,mg/cm2,g/day,g/year,kg/day,kg/month,kg/year,lb/day,lbs/week,lbs/month,lbs/year,mg/day,mg/kg,ug/kg,ng/g,ulbs/day,ug/day,t/day"},"Data Unavailable [DU]"]
[null,null,null,"SW8140","Organophosphorus Pesticides [SW8140]",null,null,null,null,null,null,"GLYOXAL","Glyoxal",null,null,null,null,null,null,null,null,"Glyphosate, Total",{"$f":"$AG$8","v":"kg/L,g/L,mg/L,ppth,ug/L,ng/L,pg/L,mg/cm2,g/day,g/year,kg/day,kg/month,kg/year,lb/day,lbs/week,lbs/month,lbs/year,mg/day,mg/kg,ug/kg,ng/g,ulbs/day,ug/day,t/day"},"Glyphosate in Drinking Water by HPCL, PCD, & FD [E547];Data Unavailable [DU]"]
[null,null,null,"E638","Oryzalin in Wastewater [E638]",null,null,null,null,null,null,"GLYP","Glyphosate, Total",null,null,null,null,null,null,null,null,"Gradient","ft/ft","Data Unavailable [DU]"]
[null,null,null,"E252.1","Osmium (AA, Direct Aspiration) [E252.1]",null,null,null,null,null,null,"GRADIENT","Gradient",null,null,null,null,null,null,null,null,"Gradient Direction","Degrees","Data Unavailable [DU]"]
[null,null,null,"SW7550","Osmium (AA, Direct Aspiration) [SW7550]",null,null,null,null,null,null,"GRAD_DIRECT","Gradient Direction",null,null,null,null,null,null,null,null,"Groundwater Elevation","Feet","Data Unavailable [DU]"]
[null,null,null,"E252.2","Osmium (AA, Furnace ) [E252.2]",null,null,null,null,null,null,"GWELEV","Groundwater Elevation",null,null,null,null,null,null,null,null,"Halogenated Volatile Organic Compounds (HVOC)",{"$f":"$AG$8","v":"kg/L,g/L,mg/L,ppth,ug/L,ng/L,pg/L,mg/cm2,g/day,g/year,kg/day,kg/month,kg/year,lb/day,lbs/week,lbs/month,lbs/year,mg/day,mg/kg,ug/kg,ng/g,ulbs/day,ug/day,t/day"},"Data Unavailable [DU]"]
[null,null,null,"E360.1","Oxygen, Dissolved [E360.1]",null,null,null,null,null,null,"HVOCS","Halogenated Volatile Organic Compounds (HVOC)",null,null,null,null,null,null,null,null,"Halomethanes, Sum","kg/L,g/L,mg/L,ppth,ug/L,ng/L,pg/L,mg/cm2,g/day,g/year,kg/day,kg/month,kg/year,lb/day,lbs/week,lbs/month,lbs/year,mg/day,mg/kg,ug/kg,ng/g,ulbs/day,ug/day,t/day","Halogenated Volatile Organics by Headspace [3810HVO];Organochlorine Pesticides by Gas Chromatography [SW8081A];Semivolatile Organic Compounds by GC/MS [SW8270C];Standard Method 2340 B: Hardness by Calculation [A2340B];Volatile Organic Compounds by GC/MS [SW8260B];Volatile Organic Compounds by Purge and Trap [E524.2];Volatile Organic Compounds EPA Method 624 [E624];Volatile Organic Compounds in Water by Purge and Trap [E502.2];Data Unavailable [DU]"]
[null,null,null,"E360.2","Oxygen, Dissolved [E360.2]",null,null,null,null,null,null,"HMSUM","Halomethanes, Sum",null,null,null,null,null,null,null,null,"Hardness, Ca (as CaCO3)","kg/L,g/L,mg/L,ppth,ug/L,ng/L,pg/L,mg/cm2,g/day,g/year,kg/day,kg/month,kg/year,lb/day,lbs/week,lbs/month,lbs/year,mg/day,mg/kg,ug/kg,ng/g,ulbs/day,ug/day,t/day","Hardness, Total (Colorimetric, Automated EDTA) [E130.1];Hardness, Total (Titrimetric) [E130.2];Standard Method 2340 B: Hardness by Calculation [A2340B];Standard Method 2340 C: Hardness by Calc.-EDTA Titrimetric Method [A2340C];Data Unavailable [DU]"]
[null,null,null,"E550.1","PAH in Drinking Water by LSE & HPLC [E550.1]",null,null,null,null,null,null,"CAHARD","Hardness, Ca (as CaCO3)",null,null,null,null,null,null,null,null,"Hardness, Mg (as CaCO3)","kg/L,g/L,mg/L,ppth,ug/L,ng/L,pg/L,mg/cm2,g/day,g/year,kg/day,kg/month,kg/year,lb/day,lbs/week,lbs/month,lbs/year,mg/day,mg/kg,ug/kg,ng/g,ulbs/day,ug/day,t/day","Hardness, Total (Colorimetric, Automated EDTA) [E130.1];Hardness, Total (Titrimetric) [E130.2];Standard Method 2340 B: Hardness by Calculation [A2340B];Standard Method 2340 C: Hardness by Calc.-EDTA Titrimetric Method [A2340C];Data Unavailable [DU]"]
[null,null,null,"SW9095","Paint Filter Liquids Test [SW9095]",null,null,null,null,null,null,"MGHARD","Hardness, Mg (as CaCO3)",null,null,null,null,null,null,null,null,"Hardness, Total (as CaCO3)","kg/L,g/L,mg/L,ppth,ug/L,ng/L,pg/L,mg/cm2,g/day,g/year,kg/day,kg/month,kg/year,lb/day,lbs/week,lbs/month,lbs/year,mg/day,mg/kg,ug/kg,ng/g,ulbs/day,ug/day,t/day","Hardness, Total (Colorimetric, Automated EDTA) [E130.1];Hardness, Total (Titrimetric) [E130.2];Standard Method 2340 B: Hardness by Calculation [A2340B];Standard Method 2340 C: Hardness by Calc.-EDTA Titrimetric Method [A2340C];Data Unavailable [DU]"]
[null,null,null,"E253.2","Palladium (AA, Furnace) [E253.2]",null,null,null,null,null,null,"HARD","Hardness, Total (as CaCO3)",null,null,null,null,null,null,null,null,"Heptachlor","kg/L,g/L,mg/L,ppth,ug/L,ng/L,pg/L,mg/cm2,g/day,g/year,kg/day,kg/month,kg/year,lb/day,lbs/week,lbs/month,lbs/year,mg/day,mg/kg,ug/kg,ng/g,ulbs/day,ug/day,t/day","Chlorinated Pesticides in Groundwater [E508];Extractable Priority Pollutants [E625];Extractable Priority Pollutants by GC/MS SIM [E625SIM];GC/MS SIM Method [SIM];HISTORICAL: Organochlorine Pesticides & PCBs as Aroclors by GC [SW8081];HISTORICAL: Organochlorine Pesticides and PCBs [SW8080];Organochlorine Pesticides and PCBs [E608];Organochlorine Pesticides by Gas Chromatography [SW8081A];Semivolatile Organic Compounds by GC/MS [SW8270C];Semivolatile Organic Compounds by Isotope Dilution GCMS [E1625C];Volatile Organic Compounds by GC/MS SIM [8260SIM];Organochlorine Pesticides and PCBs by GC/HSD [E608.3];Data Unavailable [DU]"]
[null,null,null,"E253.1","Palladium, (AA, Direct Aspiration ) [E253.1]",null,null,null,null,null,null,"HEPTACHLOR","Heptachlor",null,null,null,null,null,null,null,null,"Heptachlor Epoxide","kg/L,g/L,mg/L,ppth,ug/L,ng/L,pg/L,mg/cm2,g/day,g/year,kg/day,kg/month,kg/year,lb/day,lbs/week,lbs/month,lbs/year,mg/day,mg/kg,ug/kg,ng/g,ulbs/day,ug/day,t/day","Chlorinated Pesticides in Groundwater [E508];Extractable Priority Pollutants [E625];Extractable Priority Pollutants by GC/MS SIM [E625SIM];GC/MS SIM Method [SIM];HISTORICAL: Organochlorine Pesticides & PCBs as Aroclors by GC [SW8081];HISTORICAL: Organochlorine Pesticides and PCBs [SW8080];Organochlorine Pesticides and PCBs [E608];Organochlorine Pesticides by Gas Chromatography [SW8081A];Semivolatile Organic Compounds by GC/MS [SW8270C];Semivolatile Organic Compounds by Isotope Dilution GCMS [E1625C];Volatile Organic Compounds by GC/MS SIM [8260SIM];Organochlorine Pesticides and PCBs by GC/HSD [E608.3];Data Unavailable [DU]"]
[null,null,null,"PS1986","Particle Size by PSEP Protocols [PS1986]",null,null,null,null,null,null,"HEPT-EPOX","Heptachlor Epoxide",null,null,null,null,null,null,null,null,"Hexachlorobenzene","kg/L,g/L,mg/L,ppth,ug/L,ng/L,pg/L,mg/cm2,g/day,g/year,kg/day,kg/month,kg/year,lb/day,lbs/week,lbs/month,lbs/year,mg/day,mg/kg,ug/kg,ng/g,ulbs/day,ug/day,t/day","Extractable Priority Pollutants [E625];Extractable Priority Pollutants by GC/MS SIM [E625SIM];GC/MS SIM Method [SIM];HISTORICAL: Semivolatile Organic Compounds by GC/MS [SW8270];HISTORICAL: Semivolatile Organic Compounds by GC/MS [SW8270A];Organic Compounds in Drinking Water by LSE & CCGC/MS [E525.2];Organochlorine Pesticides and PCBs [E608];Organochlorine Pesticides by Gas Chromatography [SW8081A];Semivolatile Organic Compounds by GC/MS - Open Scan [8270COS];Semivolatile Organic Compounds by GC/MS [SW8270C];Semivolatile Organic Compounds by Isotope Dilution GCMS [E1625C];Semivolatile Organic Compounds by SPE & GC/MS [E526];Volatile Organic Compounds by GC/MS [SW8260B];Volatile Organic Compounds by GC/MS SIM [8260SIM];Volatile Organic Compounds EPA Method 624 [E624];Base/Neutrals and Acids by GC/MS [E625.1];Data Unavailable [DU]"]
[null,null,null,"E6045","PCB Oil [E6045]",null,null,null,null,null,null,"HCLBZ","Hexachlorobenzene",null,null,null,null,null,null,null,null,"Hexachlorobutadiene","kg/L,g/L,mg/L,ppth,ug/L,ng/L,pg/L,mg/cm2,g/day,g/year,kg/day,kg/month,kg/year,lb/day,lbs/week,lbs/month,lbs/year,mg/day,mg/kg,ug/kg,ng/g,ulbs/day,ug/day,t/day","Extractable Priority Pollutants [E625];Extractable Priority Pollutants by GC/MS SIM [E625SIM];GC/MS SIM Method [SIM];HISTORICAL: Semivolatile Organic Compounds by GC/MS [SW8270];HISTORICAL: Semivolatile Organic Compounds by GC/MS [SW8270A];HISTORICAL: Volatile Organic Compounds by GC/MS [SW8260];Organochlorine Pesticides and PCBs [E608];Organochlorine Pesticides by Gas Chromatography [SW8081A];Semivolatile Organic Compounds by GC/MS - Open Scan [8270COS];Semivolatile Organic Compounds by GC/MS [SW8270C];Semivolatile Organic Compounds by Isotope Dilution GCMS [E1625C];Semivolatile Organic Compounds by SPE & GC/MS [E526];Volatile Organic Compounds by GC/MS [SW8260B];Volatile Organic Compounds by GC/MS SIM [8260SIM];Volatile Organic Compounds by Purge and Trap [E524.2];Volatile Organic Compounds EPA Method 624 [E624];Base/Neutrals and Acids by GC/MS [E625.1];Data Unavailable [DU]"]
[null,null,null,"E508A","PCBs by Perchlorination & GC [E508A]",null,null,null,null,null,null,"HCBU","Hexachlorobutadiene",null,null,null,null,null,null,null,null,"Hexachlorocyclopentadiene","kg/L,g/L,mg/L,ppth,ug/L,ng/L,pg/L,mg/cm2,g/day,g/year,kg/day,kg/month,kg/year,lb/day,lbs/week,lbs/month,lbs/year,mg/day,mg/kg,ug/kg,ng/g,ulbs/day,ug/day,t/day","Extractable Priority Pollutants [E625];Extractable Priority Pollutants by GC/MS SIM [E625SIM];GC/MS SIM Method [SIM];HISTORICAL: Semivolatile Organic Compounds by GC/MS [SW8270];HISTORICAL: Semivolatile Organic Compounds by GC/MS [SW8270A];Organic Compounds in Drinking Water by LSE & CCGC/MS [E525.2];Organochlorine Pesticides and PCBs [E608];Semivolatile Organic Compounds by GC/MS - Open Scan [8270COS];Semivolatile Organic Compounds by GC/MS [SW8270C];Semivolatile Organic Compounds by Isotope Dilution GCMS [E1625C];Semivolatile Organic Compounds by SPE & GC/MS [E526];Volatile Organic Compounds by GC/MS [SW8260B];Volatile Organic Compounds by GC/MS SIM [8260SIM];Volatile Organic Compounds EPA Method 624 [E624];Base/Neutrals and Acids by GC/MS [E625.1];Data Unavailable [DU]"]
[null,null,null,"AG7-2.2","Percent Moisture [AG7-2.2]",null,null,null,null,null,null,"HCCP","Hexachlorocyclopentadiene",null,null,null,null,null,null,null,null,"Hexachloroethane","kg/L,g/L,mg/L,ppth,ug/L,ng/L,pg/L,mg/cm2,g/day,g/year,kg/day,kg/month,kg/year,lb/day,lbs/week,lbs/month,lbs/year,mg/day,mg/kg,ug/kg,ng/g,ulbs/day,ug/day,t/day","Extractable Priority Pollutants [E625];Extractable Priority Pollutants by GC/MS SIM [E625SIM];GC/MS SIM Method [SIM];HISTORICAL: Semivolatile Organic Compounds by GC/MS [SW8270];HISTORICAL: Semivolatile Organic Compounds by GC/MS [SW8270A];Organochlorine Pesticides and PCBs [E608];Organochlorine Pesticides by Gas Chromatography [SW8081A];Semivolatile Organic Compounds by GC/MS - Open Scan [8270COS];Semivolatile Organic Compounds by GC/MS [SW8270C];Semivolatile Organic Compounds by Isotope Dilution GCMS [E1625C];Semivolatile Organic Compounds by SPE & GC/MS [E526];Volatile Organic Compounds by GC/MS [SW8260B];Volatile Organic Compounds by GC/MS SIM [8260SIM];Volatile Organic Compounds EPA Method 624 [E624];Base/Neutrals and Acids by GC/MS [E625.1];Data Unavailable [DU]"]
[null,null,null,"E632","Pesticides, Carbamate and Urea [E632]",null,null,null,null,null,null,"HCLEA","Hexachloroethane",null,null,null,null,null,null,null,null,"Hexane","ug/L","Volatile Organic Compounds by GC/MS [SW8260B];Data Unavailable [DU]"]
[null,null,null,"E418.1","Petroleum Hydrocarbons, Total Recoverable [E418.1]",null,null,null,null,null,null,"HEXANE","Hexane",null,null,null,null,null,null,null,null,"Hydrazine",{"$f":"$AG$8","v":"kg/L,g/L,mg/L,ppth,ug/L,ng/L,pg/L,mg/cm2,g/day,g/year,kg/day,kg/month,kg/year,lb/day,lbs/week,lbs/month,lbs/year,mg/day,mg/kg,ug/kg,ng/g,ulbs/day,ug/day,t/day"},"Extractable Priority Pollutants [E625];Data Unavailable [DU]"]
[null,null,null,"E1633-D","PFAS in Aqueous, Solid, Biosolids, and Tissue Samples by LC-MS/MS-Draft [E1633-D]",null,null,null,null,null,null,"HYDRAZINE","Hydrazine",null,null,null,null,null,null,null,null,"Hydrocarbons, Petroleum","kg/L,g/L,mg/L,ppth,ug/L,ng/L,pg/L,mg/cm2,g/day,g/year,kg/day,kg/month,kg/year,lb/day,lbs/week,lbs/month,lbs/year,mg/day,mg/kg,ug/kg,ng/g,ulbs/day,ug/day,t/day","CA LUFT Method for Diesel Range Organics [CATPH-D];HEM and SGT-HEM by Extraction and Gravimetry, Rev. A [E1664A];Modified SW8015 for Gasoline or Diesel Determination [M8015];Non-Halogenated Organics Using GC/FID [SW8015B];Petroleum Hydrocarbons, Total Recoverable [E418.1];Volatiles by GC/Gasoline Range Organics (SW8021B/8015) [SW8021F];Data Unavailable [DU]"]
[null,null,null,"SW9040C","pH Electrometric Measurement [SW9040C]",null,null,null,null,null,null,"TRPH","Hydrocarbons, Petroleum",null,null,null,null,null,null,null,null,"Hydrocarbons, Total Chlorinated","kg/L,g/L,mg/L,ppth,ug/L,ng/L,pg/L,mg/cm2,g/day,g/year,kg/day,kg/month,kg/year,lb/day,lbs/week,lbs/month,lbs/year,mg/day,mg/kg,ug/kg,ng/g,ulbs/day,ug/day,t/day","Halogenated Volatile Organics by Headspace [3810HVO];HISTORICAL: Organochlorine Pesticides & PCBs as Aroclors by GC [SW8081];Organochlorine Pesticides and PCBs [E608];Data Unavailable [DU]"]
[null,null,null,"SW9041A","pH Paper Method [SW9041A]",null,null,null,null,null,null,"CLHYD","Hydrocarbons, Total Chlorinated",null,null,null,null,null,null,null,null,"Hydrogen Peroxide","kg/L,g/L,mg/L,ppth,ug/L,ng/L,pg/L,mg/cm2,g/day,g/year,kg/day,kg/month,kg/year,lb/day,lbs/week,lbs/month,lbs/year,mg/day,mg/kg,ug/kg,ng/g,ulbs/day,ug/day,t/day","Data Unavailable [DU]"]
[null,null,null,"E150.1","pH, Electrometric [E150.1]",null,null,null,null,null,null,"HPEROXIDE","Hydrogen Peroxide",null,null,null,null,null,null,null,null,"Hydrogen Sulfide","kg/L,g/L,mg/L,ppth,ug/L,ng/L,pg/L,mg/cm2,g/day,g/year,kg/day,kg/month,kg/year,lb/day,lbs/week,lbs/month,lbs/year,mg/day,mg/kg,ug/kg,ng/g,ulbs/day,ug/day,t/day","Standard Method (18th & 19th) 2320 B: Alkalinity by Titration [A2320B];Data Unavailable [DU]"]
[null,null,null,"SW9040B","pH, Electrometric Measurement [SW9040B]",null,null,null,null,null,null,"H2S","Hydrogen Sulfide",null,null,null,null,null,null,null,null,"Imazapyr","kg/L,g/L,mg/L,ppth,ug/L,ng/L,pg/L,mg/cm2,g/day,g/year,kg/day,kg/month,kg/year,lb/day,lbs/week,lbs/month,lbs/year,mg/day,mg/kg,ug/kg,ng/g,ulbs/day,ug/day,t/day","Data Unavailable [DU]"]
[null,null,null,"DXABIEE","Pharmaceuticals, Hormones, and Personal Care Products using LC-MS-MS by Eaton Eurofin",null,null,null,null,null,null,"IMAZAPYR","Imazapyr",null,null,null,null,null,null,null,null,"Indeno (1,2,3-cd) Pyrene","kg/L,g/L,mg/L,ppth,ug/L,ng/L,pg/L,mg/cm2,g/day,g/year,kg/day,kg/month,kg/year,lb/day,lbs/week,lbs/month,lbs/year,mg/day,mg/kg,ug/kg,ng/g,ulbs/day,ug/day,t/day","Extractable Priority Pollutants [E625];Extractable Priority Pollutants by GC/MS SIM [E625SIM];GC/MS SIM Method [SIM];HISTORICAL: Semivolatile Organic Compounds by GC/MS [SW8270];HISTORICAL: Semivolatile Organic Compounds by GC/MS [SW8270A];Organic Compounds in Drinking Water by LSE & CCGC/MS [E525.2];Polynuclear Aromatic Hydrocarbons [E610];Semivolatile Organic Compounds by GC/MS - Open Scan [8270COS];Semivolatile Organic Compounds by GC/MS [SW8270C];Semivolatile Organic Compounds by GC/MS SIM [8270SIM];Semivolatile Organic Compounds by Isotope Dilution GCMS [E1625C];Volatile Organic Compounds by GC/MS SIM [8260SIM];Base/Neutrals and Acids by GC/MS [E625.1];Data Unavailable [DU]"]
[null,null,null,"E420.2","Phenolics (Colorimetric, Automated 4-AAP with Distillation) [E420.2]",null,null,null,null,null,null,"INP123","Indeno (1,2,3-cd) Pyrene",null,null,null,null,null,null,null,null,"Iron, Dissolved","kg/L,g/L,mg/L,ppth,ug/L,ng/L,pg/L,mg/cm2,g/day,g/year,kg/day,kg/month,kg/year,lb/day,lbs/week,lbs/month,lbs/year,mg/day,mg/kg,ug/kg,ng/g,ulbs/day,ug/day,t/day","Inductively Coupled Plasma Emission - modified for CLP [CL200.7];Inductively Coupled Plasma Emission [E200.7];Inductively Coupled Plasma/Mass Spectroscopy [E200.8];Inductively Coupled Plasma-Atomic Emission Spectroscopy [SW6010B];Iron (AA, Direct Aspiration) [E236.1];Iron (AA, Direct Aspiration) [SW7380];Iron (AA, Furnace Technique) [E236.2];Lovely/Phillips (1987) Rapid Assay for Microbially Reducible Fe3+ [LPFE3];Metals by Atomic Absorption [E200.0];Standard Method (19th) 3111 B: Metals, Direct Air-Acetylene Flame [A3111B];Standard Method (19th) 3113: Metals by Furnace AAS [A3113B];Standard Method (19th) 3500-Fe D: Penanthroline Method [A3500FE];Data Unavailable [DU]"]
[null,null,null,"SW9066","Phenolics (Colorimetric, Automated 4-AAP with Distillation) [SW9066]",null,null,null,null,null,"L","FE","Iron, Dissolved",null,null,null,null,null,null,null,null,"Iron, Filtered","kg/L,g/L,mg/L,ppth,ug/L,ng/L,pg/L,mg/cm2,g/day,g/year,kg/day,kg/month,kg/year,lb/day,lbs/week,lbs/month,lbs/year,mg/day,mg/kg,ug/kg,ng/g,ulbs/day,ug/day,t/day","Inductively Coupled Plasma Emission - modified for CLP [CL200.7];Inductively Coupled Plasma Emission [E200.7];Inductively Coupled Plasma/Mass Spectroscopy [E200.8];Inductively Coupled Plasma-Atomic Emission Spectroscopy [SW6010B];Iron (AA, Direct Aspiration) [E236.1];Iron (AA, Direct Aspiration) [SW7380];Iron (AA, Furnace Technique) [E236.2];Lovely/Phillips (1987) Rapid Assay for Microbially Reducible Fe3+ [LPFE3];Metals by Atomic Absorption [E200.0];Standard Method (19th) 3111 B: Metals, Direct Air-Acetylene Flame [A3111B];Standard Method (19th) 3113: Metals by Furnace AAS [A3113B];Standard Method (19th) 3500-Fe D: Penanthroline Method [A3500FE];Data Unavailable [DU]"]
[null,null,null,"SW9065","Phenolics (Spectrophotometric, Manual 4-AAP with Distillation) [SW9065]",null,null,null,null,null,"F","FE","Iron, Filtered",null,null,null,null,null,null,null,null,"Iron, Total","kg/L,g/L,mg/L,ppth,ug/L,ng/L,pg/L,mg/cm2,g/day,g/year,kg/day,kg/month,kg/year,lb/day,lbs/week,lbs/month,lbs/year,mg/day,mg/kg,ug/kg,ng/g,ulbs/day,ug/day,t/day","Inductively Coupled Plasma Emission - modified for CLP [CL200.7];Inductively Coupled Plasma Emission [E200.7];Inductively Coupled Plasma/Mass Spectroscopy [E200.8];Inductively Coupled Plasma-Atomic Emission Spectroscopy [SW6010B];Iron (AA, Direct Aspiration) [E236.1];Iron (AA, Direct Aspiration) [SW7380];Iron (AA, Furnace Technique) [E236.2];Lovely/Phillips (1987) Rapid Assay for Microbially Reducible Fe3+ [LPFE3];Metals by Atomic Absorption [E200.0];Standard Method (19th) 3111 B: Metals, Direct Air-Acetylene Flame [A3111B];Standard Method (19th) 3113: Metals by Furnace AAS [A3113B];Standard Method (19th) 3500-Fe D: Penanthroline Method [A3500FE];Data Unavailable [DU]"]
[null,null,null,"E420.1","Phenolics, Total Recoverable (Spectrophotometric, Manual) [E420.1]",null,null,null,null,null,null,"FE","Iron, Total",null,null,null,null,null,null,null,null,"Iron, Total Recoverable","kg/L,g/L,mg/L,ppth,ug/L,ng/L,pg/L,mg/cm2,g/day,g/year,kg/day,kg/month,kg/year,lb/day,lbs/week,lbs/month,lbs/year,mg/day,mg/kg,ug/kg,ng/g,ulbs/day,ug/day,t/day","Inductively Coupled Plasma Emission - modified for CLP [CL200.7];Inductively Coupled Plasma Emission [E200.7];Inductively Coupled Plasma/Mass Spectroscopy [E200.8];Inductively Coupled Plasma-Atomic Emission Spectroscopy [SW6010B];Iron (AA, Direct Aspiration) [E236.1];Iron (AA, Direct Aspiration) [SW7380];Iron (AA, Furnace Technique) [E236.2];Lovely/Phillips (1987) Rapid Assay for Microbially Reducible Fe3+ [LPFE3];Metals by Atomic Absorption [E200.0];Standard Method (19th) 3111 B: Metals, Direct Air-Acetylene Flame [A3111B];Standard Method (19th) 3113: Metals by Furnace AAS [A3113B];Standard Method (19th) 3500-Fe D: Penanthroline Method [A3500FE];Data Unavailable [DU]"]
[null,null,null,"E420.1M","Phenolics, Total Recoverable Modified [E420.1M]",null,null,null,null,null,"N","FE","Iron, Total Recoverable",null,null,null,null,null,null,null,null,"Isophorone","kg/L,g/L,mg/L,ppth,ug/L,ng/L,pg/L,mg/cm2,g/day,g/year,kg/day,kg/month,kg/year,lb/day,lbs/week,lbs/month,lbs/year,mg/day,mg/kg,ug/kg,ng/g,ulbs/day,ug/day,t/day","Extractable Priority Pollutants [E625];Extractable Priority Pollutants by GC/MS SIM [E625SIM];GC/MS SIM Method [SIM];HISTORICAL: Semivolatile Organic Compounds by GC/MS [SW8270];HISTORICAL: Semivolatile Organic Compounds by GC/MS [SW8270A];Organochlorine Pesticides and PCBs [E608];Organochlorine Pesticides by Gas Chromatography [SW8081A];Semivolatile Organic Compounds by GC/MS - Open Scan [8270COS];Semivolatile Organic Compounds by GC/MS [SW8270C];Semivolatile Organic Compounds by Isotope Dilution GCMS [E1625C];Semivolatile Organic Compounds by SPE & GC/MS [E526];Volatile Organic Compounds by GC/MS [SW8260B];Volatile Organic Compounds by GC/MS SIM [8260SIM];Base/Neutrals and Acids by GC/MS [E625.1];Data Unavailable [DU]"]
[null,null,null,"SW8040A","Phenols by Gas Chromatography [SW8040A]",null,null,null,null,null,null,"ISOP","Isophorone",null,null,null,null,null,null,null,null,"Isopropanol","kg/L,g/L,mg/L,ppth,ug/L,ng/L,pg/L,mg/cm2,g/day,g/year,kg/day,kg/month,kg/year,lb/day,lbs/week,lbs/month,lbs/year,mg/day,mg/kg,ug/kg,ng/g,ulbs/day,ug/day,t/day","Volatile Organic Compounds by GC/MS [SW8260B];Data Unavailable [DU]"]
[null,null,null,"E528","Phenols by Solid Phase Extraction and GC/MS [E528]",null,null,null,null,null,null,"ISOPROH","Isopropanol",null,null,null,null,null,null,null,null,"Isopropyl Ether","kg/L,g/L,mg/L,ppth,ug/L,ng/L,pg/L,mg/cm2,g/day,g/year,kg/day,kg/month,kg/year,lb/day,lbs/week,lbs/month,lbs/year,mg/day,mg/kg,ug/kg,ng/g,ulbs/day,ug/day,t/day","GC/MS SIM Method [SIM];Volatile Organic Compounds by GC/MS [SW8260B];Data Unavailable [DU]"]
[null,null,null,"E532","Phenylurea Compounds by Solid Phase Ext. and HPLC [E532]",null,null,null,null,null,null,"DIPE","Isopropyl Ether",null,null,null,null,null,null,null,null,"Isopropylbenzene","kg/L,g/L,mg/L,ppth,ug/L,ng/L,pg/L,mg/cm2,g/day,g/year,kg/day,kg/month,kg/year,lb/day,lbs/week,lbs/month,lbs/year,mg/day,mg/kg,ug/kg,ng/g,ulbs/day,ug/day,t/day","GC/MS SIM Method [SIM];HISTORICAL: Volatile Organic Compounds by GC/MS [SW8260];Organochlorine Pesticides and PCBs [E608];Semivolatile Organic Compounds by GC/MS [SW8270C];Volatile Organic Compounds by GC/MS [SW8260B];Purgeables by GC/MS [E624.1];Data Unavailable [DU]"]
[null,null,null,"E365.2","Phosphorus, All Forms (as P) [E365.2]",null,null,null,null,null,null,"IPBZ","Isopropylbenzene",null,null,null,null,null,null,null,null,"Lactic Acid","mg/L","Data Unavailable [DU]"]
[null,null,null,"E365.3","Phosphorus, All Forms (Colorimetric, Ascorbic Acid ) [E365.3]",null,null,null,null,null,null,"LACTICACID","Lactic Acid",null,null,null,null,null,null,null,null,"Lambda-Cyhalothrin, Freely Dissolved",{"$f":"$AG$8","v":"kg/L,g/L,mg/L,ppth,ug/L,ng/L,pg/L,mg/cm2,g/day,g/year,kg/day,kg/month,kg/year,lb/day,lbs/week,lbs/month,lbs/year,mg/day,mg/kg,ug/kg,ng/g,ulbs/day,ug/day,t/day"},"Data Unavailable [DU]"]
[null,null,null,"E365.1","Phosphorus, All Forms, (Colorimetric, Automated, Ascorbic Acid ) [E365.1]",null,null,null,null,null,"L","LCYHALO","Lambda-Cyhalothrin, Freely Dissolved",null,null,null,null,null,null,null,null,"Lambda-Cyhalothrin, Total",{"$f":"$AG$8","v":"kg/L,g/L,mg/L,ppth,ug/L,ng/L,pg/L,mg/cm2,g/day,g/year,kg/day,kg/month,kg/year,lb/day,lbs/week,lbs/month,lbs/year,mg/day,mg/kg,ug/kg,ng/g,ulbs/day,ug/day,t/day"},"Data Unavailable [DU]"]
[null,null,null,"E365.3M","Phosphorus, Reactive Soluble [E365.3M]",null,null,null,null,null,null,"LCYHALO","Lambda-Cyhalothrin, Total",null,null,null,null,null,null,null,null,"Lead Impact Ratio","%","Trace Elements in Ambient Waters by ICP-MS [E1638];Trace Elements in Water by Preconcentration and ICP-MS [E1640];Inductively Coupled Plasma Emission - modified for CLP [CL200.7];Inductively Coupled Plasma Emission [E200.7];Inductively Coupled Plasma/Mass Spectroscopy [E200.8];Atomic Absorption, Platform [E200.9];Inductively Coupled Plasma-Atomic Emission Spectroscopy [SW6010B];Inductively Coupled Plasma-Mass Spectrometry [SW6020];Lead (AA, Direct Aspiration) [E239.1];Lead (AA, Furnace Technique) [SW7421];Lead (AA, Furnace) - modified for CLP [CL239.2];Lead (AA, Furnace) [E239.2];Metals by Atomic Absorption [E200.0];Standard Method (19th) 3111 B: Metals, Direct Air-Acetylene Flame [A3111B];Standard Method (19th) 3113: Metals by Electrothermal AAS [A3113];Standard Method (19th) 3113: Metals by Furnace AAS [A3113B];Data Unavailable [DU]"]
[null,null,null,"E365.4","Phosphorus, Total (Colorimetric, Automated Block Digestor, AA II) [E365.4]",null,null,null,null,null,null,"PBIMRATIO","Lead Impact Ratio",null,null,null,null,null,null,null,null,"Lead, Dissolved",{"$f":"$AG$8","v":"kg/L,g/L,mg/L,ppth,ug/L,ng/L,pg/L,mg/cm2,g/day,g/year,kg/day,kg/month,kg/year,lb/day,lbs/week,lbs/month,lbs/year,mg/day,mg/kg,ug/kg,ng/g,ulbs/day,ug/day,t/day"},"Trace Elements in Ambient Waters by ICP-MS [E1638];Trace Elements in Water by Preconcentration and ICP-MS [E1640];Inductively Coupled Plasma Emission - modified for CLP [CL200.7];Inductively Coupled Plasma Emission [E200.7];Inductively Coupled Plasma/Mass Spectroscopy [E200.8];Atomic Absorption, Platform [E200.9];Inductively Coupled Plasma-Atomic Emission Spectroscopy [SW6010B];Inductively Coupled Plasma-Mass Spectrometry [SW6020];Lead (AA, Direct Aspiration) [E239.1];Lead (AA, Furnace Technique) [SW7421];Lead (AA, Furnace) - modified for CLP [CL239.2];Lead (AA, Furnace) [E239.2];Metals by Atomic Absorption [E200.0];Standard Method (19th) 3111 B: Metals, Direct Air-Acetylene Flame [A3111B];Standard Method (19th) 3113: Metals by Electrothermal AAS [A3113];Standard Method (19th) 3113: Metals by Furnace AAS [A3113B];Data Unavailable [DU]"]
[null,null,null,"SW8060","Phthalate Esters [SW8060]",null,null,null,null,null,"L","PB","Lead, Dissolved",null,null,null,null,null,null,null,null,"Lead, Organic","kg/L,g/L,mg/L,ppth,ug/L,ng/L,pg/L,mg/cm2,g/day,g/year,kg/day,kg/month,kg/year,lb/day,lbs/week,lbs/month,lbs/year,mg/day,mg/kg,ug/kg,ng/g,ulbs/day,ug/day,t/day","Data Unavailable [DU]"]
[null,null,null,"E255.2","Platinum (AA, Furnace ) [E255.2]",null,null,null,null,null,null,"PBO","Lead, Organic",null,null,null,null,null,null,null,null,"Lead, Total","kg/L,g/L,mg/L,ppth,ug/L,ng/L,pg/L,mg/cm2,g/day,g/year,kg/day,kg/month,kg/year,lb/day,lbs/week,lbs/month,lbs/year,mg/day,mg/kg,ug/kg,ng/g,ulbs/day,ug/day,t/day","Trace Elements in Ambient Waters by ICP-MS [E1638];Trace Elements in Water by Preconcentration and ICP-MS [E1640];Inductively Coupled Plasma Emission - modified for CLP [CL200.7];Inductively Coupled Plasma Emission [E200.7];Inductively Coupled Plasma/Mass Spectroscopy [E200.8];Atomic Absorption, Platform [E200.9];Inductively Coupled Plasma-Atomic Emission Spectroscopy [SW6010B];Inductively Coupled Plasma-Mass Spectrometry [SW6020];Lead (AA, Direct Aspiration) [E239.1];Lead (AA, Furnace Technique) [SW7421];Lead (AA, Furnace) - modified for CLP [CL239.2];Lead (AA, Furnace) [E239.2];Metals by Atomic Absorption [E200.0];Standard Method (19th) 3111 B: Metals, Direct Air-Acetylene Flame [A3111B];Standard Method (19th) 3113: Metals by Electrothermal AAS [A3113];Standard Method (19th) 3113: Metals by Furnace AAS [A3113B];Data Unavailable [DU]"]
[null,null,null,"E255.1","Platinum, (AA, Direct Aspiration) [E255.1]",null,null,null,null,null,null,"PB","Lead, Total",null,null,null,null,null,null,null,null,"Lead, Total Recoverable","kg/L,g/L,mg/L,ppth,ug/L,ng/L,pg/L,mg/cm2,g/day,g/year,kg/day,kg/month,kg/year,lb/day,lbs/week,lbs/month,lbs/year,mg/day,mg/kg,ug/kg,ng/g,ulbs/day,ug/day,t/day","Trace Elements in Ambient Waters by ICP-MS [E1638];Trace Elements in Water by Preconcentration and ICP-MS [E1640];Inductively Coupled Plasma Emission - modified for CLP [CL200.7];Inductively Coupled Plasma Emission [E200.7];Inductively Coupled Plasma/Mass Spectroscopy [E200.8];Atomic Absorption, Platform [E200.9];Inductively Coupled Plasma-Atomic Emission Spectroscopy [SW6010B];Inductively Coupled Plasma-Mass Spectrometry [SW6020];Lead (AA, Direct Aspiration) [E239.1];Lead (AA, Furnace Technique) [SW7421];Lead (AA, Furnace) - modified for CLP [CL239.2];Lead (AA, Furnace) [E239.2];Metals by Atomic Absorption [E200.0];Standard Method (19th) 3111 B: Metals, Direct Air-Acetylene Flame [A3111B];Standard Method (19th) 3113: Metals by Electrothermal AAS [A3113];Standard Method (19th) 3113: Metals by Furnace AAS [A3113B];Data Unavailable [DU]"]
[null,null,null,"SW8082","Polychlorinated Biphenyls (PCBs) by Gas Chromatography [SW8082]",null,null,null,null,null,"N","PB","Lead, Total Recoverable",null,null,null,null,null,null,null,null,"Leptophos","kg/L,g/L,mg/L,ppth,ug/L,ng/L,pg/L,mg/cm2,g/day,g/year,kg/day,kg/month,kg/year,lb/day,lbs/week,lbs/month,lbs/year,mg/day,mg/kg,ug/kg,ng/g,ulbs/day,ug/day,t/day","Organochlorine Pesticides and PCBs [E608];Data Unavailable [DU]"]
[null,null,null,"SW8280A","Polychlorinated Dibenzodioxins/Polychlorinated Dibenzofurans [SW8280A]",null,null,null,null,null,null,"LEPTO","Leptophos",null,null,null,null,null,null,null,null,"Linuron","kg/L,g/L,mg/L,ppth,ug/L,ng/L,pg/L,mg/cm2,g/day,g/year,kg/day,kg/month,kg/year,lb/day,lbs/week,lbs/month,lbs/year,mg/day,mg/kg,ug/kg,ng/g,ulbs/day,ug/day,t/day","Organochlorine Pesticides and PCBs [E608];Data Unavailable [DU]"]
[null,null,null,"SW8290","Polychlorinated Dibenzodioxins/Polychlorinated Dibenzofurans [SW8290]",null,null,null,null,null,"N","LINURON","Linuron",null,null,null,null,null,null,null,null,"Lithium, Total","kg/L,g/L,mg/L,ppth,ug/L,ng/L,pg/L,mg/cm2,g/day,g/year,kg/day,kg/month,kg/year,lb/day,lbs/week,lbs/month,lbs/year,mg/day,mg/kg,ug/kg,ng/g,ulbs/day,ug/day,t/day","Inductively Coupled Plasma Emission [E200.7];Inductively Coupled Plasma/Mass Spectroscopy [E200.8];Volatile Organic Compounds by GC/MS [SW8260B];Data Unavailable [DU]"]
[null,null,null,"E610","Polynuclear Aromatic Hydrocarbons [E610]",null,null,null,null,null,null,"LI","Lithium, Total",null,null,null,null,null,null,null,null,"m,p-Xylenes","kg/L,g/L,mg/L,ppth,ug/L,ng/L,pg/L,mg/cm2,g/day,g/year,kg/day,kg/month,kg/year,lb/day,lbs/week,lbs/month,lbs/year,mg/day,mg/kg,ug/kg,ng/g,ulbs/day,ug/day,t/day","Extractable Priority Pollutants [E625];GC/MS SIM Method [SIM];HISTORICAL: Volatile Organic Compounds by GC/MS [SW8260];Volatile Organic Compounds by GC/MS [SW8260B];Volatile Organic Compounds EPA Method 624 [E624];Purgeables by GC/MS [E624.1];Data Unavailable [DU]"]
[null,null,null,"SW8100","Polynuclear Aromatic Hydrocarbons [SW8100]",null,null,null,null,null,null,"XYLENES1314","m,p-Xylenes",null,null,null,null,null,null,null,null,"Magnesium, Dissolved","kg/L,g/L,mg/L,ppth,ug/L,ng/L,pg/L,mg/cm2,g/day,g/year,kg/day,kg/month,kg/year,lb/day,lbs/week,lbs/month,lbs/year,mg/day,mg/kg,ug/kg,ng/g,ulbs/day,ug/day,t/day","Inductively Coupled Plasma Emission - modified for CLP [CL200.7];Inductively Coupled Plasma Emission [E200.7];Inductively Coupled Plasma/Mass Spectroscopy [E200.8];Inductively Coupled Plasma-Atomic Emission Spectroscopy [SW6010B];Magnesium (AA, Direct Aspiration) - modified for CLP [CL242.1];Magnesium (AA, Direct Aspiration) [E242.1];Manganese (AA, Direct Aspiration) [E243.1];Magnesium (AA, Direct Aspiration) [SW7450];Metals by Atomic Absorption [E200.0];Standard Method (19th) 3111 B: Metals, Direct Air-Acetylene Flame [A3111B];Data Unavailable [DU]"]
[null,null,null,"SW8310","Polynuclear Aromatic Hydrocarbons [SW8310]",null,null,null,null,null,"L","MG","Magnesium, Dissolved",null,null,null,null,null,null,null,null,"Magnesium, Total","kg/L,g/L,mg/L,ppth,ug/L,ng/L,pg/L,mg/cm2,g/day,g/year,kg/day,kg/month,kg/year,lb/day,lbs/week,lbs/month,lbs/year,mg/day,mg/kg,ug/kg,ng/g,ulbs/day,ug/day,t/day","Inductively Coupled Plasma Emission - modified for CLP [CL200.7];Inductively Coupled Plasma Emission [E200.7];Inductively Coupled Plasma/Mass Spectroscopy [E200.8];Inductively Coupled Plasma-Atomic Emission Spectroscopy [SW6010B];Magnesium (AA, Direct Aspiration) - modified for CLP [CL242.1];Magnesium (AA, Direct Aspiration) [E242.1];Manganese (AA, Direct Aspiration) [E243.1];Magnesium (AA, Direct Aspiration) [SW7450];Metals by Atomic Absorption [E200.0];Standard Method (19th) 3111 B: Metals, Direct Air-Acetylene Flame [A3111B];Data Unavailable [DU]"]
[null,null,null,"CL258.1","Potassium (AA, Direct Aspiration) - modified for CLP [CL258.1]",null,null,null,null,null,null,"MG","Magnesium, Total",null,null,null,null,null,null,null,null,"Magnesium, Total Recoverable","kg/L,g/L,mg/L,ppth,ug/L,ng/L,pg/L,mg/cm2,g/day,g/year,kg/day,kg/month,kg/year,lb/day,lbs/week,lbs/month,lbs/year,mg/day,mg/kg,ug/kg,ng/g,ulbs/day,ug/day,t/day","Inductively Coupled Plasma Emission - modified for CLP [CL200.7];Inductively Coupled Plasma Emission [E200.7];Inductively Coupled Plasma/Mass Spectroscopy [E200.8];Inductively Coupled Plasma-Atomic Emission Spectroscopy [SW6010B];Magnesium (AA, Direct Aspiration) - modified for CLP [CL242.1];Magnesium (AA, Direct Aspiration) [E242.1];Manganese (AA, Direct Aspiration) [E243.1];Magnesium (AA, Direct Aspiration) [SW7450];Metals by Atomic Absorption [E200.0];Standard Method (19th) 3111 B: Metals, Direct Air-Acetylene Flame [A3111B];Data Unavailable [DU]"]
[null,null,null,"E258.1","Potassium (AA, Direct Aspiration) [E258.1]",null,null,null,null,null,"N","MG","Magnesium, Total Recoverable",null,null,null,null,null,null,null,null,"Malachite Green","kg/L,g/L,mg/L,ppth,ug/L,ng/L,pg/L,mg/cm2,g/day,g/year,kg/day,kg/month,kg/year,lb/day,lbs/week,lbs/month,lbs/year,mg/day,mg/kg,ug/kg,ng/g,ulbs/day,ug/day,t/day","Data Unavailable [DU]"]
[null,null,null,"SW7610","Potassium (AA, Direct Aspiration) [SW7610]",null,null,null,null,null,null,"MALGREEN","Malachite Green",null,null,null,null,null,null,null,null,"Malathion","kg/L,g/L,mg/L,ppth,ug/L,ng/L,pg/L,mg/cm2,g/day,g/year,kg/day,kg/month,kg/year,lb/day,lbs/week,lbs/month,lbs/year,mg/day,mg/kg,ug/kg,ng/g,ulbs/day,ug/day,t/day","Determination of Organophosphorus Pesticides [E614];Extractable Priority Pollutants [E625];Extractable Priority Pollutants by GC/MS SIM [E625SIM];HISTORICAL: Organophosphorus Compounds by GC [SW8141];Organochlorine Pesticides and PCBs [E608];Organophosphorus Compounds by Gas Chromatography [SW8141A];Data Unavailable [DU]"]
[null,null,null,"PSEPSID","Puget Sound Estuary Program, Sulfide Analysis [PSEPSID]",null,null,null,null,null,null,"MALA","Malathion",null,null,null,null,null,null,null,null,"Manganese, Dissolved","kg/L,g/L,mg/L,ppth,ug/L,ng/L,pg/L,mg/cm2,g/day,g/year,kg/day,kg/month,kg/year,lb/day,lbs/week,lbs/month,lbs/year,mg/day,mg/kg,ug/kg,ng/g,ulbs/day,ug/day,t/day","Inductively Coupled Plasma Emission - modified for CLP [CL200.7];Inductively Coupled Plasma Emission [E200.7];Inductively Coupled Plasma/Mass Spectroscopy [E200.8];Inductively Coupled Plasma-Atomic Emission Spectroscopy [SW6010B];Inductively Coupled Plasma-Mass Spectrometry [SW6020];Manganese (AA, Direct Aspiration) [E243.1];Manganese (AA, Furnace Technique) [E243.2];Metals by Atomic Absorption [E200.0];Standard Method (19th) 3111 B: Metals, Direct Air-Acetylene Flame [A3111B];Standard Method (19th) 3113: Metals by Electrothermal AAS [A3113];Standard Method (19th) 3113: Metals by Furnace AAS [A3113B];Data Unavailable [DU]"]
[null,null,null,"E602","Purgeable Aromatics [E602]",null,null,null,null,null,"L","MN","Manganese, Dissolved",null,null,null,null,null,null,null,null,"Manganese, Filtered","kg/L,g/L,mg/L,ppth,ug/L,ng/L,pg/L,mg/cm2,g/day,g/year,kg/day,kg/month,kg/year,lb/day,lbs/week,lbs/month,lbs/year,mg/day,mg/kg,ug/kg,ng/g,ulbs/day,ug/day,t/day","Inductively Coupled Plasma Emission - modified for CLP [CL200.7];Inductively Coupled Plasma Emission [E200.7];Inductively Coupled Plasma/Mass Spectroscopy [E200.8];Inductively Coupled Plasma-Atomic Emission Spectroscopy [SW6010B];Inductively Coupled Plasma-Mass Spectrometry [SW6020];Manganese (AA, Direct Aspiration) [E243.1];Manganese (AA, Furnace Technique) [E243.2];Metals by Atomic Absorption [E200.0];Standard Method (19th) 3111 B: Metals, Direct Air-Acetylene Flame [A3111B];Standard Method (19th) 3113: Metals by Electrothermal AAS [A3113];Standard Method (19th) 3113: Metals by Furnace AAS [A3113B];Data Unavailable [DU]"]
[null,null,null,"E601","Purgeable Halocarbons [E601]",null,null,null,null,null,"F","MN","Manganese, Filtered",null,null,null,null,null,null,null,null,"Manganese, Total","kg/L,g/L,mg/L,ppth,ug/L,ng/L,pg/L,mg/cm2,g/day,g/year,kg/day,kg/month,kg/year,lb/day,lbs/week,lbs/month,lbs/year,mg/day,mg/kg,ug/kg,ng/g,ulbs/day,ug/day,t/day","Inductively Coupled Plasma Emission - modified for CLP [CL200.7];Inductively Coupled Plasma Emission [E200.7];Inductively Coupled Plasma/Mass Spectroscopy [E200.8];Inductively Coupled Plasma-Atomic Emission Spectroscopy [SW6010B];Inductively Coupled Plasma-Mass Spectrometry [SW6020];Manganese (AA, Direct Aspiration) [E243.1];Manganese (AA, Furnace Technique) [E243.2];Metals by Atomic Absorption [E200.0];Standard Method (19th) 3111 B: Metals, Direct Air-Acetylene Flame [A3111B];Standard Method (19th) 3113: Metals by Electrothermal AAS [A3113];Standard Method (19th) 3113: Metals by Furnace AAS [A3113B];Data Unavailable [DU]"]
[null,null,null,"E624.1","Purgeables by GC/MS [E624.1]",null,null,null,null,null,null,"MN","Manganese, Total",null,null,null,null,null,null,null,null,"Manganese, Total Recoverable","kg/L,g/L,mg/L,ppth,ug/L,ng/L,pg/L,mg/cm2,g/day,g/year,kg/day,kg/month,kg/year,lb/day,lbs/week,lbs/month,lbs/year,mg/day,mg/kg,ug/kg,ng/g,ulbs/day,ug/day,t/day","Inductively Coupled Plasma Emission - modified for CLP [CL200.7];Inductively Coupled Plasma Emission [E200.7];Inductively Coupled Plasma/Mass Spectroscopy [E200.8];Inductively Coupled Plasma-Atomic Emission Spectroscopy [SW6010B];Inductively Coupled Plasma-Mass Spectrometry [SW6020];Manganese (AA, Direct Aspiration) [E243.1];Manganese (AA, Furnace Technique) [E243.2];Metals by Atomic Absorption [E200.0];Standard Method (19th) 3111 B: Metals, Direct Air-Acetylene Flame [A3111B];Standard Method (19th) 3113: Metals by Electrothermal AAS [A3113];Standard Method (19th) 3113: Metals by Furnace AAS [A3113B];Data Unavailable [DU]"]
[null,null,null,"E905.0","Radioactive Strontium in Water [E905.0]",null,null,null,null,null,"N","MN","Manganese, Total Recoverable",null,null,null,null,null,null,null,null,"MCPA","kg/L,g/L,mg/L,ppth,ug/L,ng/L,pg/L,mg/cm2,g/day,g/year,kg/day,kg/month,kg/year,lb/day,lbs/week,lbs/month,lbs/year,mg/day,mg/kg,ug/kg,ng/g,ulbs/day,ug/day,t/day","Chlorinated Herbicides by GC [SW8151A];Determination of Chlorinated Acids in Water by GC/ECD [E515.1];Data Unavailable [DU]"]
[null,null,null,"E903.1","Radium [E903.1]",null,null,null,null,null,null,"MCPA","MCPA",null,null,null,null,null,null,null,null,"MCPP","kg/L,g/L,mg/L,ppth,ug/L,ng/L,pg/L,mg/cm2,g/day,g/year,kg/day,kg/month,kg/year,lb/day,lbs/week,lbs/month,lbs/year,mg/day,mg/kg,ug/kg,ng/g,ulbs/day,ug/day,t/day","Chlorinated Herbicides by GC [SW8151A];Determination of Chlorinated Acids in Water by GC/ECD [E515.1];Mercury (Cold Vapor, Manual) [E245.1];Mercury in Water by Oxidation, P&T, and Cold Vapor [E1631];Tetra thru Octa-Chlorinated Dioxins and Furans by Isotope Dilutin [E1613A];Volatile Organic Compounds by GC/MS [SW8260B];Data Unavailable [DU]"]
[null,null,null,"SW9320","Radium-228 [SW9320]",null,null,null,null,null,null,"MCPP","MCPP",null,null,null,null,null,null,null,null,"Mercury, Dissolved","kg/L,g/L,mg/L,ppth,ug/L,ng/L,pg/L,mg/cm2,g/day,g/year,kg/day,kg/month,kg/year,lb/day,lbs/week,lbs/month,lbs/year,mg/day,mg/kg,ug/kg,ng/g,ulbs/day,ug/day,t/day","Inductively Coupled Plasma/Mass Spectroscopy [E200.8];Mercury (Cold Vapor, Manual) - modified for CLP [CL245.1];Mercury (Cold Vapor, Manual) [E245.1];Mercury in Water by Oxidation, P&T, and Cold Vapor [E1631];Standard Method (19th) 3112 B: Metals by Cold-Vapor AAS [A3112B];Data Unavailable [DU]"]
[null,null,null,"AK103AA","Residual Range Organics (Aliphatics/Aromatics), ADEC [AK103AA]",null,null,null,null,null,"L","HG","Mercury, Dissolved",null,null,null,null,null,null,null,null,"Mercury, Total","kg/L,g/L,mg/L,ppth,ug/L,ng/L,pg/L,mg/cm2,g/day,g/year,kg/day,kg/month,kg/year,lb/day,lbs/week,lbs/month,lbs/year,mg/day,mg/kg,ug/kg,ng/g,ulbs/day,ug/day,t/day","Inductively Coupled Plasma Emission [E200.7];Inductively Coupled Plasma/Mass Spectroscopy [E200.8];Mercury (Cold Vapor, Manual) - modified for CLP [CL245.1];Mercury (Cold Vapor, Manual) [E245.1];Mercury (Cold Vapor, Automated) - modified for CLP [CL245.2];Mercury (Cold Vapor, Automated) [E245.2];Mercury (Cold Vapor, Sediments) [E245.5];Mercury - CVA Fluorescence Spectrometry [E245.7];Inductively Coupled Plasma-Atomic Emission Spectroscopy [SW6010B];Inductively Coupled Plasma-Mass Spectrometry [SW6020];Mercury in Liquid Waste (Manual Cold-Vapor Technique) [SW7470A];Mercury in Solid or Semisolid Waste (Manual Cold-Vapor Tech) [SW7471B];Mercury in Water by Oxidation, P&T, and Cold Vapor [E1631];Metals by Atomic Absorption [E200.0];Standard Method (19th) 3112 B: Metals by Cold-Vapor AAS [A3112B];HISTORICAL: Mercury in Liquid Waste (Manual Cold-Vapor Technique) [SW7470];HISTORICAL: Mercury in Solid/Semisolid Waste (Manual C-V Tech.) [SW7471A];Data Unavailable [DU]"]
[null,null,null,"E160.1","Residue, Filterable (TDS) [E160.1]",null,null,null,null,null,null,"HG","Mercury, Total",null,null,null,null,null,null,null,null,"Mercury, Total Recoverable","kg/L,g/L,mg/L,ppth,ug/L,ng/L,pg/L,mg/cm2,g/day,g/year,kg/day,kg/month,kg/year,lb/day,lbs/week,lbs/month,lbs/year,mg/day,mg/kg,ug/kg,ng/g,ulbs/day,ug/day,t/day","1990 EML Procedures Manual, Pu-11, HASL-300 [ISOPU];Extractable Priority Pollutants [E625];Extractable Priority Pollutants by GC/MS SIM [E625SIM];Fathead Minnow Larval Survival and Growth Test [E1000.0];Halogenated Volatile Organics by Headspace [3810HVO];HISTORICAL: Mercury in Liquid Waste (Manual Cold-Vapor Technique) [SW7470];HISTORICAL: Mercury in Solid/Semisolid Waste (Manual C-V Tech.) [SW7471A];Inductively Coupled Plasma Emission - modified for CLP [CL200.7];Inductively Coupled Plasma Emission [E200.7];Inductively Coupled Plasma/Mass Spectroscopy [E200.8];Inductively Coupled Plasma-Atomic Emission Spectroscopy [SW6010B];Lovely/Phillips (1987) Rapid Assay for Microbially Reducible Fe3+ [LPFE3];Mercury - CVA Fluorescence Spectrometry [E245.7];Mercury (Cold Vapor, Automated) - modified for CLP [CL245.2];Mercury (Cold Vapor, Automated) [E245.2];Mercury (Cold Vapor, Manual) - modified for CLP [CL245.1];Mercury (Cold Vapor, Manual) [E245.1];Mercury in Liquid Waste (Manual Cold-Vapor Technique) [SW7470A];Mercury in Solid or Semisolid Waste (Manual Cold-Vapor Tech) [SW7471B];Mercury in Water by Oxidation, P&T, and Cold Vapor [E1631];Metals by Atomic Absorption [E200.0];Standard Method (19th) 3112 B: Metals by Cold-Vapor AAS [A3112B];Data Unavailable [DU]"]
[null,null,null,"E160.2","Residue, Non-Filterable [E160.2]",null,null,null,null,null,"N","HG","Mercury, Total Recoverable",null,null,null,null,null,null,null,null,"Merphos","kg/L,g/L,mg/L,ppth,ug/L,ng/L,pg/L,mg/cm2,g/day,g/year,kg/day,kg/month,kg/year,lb/day,lbs/week,lbs/month,lbs/year,mg/day,mg/kg,ug/kg,ng/g,ulbs/day,ug/day,t/day","Extractable Priority Pollutants [E625];Data Unavailable [DU]"]
[null,null,null,"E160.3M","Residue, Total (Gravimetric Dried) Modified [E160.3M]",null,null,null,null,null,null,"MERPHOS","Merphos",null,null,null,null,null,null,null,null,"Methanol","kg/L,g/L,mg/L,ppth,ug/L,ng/L,pg/L,mg/cm2,g/day,g/year,kg/day,kg/month,kg/year,lb/day,lbs/week,lbs/month,lbs/year,mg/day,mg/kg,ug/kg,ng/g,ulbs/day,ug/day,t/day","Data Unavailable [DU]"]
[null,null,null,"E160.3","Residue, Total (Gravimetric, Dried at 103-105 Degrees) [E160.3]",null,null,null,null,null,null,"MEOH","Methanol",null,null,null,null,null,null,null,null,"Methiocarb","kg/L,g/L,mg/L,ppth,ug/L,ng/L,pg/L,mg/cm2,g/day,g/year,kg/day,kg/month,kg/year,lb/day,lbs/week,lbs/month,lbs/year,mg/day,mg/kg,ug/kg,ng/g,ulbs/day,ug/day,t/day","Volatile Organic Compounds EPA Method 624 [E624];Data Unavailable [DU]"]
[null,null,null,"E160.4","Residue, Volatile (Gravimetric, Ignition at 550 Degrees) [E160.4]",null,null,null,null,null,null,"METHIOCARB","Methiocarb",null,null,null,null,null,null,null,null,"Methomyl","kg/L,g/L,mg/L,ppth,ug/L,ng/L,pg/L,mg/cm2,g/day,g/year,kg/day,kg/month,kg/year,lb/day,lbs/week,lbs/month,lbs/year,mg/day,mg/kg,ug/kg,ng/g,ulbs/day,ug/day,t/day","N-Methylcarbamoyloximes & N-Methylcarbamates in Water by HPLC [E531.1];Data Unavailable [DU]"]
[null,null,null,"E160.4M","Residue, Volatile (Gravimetric, Ignition) Modified [E160.4M]",null,null,null,null,null,null,"METHOMYL","Methomyl",null,null,null,null,null,null,null,null,"Methoxychlor","kg/L,g/L,mg/L,ppth,ug/L,ng/L,pg/L,mg/cm2,g/day,g/year,kg/day,kg/month,kg/year,lb/day,lbs/week,lbs/month,lbs/year,mg/day,mg/kg,ug/kg,ng/g,ulbs/day,ug/day,t/day","Chlorinated Pesticides in Groundwater [E508];Extractable Priority Pollutants [E625];Extractable Priority Pollutants by GC/MS SIM [E625SIM];GC/MS SIM Method [SIM];HISTORICAL: Organochlorine Pesticides & PCBs as Aroclors by GC [SW8081];HISTORICAL: Organochlorine Pesticides and PCBs [SW8080];Organochlorine Pesticides and PCBs [E608];Organochlorine Pesticides by Gas Chromatography [SW8081A];Organohalide Pest. & Com. PCBs in Water by Microext. & GC [E505];Semivolatile Organic Compounds by GC/MS [SW8270C];Organochlorine Pesticides and PCBs by GC/HSD [E608.3];Data Unavailable [DU]"]
[null,null,null,"E265.1","Rhodium (AA, Direct Aspiration) [E265.1]",null,null,null,null,null,null,"MTXYCL","Methoxychlor",null,null,null,null,null,null,null,null,"Methyl Chloride","kg/L,g/L,mg/L,ppth,ug/L,ng/L,pg/L,mg/cm2,g/day,g/year,kg/day,kg/month,kg/year,lb/day,lbs/week,lbs/month,lbs/year,mg/day,mg/kg,ug/kg,ng/g,ulbs/day,ug/day,t/day","Data Unavailable [DU]"]
[null,null,null,"E265.2","Rhodium (AA, Furnace) [E265.2]",null,null,null,null,null,null,"CLME","Methyl Chloride",null,null,null,null,null,null,null,null,"Methyl Ethyl Ketone","kg/L,g/L,mg/L,ppth,ug/L,ng/L,pg/L,mg/cm2,g/day,g/year,kg/day,kg/month,kg/year,lb/day,lbs/week,lbs/month,lbs/year,mg/day,mg/kg,ug/kg,ng/g,ulbs/day,ug/day,t/day","Semivolatile Organic Compounds by GC/MS [SW8270C];Volatile Organic Compounds by GC/MS [SW8260B];Volatile Organic Compounds EPA Method 624 [E624];Data Unavailable [DU]"]
[null,null,null,"E267.1","Ruthenium (AA, Direct Aspiration) [E267.1]",null,null,null,null,null,null,"MEK","Methyl Ethyl Ketone",null,null,null,null,null,null,null,null,"Methyl Iodide","kg/L,g/L,mg/L,ppth,ug/L,ng/L,pg/L,mg/cm2,g/day,g/year,kg/day,kg/month,kg/year,lb/day,lbs/week,lbs/month,lbs/year,mg/day,mg/kg,ug/kg,ng/g,ulbs/day,ug/day,t/day","Volatile Organic Compounds by GC/MS [SW8260B];Purgeables by GC/MS [E624.1];Data Unavailable [DU]"]
[null,null,null,"E267.2","Ruthenium (AA, Furnace) [E267.2]",null,null,null,null,null,null,"IME","Methyl Iodide",null,null,null,null,null,null,null,null,"Methyl Mercury","kg/L,g/L,mg/L,ppth,ug/L,ng/L,pg/L,mg/cm2,g/day,g/year,kg/day,kg/month,kg/year,lb/day,lbs/week,lbs/month,lbs/year,mg/day,mg/kg,ug/kg,ng/g,ulbs/day,ug/day,t/day","Mercury in Water by Oxidation, P&T, and Cold Vapor [E1631];Methyl Mercury in Water by Distillation [E1630];Volatile Organic Compounds by GC/MS [SW8260B];Data Unavailable [DU]"]
[null,null,null,"E270.1","Selenium (AA, Direct Aspiration) [E270.1]",null,null,null,null,null,null,"CH3HG","Methyl Mercury",null,null,null,null,null,null,null,null,"Methyl Methacrylate","kg/L,g/L,mg/L,ppth,ug/L,ng/L,pg/L,mg/cm2,g/day,g/year,kg/day,kg/month,kg/year,lb/day,lbs/week,lbs/month,lbs/year,mg/day,mg/kg,ug/kg,ng/g,ulbs/day,ug/day,t/day","Volatile Organic Compounds by GC/MS [SW8260B];Purgeables by GC/MS [E624.1];Data Unavailable [DU]"]
[null,null,null,"SW7740","Selenium (AA, Furnace Technique) [SW7740]",null,null,null,null,null,null,"MMETHACRY","Methyl Methacrylate",null,null,null,null,null,null,null,null,"Methyl Parathion",{"$f":"$AG$8","v":"kg/L,g/L,mg/L,ppth,ug/L,ng/L,pg/L,mg/cm2,g/day,g/year,kg/day,kg/month,kg/year,lb/day,lbs/week,lbs/month,lbs/year,mg/day,mg/kg,ug/kg,ng/g,ulbs/day,ug/day,t/day"},"Determination of Organophosphorus Pesticides [E614];Extractable Priority Pollutants [E625];Organophosphorus Compounds by Gas Chromatography [SW8141A];Data Unavailable [DU]"]
[null,null,null,"CL270.2","Selenium (AA, Furnace) - modified for CLP [CL270.2]",null,null,null,null,null,null,"PARAM","Methyl Parathion",null,null,null,null,null,null,null,null,"Methyl Tert-butyl Ether (MTBE)","kg/L,g/L,mg/L,ppth,ug/L,ng/L,pg/L,mg/cm2,g/day,g/year,kg/day,kg/month,kg/year,lb/day,lbs/week,lbs/month,lbs/year,mg/day,mg/kg,ug/kg,ng/g,ulbs/day,ug/day,t/day","Extractable Priority Pollutants [E625];GC/MS SIM Method [SIM];Semivolatile Organic Compounds by GC/MS [SW8270C];Standard Method (19th) 3112 B: Metals by Cold-Vapor AAS [A3112B];Volatile Organic Compounds by GC/MS [SW8260B];Volatile Organic Compounds by GC/MS Fuel Additives [8260FA];Volatile Organic Compounds by GC/MS plus Oxygenates [8260+OX];Volatile Organic Compounds by GC/MS SIM [8260SIM];Volatile Organic Compounds by Purge and Trap [E524.2];Volatile Organic Compounds EPA Method 624 [E624];Purgeables by GC/MS [E624.1];Data Unavailable [DU]"]
[null,null,null,"E270.2","Selenium (AA, Furnace) [E270.2]",null,null,null,null,null,null,"MTBE","Methyl Tert-butyl Ether (MTBE)",null,null,null,null,null,null,null,null,"Methylene Blue Active Substances (MBAS)","kg/L,g/L,mg/L,ppth,ug/L,ng/L,pg/L,mg/cm2,g/day,g/year,kg/day,kg/month,kg/year,lb/day,lbs/week,lbs/month,lbs/year,mg/day,mg/kg,ug/kg,ng/g,ulbs/day,ug/day,t/day","Methylene Blue Active Substances (MBAS) [E425.1];Standard Method (19th) 4500-S D: Methylene Blue Method [A4500SD];Standard Method 5540 A: Surfactants (MBAS) [A5540A];Standard Method 5540 C: Determ. of Methylene Blue Active Subst. [A5540C];Data Unavailable [DU]"]
[null,null,null,"SW7741","Selenium (AA, Gaseous Hydride) [SW7741]",null,null,null,null,null,null,"MBAS","Methylene Blue Active Substances (MBAS)",null,null,null,null,null,null,null,null,"Methylene Chloride","kg/L,g/L,mg/L,ppth,ug/L,ng/L,pg/L,mg/cm2,g/day,g/year,kg/day,kg/month,kg/year,lb/day,lbs/week,lbs/month,lbs/year,mg/day,mg/kg,ug/kg,ng/g,ulbs/day,ug/day,t/day","Chloride (as CI) Modified [E325.3M];Chloride (as Cl) [E325.1];Extractable Priority Pollutants [E625];Extractable Priority Pollutants by GC/MS SIM [E625SIM];GC/MS SIM Method [SIM];HISTORICAL: Volatile Organic Compounds by GC/MS [SW8260];Organochlorine Pesticides and PCBs [E608];Organochlorine Pesticides by Gas Chromatography [SW8081A];Semivolatile Organic Compounds by GC/MS [SW8270C];VOCs by GC/MS Fuel Additives Plus BTEX [8260FAB];Volatile Organic Compounds by GC/MS - Open Scan [8260BOS];Volatile Organic Compounds by GC/MS [SW8260B];Volatile Organic Compounds by GC/MS SIM [8260SIM];Volatile Organic Compounds by Purge and Trap [E524.2];Volatile Organic Compounds EPA Method 624 [E624];Purgeables by GC/MS [E624.1];Data Unavailable [DU]"]
[null,null,null,"E270.3","Selenium (AA, Hydride) [E270.3]",null,null,null,null,null,null,"MTLNCL","Methylene Chloride",null,null,null,null,null,null,null,null,"Methylhydrazine","kg/L,g/L,mg/L,ppth,ug/L,ng/L,pg/L,mg/cm2,g/day,g/year,kg/day,kg/month,kg/year,lb/day,lbs/week,lbs/month,lbs/year,mg/day,mg/kg,ug/kg,ng/g,ulbs/day,ug/day,t/day","Data Unavailable [DU]"]
[null,null,null,"SW7742","Selenium (Atomic Absorption, Borohydride Reduction) [SW7742]",null,null,null,null,null,null,"MMH","Methylhydrazine",null,null,null,null,null,null,null,null,"Mevinphos","kg/L,g/L,mg/L,ppth,ug/L,ng/L,pg/L,mg/cm2,g/day,g/year,kg/day,kg/month,kg/year,lb/day,lbs/week,lbs/month,lbs/year,mg/day,mg/kg,ug/kg,ng/g,ulbs/day,ug/day,t/day","Extractable Priority Pollutants [E625];Data Unavailable [DU]"]
[null,null,null,"8270COS","Semivolatile Organic Compounds by GC/MS - Open Scan [8270COS]",null,null,null,null,null,null,"MEVINPHOS","Mevinphos",null,null,null,null,null,null,null,null,"Mexacarbate","kg/L,g/L,mg/L,ppth,ug/L,ng/L,pg/L,mg/cm2,g/day,g/year,kg/day,kg/month,kg/year,lb/day,lbs/week,lbs/month,lbs/year,mg/day,mg/kg,ug/kg,ng/g,ulbs/day,ug/day,t/day","Data Unavailable [DU]"]
[null,null,null,"SW8270C","Semivolatile Organic Compounds by GC/MS [SW8270C]",null,null,null,null,null,null,"MEXACARBATE","Mexacarbate",null,null,null,null,null,null,null,null,"Mirex","kg/L,g/L,mg/L,ppth,ug/L,ng/L,pg/L,mg/cm2,g/day,g/year,kg/day,kg/month,kg/year,lb/day,lbs/week,lbs/month,lbs/year,mg/day,mg/kg,ug/kg,ng/g,ulbs/day,ug/day,t/day","Extractable Priority Pollutants [E625];Extractable Priority Pollutants by GC/MS SIM [E625SIM];Organochlorine Pesticides and PCBs [E608];Organochlorine Pesticides by Gas Chromatography [SW8081A];Organochlorine Pesticides and PCBs by GC/HSD [E608.3];Data Unavailable [DU]"]
[null,null,null,"8270SIM","Semivolatile Organic Compounds by GC/MS SIM [8270SIM]",null,null,null,null,null,null,"MIREX","Mirex",null,null,null,null,null,null,null,null,"Molinate","kg/L,g/L,mg/L,ppth,ug/L,ng/L,pg/L,mg/cm2,g/day,g/year,kg/day,kg/month,kg/year,lb/day,lbs/week,lbs/month,lbs/year,mg/day,mg/kg,ug/kg,ng/g,ulbs/day,ug/day,t/day","Nitrogen- & Phosphorus-Containing Pest. in Water by GC [E507];Organic Compounds in Drinking Water by LSE & CCGC/MS [E525.2];Data Unavailable [DU]"]
[null,null,null,"E1625C","Semivolatile Organic Compounds by Isotope Dilution GCMS [E1625C]",null,null,null,null,null,null,"MOLINATE","Molinate",null,null,null,null,null,null,null,null,"Molybdenum, Dissolved","kg/L,g/L,mg/L,ppth,ug/L,ng/L,pg/L,mg/cm2,g/day,g/year,kg/day,kg/month,kg/year,lb/day,lbs/week,lbs/month,lbs/year,mg/day,mg/kg,ug/kg,ng/g,ulbs/day,ug/day,t/day","Inductively Coupled Plasma Emission [E200.7];Inductively Coupled Plasma/Mass Spectroscopy [E200.8];Inductively Coupled Plasma-Atomic Emission Spectroscopy [SW6010B];Inductively Coupled Plasma-Mass Spectrometry [SW6020];Metals by Atomic Absorption [E200.0];Molybdenum (AA, Direct Aspiration) [E246.1];Molybdenum (AA, Furnace Technique) [E246.2];Standard Method (19th) 3113: Metals by Electrothermal AAS [A3113];Standard Method (19th) 3113: Metals by Furnace AAS [A3113B];Data Unavailable [DU]"]
[null,null,null,"E526","Semivolatile Organic Compounds by SPE & GC/MS [E526]",null,null,null,null,null,"L","MO","Molybdenum, Dissolved",null,null,null,null,null,null,null,null,"Molybdenum, Total","kg/L,g/L,mg/L,ppth,ug/L,ng/L,pg/L,mg/cm2,g/day,g/year,kg/day,kg/month,kg/year,lb/day,lbs/week,lbs/month,lbs/year,mg/day,mg/kg,ug/kg,ng/g,ulbs/day,ug/day,t/day","Inductively Coupled Plasma Emission [E200.7];Inductively Coupled Plasma/Mass Spectroscopy [E200.8];Inductively Coupled Plasma-Atomic Emission Spectroscopy [SW6010B];Inductively Coupled Plasma-Mass Spectrometry [SW6020];Metals by Atomic Absorption [E200.0];Molybdenum (AA, Direct Aspiration) [E246.1];Molybdenum (AA, Furnace Technique) [E246.2];Standard Method (19th) 3113: Metals by Electrothermal AAS [A3113];Standard Method (19th) 3113: Metals by Furnace AAS [A3113B];Data Unavailable [DU]"]
[null,null,null,"E525.1M","Semivolatile Organic Compounds Modified [E525.1M]",null,null,null,null,null,null,"MO","Molybdenum, Total",null,null,null,null,null,null,null,null,"Molybdenum, Total Recoverable","kg/L,g/L,mg/L,ppth,ug/L,ng/L,pg/L,mg/cm2,g/day,g/year,kg/day,kg/month,kg/year,lb/day,lbs/week,lbs/month,lbs/year,mg/day,mg/kg,ug/kg,ng/g,ulbs/day,ug/day,t/day","Inductively Coupled Plasma Emission [E200.7];Inductively Coupled Plasma/Mass Spectroscopy [E200.8];Inductively Coupled Plasma-Atomic Emission Spectroscopy [SW6010B];Inductively Coupled Plasma-Mass Spectrometry [SW6020];Metals by Atomic Absorption [E200.0];Molybdenum (AA, Direct Aspiration) [E246.1];Molybdenum (AA, Furnace Technique) [E246.2];Standard Method (19th) 3113: Metals by Electrothermal AAS [A3113];Standard Method (19th) 3113: Metals by Furnace AAS [A3113B];Data Unavailable [DU]"]
[null,null,null,"SW1020A","Setaflash Closed-Cup Method for Determining Ignitability [SW1020A]",null,null,null,null,null,"N","MO","Molybdenum, Total Recoverable",null,null,null,null,null,null,null,null,"Monobutyltin","kg/L,g/L,mg/L,ppth,ug/L,ng/L,pg/L,mg/cm2,g/day,g/year,kg/day,kg/month,kg/year,lb/day,lbs/week,lbs/month,lbs/year,mg/day,mg/kg,ug/kg,ng/g,ulbs/day,ug/day,t/day","Extractable Priority Pollutants [E625];GC Determ. of Butyltins in Water (Chemosphere, Vol. 15, No. 4) [BTSN];Data Unavailable [DU]"]
[null,null,null,"E160.5","Settleable Matter [E160.5]",null,null,null,null,null,null,"MBT","Monobutyltin",null,null,null,null,null,null,null,null,"Monuron","kg/L,g/L,mg/L,ppth,ug/L,ng/L,pg/L,mg/cm2,g/day,g/year,kg/day,kg/month,kg/year,lb/day,lbs/week,lbs/month,lbs/year,mg/day,mg/kg,ug/kg,ng/g,ulbs/day,ug/day,t/day","Extractable Priority Pollutants [E625];Semivolatile Organic Compounds by Isotope Dilution GCMS [E1625C];Volatile Organic Compounds by Purge and Trap [E524.2];Volatile Organic Compounds EPA Method 624 [E624];Data Unavailable [DU]"]
[null,null,null,"E370.1","Silica [E370.1]",null,null,null,null,null,null,"MONURON","Monuron",null,null,null,null,null,null,null,null,"Motor Oil","kg/L,g/L,mg/L,ppth,ug/L,ng/L,pg/L,mg/cm2,g/day,g/year,kg/day,kg/month,kg/year,lb/day,lbs/week,lbs/month,lbs/year,mg/day,mg/kg,ug/kg,ng/g,ulbs/day,ug/day,t/day","Data Unavailable [DU]"]
[null,null,null,"E272.1","Silver (AA, Direct Aspiration) [E272.1]",null,null,null,null,null,null,"MOIL","Motor Oil",null,null,null,null,null,null,null,null,"Naled","kg/L,g/L,mg/L,ppth,ug/L,ng/L,pg/L,mg/cm2,g/day,g/year,kg/day,kg/month,kg/year,lb/day,lbs/week,lbs/month,lbs/year,mg/day,mg/kg,ug/kg,ng/g,ulbs/day,ug/day,t/day","Data Unavailable [DU]"]
[null,null,null,"SW7760A","Silver (AA, Direct Aspiration) [SW7760A]",null,null,null,null,null,null,"NALED","Naled",null,null,null,null,null,null,null,null,"Naphthalene","kg/L,g/L,mg/L,ppth,ug/L,ng/L,pg/L,mg/cm2,g/day,g/year,kg/day,kg/month,kg/year,lb/day,lbs/week,lbs/month,lbs/year,mg/day,mg/kg,ug/kg,ng/g,ulbs/day,ug/day,t/day","Extractable Priority Pollutants [E625];Extractable Priority Pollutants by GC/MS SIM [E625SIM];GC/MS SIM Method [SIM];HISTORICAL: Semivolatile Organic Compounds by GC/MS [SW8270];HISTORICAL: Semivolatile Organic Compounds by GC/MS [SW8270A];HISTORICAL: Volatile Organic Compounds by GC/MS [SW8260];Polynuclear Aromatic Hydrocarbons [E610];Semivolatile Organic Compounds by GC/MS - Open Scan [8270COS];Semivolatile Organic Compounds by GC/MS [SW8270C];Semivolatile Organic Compounds by GC/MS SIM [8270SIM];Semivolatile Organic Compounds by Isotope Dilution GCMS [E1625C];Volatile Organic Compounds by GC/MS [SW8260B];Volatile Organic Compounds by GC/MS SIM [8260SIM];Volatile Organic Compounds by Purge and Trap [E524.2];Volatile Organic Compounds EPA Method 624 [E624];Base/Neutrals and Acids by GC/MS [E625.1];Data Unavailable [DU]"]
[null,null,null,"SW7761","Silver (AA, Furnace Technique) [SW7761]",null,null,null,null,null,null,"NAPH","Naphthalene",null,null,null,null,null,null,null,null,"Naphthalene-d8","kg/L,g/L,mg/L,ppth,ug/L,ng/L,pg/L,mg/cm2,g/day,g/year,kg/day,kg/month,kg/year,lb/day,lbs/week,lbs/month,lbs/year,mg/day,mg/kg,ug/kg,ng/g,ulbs/day,ug/day,t/day","Extractable Priority Pollutants [E625];Extractable Priority Pollutants by GC/MS SIM [E625SIM];GC/MS SIM Method [SIM];HISTORICAL: Semivolatile Organic Compounds by GC/MS [SW8270];HISTORICAL: Semivolatile Organic Compounds by GC/MS [SW8270A];HISTORICAL: Volatile Organic Compounds by GC/MS [SW8260];Polynuclear Aromatic Hydrocarbons [E610];Semivolatile Organic Compounds by GC/MS - Open Scan [8270COS];Semivolatile Organic Compounds by GC/MS [SW8270C];Semivolatile Organic Compounds by GC/MS SIM [8270SIM];Semivolatile Organic Compounds by Isotope Dilution GCMS [E1625C];Volatile Organic Compounds by GC/MS [SW8260B];Volatile Organic Compounds by GC/MS SIM [8260SIM];Volatile Organic Compounds by Purge and Trap [E524.2];Volatile Organic Compounds EPA Method 624 [E624];Data Unavailable [DU]"]
[null,null,null,"CL272.2","Silver (AA, Furnace) - modified for CLP [CL272.2]",null,null,null,null,null,null,"NAPHD8","Naphthalene-d8",null,null,null,null,null,null,null,null,"n-Butylbenzene","kg/L,g/L,mg/L,ppth,ug/L,ng/L,pg/L,mg/cm2,g/day,g/year,kg/day,kg/month,kg/year,lb/day,lbs/week,lbs/month,lbs/year,mg/day,mg/kg,ug/kg,ng/g,ulbs/day,ug/day,t/day","GC/MS SIM Method [SIM];HISTORICAL: Volatile Organic Compounds by GC/MS [SW8260];Semivolatile Organic Compounds by GC/MS [SW8270C];Volatile Organic Compounds by GC/MS [SW8260B];Data Unavailable [DU]"]
[null,null,null,"E272.2","Silver (AA, Furnace) [E272.2]",null,null,null,null,null,null,"BTBZN","n-Butylbenzene",null,null,null,null,null,null,null,null,"n-Decane","kg/L,g/L,mg/L,ppth,ug/L,ng/L,pg/L,mg/cm2,g/day,g/year,kg/day,kg/month,kg/year,lb/day,lbs/week,lbs/month,lbs/year,mg/day,mg/kg,ug/kg,ng/g,ulbs/day,ug/day,t/day","Base/Neutrals and Acids by GC/MS [E625.1];Data Unavailable [DU]"]
[null,null,null,"CL273.1","Sodium (AA, Direct Aspiration) - modified for CLP [CL273.1]",null,null,null,null,null,null,"C10C10N","n-Decane",null,null,null,null,null,null,null,null,"Neburon","kg/L,g/L,mg/L,ppth,ug/L,ng/L,pg/L,mg/cm2,g/day,g/year,kg/day,kg/month,kg/year,lb/day,lbs/week,lbs/month,lbs/year,mg/day,mg/kg,ug/kg,ng/g,ulbs/day,ug/day,t/day","Inductively Coupled Plasma Emission [E200.7];Inductively Coupled Plasma/Mass Spectroscopy [E200.8];Data Unavailable [DU]"]
[null,null,null,"E273.1","Sodium (AA, Direct Aspiration) [E273.1]",null,null,null,null,null,null,"NEBURON","Neburon",null,null,null,null,null,null,null,null,"N-Ethyl perfluorooctane sulfonamide","kg/L,g/L,mg/L,ppth,ug/L,ng/L,pg/L,mg/cm2,g/day,g/year,kg/day,kg/month,kg/year,lb/day,lbs/week,lbs/month,lbs/year,mg/day,mg/kg,ug/kg,ng/g,ulbs/day,ug/day,t/day","Data Unavailable [DU]"]
[null,null,null,"SW7770","Sodium (AA, Direct Aspiration) [SW7770]",null,null,null,null,null,null,"ETFOSA","N-Ethyl perfluorooctane sulfonamide",null,null,null,null,null,null,null,null,"N-Ethyl perfluorooctane sulfonamidoacetic acid","kg/L,g/L,mg/L,ppth,ug/L,ng/L,pg/L,mg/cm2,g/day,g/year,kg/day,kg/month,kg/year,lb/day,lbs/week,lbs/month,lbs/year,mg/day,mg/kg,ug/kg,ng/g,ulbs/day,ug/day,t/day","Data Unavailable [DU]"]
[null,null,null,"E273.2","Sodium (AA, Furnace Technique) [E273.2]",null,null,null,null,null,null,"NETFOSAA","N-Ethyl perfluorooctane sulfonamidoacetic acid",null,null,null,null,null,null,null,null,"N-Ethyl perfluorooctane sulfonamidoethanol","kg/L,g/L,mg/L,ppth,ug/L,ng/L,pg/L,mg/cm2,g/day,g/year,kg/day,kg/month,kg/year,lb/day,lbs/week,lbs/month,lbs/year,mg/day,mg/kg,ug/kg,ng/g,ulbs/day,ug/day,t/day","Data Unavailable [DU]"]
[null,null,null,"SW9045C","Soil and Waste pH [SW9045C]",null,null,null,null,null,null,"ETFOSE","N-Ethyl perfluorooctane sulfonamidoethanol",null,null,null,null,null,null,null,null,"Nickel Impact Ratio","%","Trace Elements in Ambient Waters by ICP-MS [E1638];Trace Elements in Water by Preconcentration and ICP-MS [E1640];Inductively Coupled Plasma Emission [E200.7];Inductively Coupled Plasma/Mass Spectroscopy [E200.8];Inductively Coupled Plasma-Atomic Emission Spectroscopy [SW6010B];Inductively Coupled Plasma-Mass Spectrometry [SW6020];Metals by Atomic Absorption [E200.0];Nickel (AA, Direct Aspiration) [E249.1];Nickel (AA, Direct Aspiration) [SW7520];Nickel (AA, Furnace) [E249.2];Standard Method (19th) 3111 B: Metals, Direct Air-Acetylene Flame [A3111B];Standard Method (19th) 3113: Metals by Electrothermal AAS [A3113];Standard Method (19th) 3113: Metals by Furnace AAS [A3113B];Trace Elements in Ambient Waters by Stabilized [E1639];Data Unavailable [DU]"]
[null,null,null,"SW8321A","Solvent Extractable Non-Volatile Compounds by HPLC, TS-MS or UV [SW8321A]",null,null,null,null,null,null,"NIIMRATIO","Nickel Impact Ratio",null,null,null,null,null,null,null,null,"Nickel, Dissolved",{"$f":"$AG$8","v":"kg/L,g/L,mg/L,ppth,ug/L,ng/L,pg/L,mg/cm2,g/day,g/year,kg/day,kg/month,kg/year,lb/day,lbs/week,lbs/month,lbs/year,mg/day,mg/kg,ug/kg,ng/g,ulbs/day,ug/day,t/day"},"Trace Elements in Ambient Waters by ICP-MS [E1638];Trace Elements in Water by Preconcentration and ICP-MS [E1640];Inductively Coupled Plasma Emission [E200.7];Inductively Coupled Plasma/Mass Spectroscopy [E200.8];Inductively Coupled Plasma-Atomic Emission Spectroscopy [SW6010B];Inductively Coupled Plasma-Mass Spectrometry [SW6020];Metals by Atomic Absorption [E200.0];Nickel (AA, Direct Aspiration) [E249.1];Nickel (AA, Direct Aspiration) [SW7520];Nickel (AA, Furnace) [E249.2];Standard Method (19th) 3111 B: Metals, Direct Air-Acetylene Flame [A3111B];Standard Method (19th) 3113: Metals by Electrothermal AAS [A3113];Standard Method (19th) 3113: Metals by Furnace AAS [A3113B];Trace Elements in Ambient Waters by Stabilized [E1639];Data Unavailable [DU]"]
[null,null,null,"E120.1","Specific Conductance [E120.1]",null,null,null,null,null,"L","NI","Nickel, Dissolved",null,null,null,null,null,null,null,null,"Nickel, Total","kg/L,g/L,mg/L,ppth,ug/L,ng/L,pg/L,mg/cm2,g/day,g/year,kg/day,kg/month,kg/year,lb/day,lbs/week,lbs/month,lbs/year,mg/day,mg/kg,ug/kg,ng/g,ulbs/day,ug/day,t/day","Trace Elements in Ambient Waters by ICP-MS [E1638];Trace Elements in Water by Preconcentration and ICP-MS [E1640];Inductively Coupled Plasma Emission [E200.7];Inductively Coupled Plasma/Mass Spectroscopy [E200.8];Inductively Coupled Plasma-Atomic Emission Spectroscopy [SW6010B];Inductively Coupled Plasma-Mass Spectrometry [SW6020];Metals by Atomic Absorption [E200.0];Nickel (AA, Direct Aspiration) [E249.1];Nickel (AA, Direct Aspiration) [SW7520];Nickel (AA, Furnace) [E249.2];Standard Method (19th) 3111 B: Metals, Direct Air-Acetylene Flame [A3111B];Standard Method (19th) 3113: Metals by Electrothermal AAS [A3113];Standard Method (19th) 3113: Metals by Furnace AAS [A3113B];Trace Elements in Ambient Waters by Stabilized [E1639];Data Unavailable [DU]"]
[null,null,null,"SW9050A","Specific Conductance [SW9050A]",null,null,null,null,null,null,"NI","Nickel, Total",null,null,null,null,null,null,null,null,"Nickel, Total Recoverable","kg/L,g/L,mg/L,ppth,ug/L,ng/L,pg/L,mg/cm2,g/day,g/year,kg/day,kg/month,kg/year,lb/day,lbs/week,lbs/month,lbs/year,mg/day,mg/kg,ug/kg,ng/g,ulbs/day,ug/day,t/day","Trace Elements in Ambient Waters by ICP-MS [E1638];Trace Elements in Water by Preconcentration and ICP-MS [E1640];Inductively Coupled Plasma Emission [E200.7];Inductively Coupled Plasma/Mass Spectroscopy [E200.8];Inductively Coupled Plasma-Atomic Emission Spectroscopy [SW6010B];Inductively Coupled Plasma-Mass Spectrometry [SW6020];Metals by Atomic Absorption [E200.0];Nickel (AA, Direct Aspiration) [E249.1];Nickel (AA, Direct Aspiration) [SW7520];Nickel (AA, Furnace) [E249.2];Standard Method (19th) 3111 B: Metals, Direct Air-Acetylene Flame [A3111B];Standard Method (19th) 3113: Metals by Electrothermal AAS [A3113];Standard Method (19th) 3113: Metals by Furnace AAS [A3113B];Trace Elements in Ambient Waters by Stabilized [E1639];Data Unavailable [DU]"]
[null,null,null,"E206.4","Spectrophotometric, SDDC [E206.4]",null,null,null,null,null,"N","NI","Nickel, Total Recoverable",null,null,null,null,null,null,null,null,"Nitrate, Total (as N)","kg/L,g/L,mg/L,ppth,ug/L,ng/L,pg/L,mg/cm2,g/day,g/year,kg/day,kg/month,kg/year,lb/day,lbs/week,lbs/month,lbs/year,mg/day,mg/kg,ug/kg,ng/g,ulbs/day,ug/day,t/day","Determination of Inorganic Anions by Ion Chromatography [SW9056];Inorganic Anions by Ion Chromatography [E300.0];Inorganic Anions by Ion Chromatography [E300.1];Nitrogen, Nitrate  (as N) [E352.1];Nitrogen, Nitrate-Nitrite [E353.1];Nitrogen, Nitrate-Nitrite [E353.2];Nitrogen, Nitrate-Nitrate Modified [E353.2M];Nitrogen, Nitrate-Nitrite [E353.3];Standard Method (18th) 4500-NO3 F: Auto Cd Reduction [A4500F];Standard Method (19th) 4500-NH: Nitrogen (Ammonia) [A4500NH];Standard Method (20th) 4500-NO3 E: Cadmium Reduction Method [A4500NE];HACH Nitrate, Method 10206 [H10206];Data Unavailable [DU]"]
[null,null,null,"A2320B","Standard Method (18th & 19th) 2320 B: Alkalinity by Titration [A2320B]",null,null,null,null,null,null,"NO3N","Nitrate, Total (as N)",null,null,null,null,null,null,null,null,"Nitrate, Total (as NO3)","kg/L,g/L,mg/L,ppth,ug/L,ng/L,pg/L,mg/cm2,g/day,g/year,kg/day,kg/month,kg/year,lb/day,lbs/week,lbs/month,lbs/year,mg/day,mg/kg,ug/kg,ng/g,ulbs/day,ug/day,t/day","Determination of Inorganic Anions by Ion Chromatography [SW9056];Inductively Coupled Plasma Emission [E200.7];Inorganic Anions by Ion Chromatography [E300.0];Inorganic Anions by Ion Chromatography, Part A [E300A];Inorganic Anions by Ion Chromatography, Part B [E300B];Nitrogen, Nitrate (as N) [E352.1];Nitrogen, Nitrate-Nitrate Modified [E353.2M];Nitrogen, Nitrate-Nitrite [E353.2];Standard Method (18th) 4500-NO3 F: Auto Cd Reduction [A4500F];HACH Nitrate, Method 10206 [H10206];Data Unavailable [DU]"]
[null,null,null,"A5210B","Standard Method (18th & 19th) 5210 B: 5-Day BOD Test [A5210B]",null,null,null,null,null,null,"NO3","Nitrate, Total (as NO3)",null,null,null,null,null,null,null,null,"Nitrite Plus Nitrate (as N)","kg/L,g/L,mg/L,ppth,ug/L,ng/L,pg/L,mg/cm2,g/day,g/year,kg/day,kg/month,kg/year,lb/day,lbs/week,lbs/month,lbs/year,mg/day,mg/kg,ug/kg,ng/g,ulbs/day,ug/day,t/day","Inorganic Anions by Ion Chromatography [E300.0];Nitrogen, Nitrate-Nitrite [E353.1];Nitrogen, Nitrate-Nitrite [E353.2];Nitrogen, Nitrate-Nitrite [E353.3];Nitrogen, Nitrite [E354.1];Standard Method (18th) 4500-NO3 F: Auto Cd Reduction [A4500F];Standard Method (19th) 4500-N(org) B: Macro-Kjeldahl Method [A4500NB];Standard Method (20th) 4500-NO3 E: Cadmium Reduction Method [A4500NE];HACH Nitrate, Method 10206 [H10206];Data Unavailable [DU]"]
[null,null,null,"A4500F","Standard Method (18th) 4500-NO3 F: Auto Cd Reduction [A4500F]",null,null,null,null,null,null,"NO3NO2N","Nitrite Plus Nitrate (as N)",null,null,null,null,null,null,null,null,"Nitrite, Total (as N)","kg/L,g/L,mg/L,ppth,ug/L,ng/L,pg/L,mg/cm2,g/day,g/year,kg/day,kg/month,kg/year,lb/day,lbs/week,lbs/month,lbs/year,mg/day,mg/kg,ug/kg,ng/g,ulbs/day,ug/day,t/day","Determination of Inorganic Anions by Ion Chromatography [SW9056];Inorganic Anions by Ion Chromatography [E300.0];Inorganic Anions by Ion Chromatography [E300.1];Nitrogen, Ammonia (as N) [E350.1];Nitrogen, Nitrate (as N) [E352.1];Nitrogen, Nitrate-Nitrate Modified [E353.2M];Nitrogen, Nitrate-Nitrite [E353.1];Nitrogen, Nitrate-Nitrite [E353.2];Nitrogen, Nitrate-Nitrite [E353.3];Nitrogen, Nitrite [E354.1];Standard Method (18th) 4500-NO3 F: Auto Cd Reduction [A4500F];Standard Method (19th) 4500-N(org) B: Macro-Kjeldahl Method [A4500NB];Standard Method (19th) 4500-NH: Nitrogen (Ammonia) [A4500NH];Standard Method (20th) 4500-NO2 B: N (Nitrite) Colorimetric [4500NB];HACH Nitrate, Method 10206 [H10206];Data Unavailable [DU]"]
[null,null,null,"A4500SE","Standard Method (18th) 4500-S E: Sulfide by Gas Dialysis [A4500SE]",null,null,null,null,null,null,"NO2N","Nitrite, Total (as N)",null,null,null,null,null,null,null,null,"Nitrite, Total (as NO2)","kg/L,g/L,mg/L,ppth,ug/L,ng/L,pg/L,mg/cm2,g/day,g/year,kg/day,kg/month,kg/year,lb/day,lbs/week,lbs/month,lbs/year,mg/day,mg/kg,ug/kg,ng/g,ulbs/day,ug/day,t/day","Inorganic Anions by Ion Chromatography [E300.0];Inorganic Anions by Ion Chromatography, Part B [E300B];Nitrogen, Nitrate-Nitrite [E353.2];Nitrogen, Nitrate-Nitrite [E353.3];Nitrogen, Nitrite [E354.1];Standard Method (20th) 4500-NO2 B: N (Nitrite) Colorimetric [4500NB];HACH Nitrate, Method 10206 [H10206];Data Unavailable [DU]"]
[null,null,null,"A5210","Standard Method (18th) 5210: Biochemical Oxygen Demand [A5210]",null,null,null,null,null,null,"NO2","Nitrite, Total (as NO2)",null,null,null,null,null,null,null,null,"Nitrobenzene","kg/L,g/L,mg/L,ppth,ug/L,ng/L,pg/L,mg/cm2,g/day,g/year,kg/day,kg/month,kg/year,lb/day,lbs/week,lbs/month,lbs/year,mg/day,mg/kg,ug/kg,ng/g,ulbs/day,ug/day,t/day","Extractable Priority Pollutants [E625];Extractable Priority Pollutants by GC/MS SIM [E625SIM];GC/MS SIM Method [SIM];HISTORICAL: Semivolatile Organic Compounds by GC/MS [SW8270];HISTORICAL: Semivolatile Organic Compounds by GC/MS [SW8270A];Nitrogen, Ammonia (as N) [E350.1];Organochlorine Pesticides and PCBs [E608];Semivolatile Organic Compounds by GC/MS - Open Scan [8270COS];Semivolatile Organic Compounds by GC/MS [SW8270C];Semivolatile Organic Compounds by Isotope Dilution GCMS [E1625C];Semivolatile Organic Compounds by SPE & GC/MS [E526];Volatile Organic Compounds by GC/MS [SW8260B];Volatile Organic Compounds by GC/MS SIM [8260SIM];Volatile Organic Compounds EPA Method 624 [E624];Base/Neutrals and Acids by GC/MS [E625.1];Data Unavailable [DU]"]
[null,null,null,"A9260D","Standard Method (18th) 9260 D: Quantitative Salmonella Proc. [A9260D]",null,null,null,null,null,null,"NO2BZ","Nitrobenzene",null,null,null,null,null,null,null,null,"Nitrobenzene-d5","kg/L,g/L,mg/L,ppth,ug/L,ng/L,pg/L,mg/cm2,g/day,g/year,kg/day,kg/month,kg/year,lb/day,lbs/week,lbs/month,lbs/year,mg/day,mg/kg,ug/kg,ng/g,ulbs/day,ug/day,t/day","Semivolatile Organic Compounds by GC/MS [SW8270C];Base/Neutrals and Acids by GC/MS [E625.1];Data Unavailable [DU]"]
[null,null,null,"A10200H","Standard Method (19th) 10200 H: Chlorophyll [A10200H]",null,null,null,null,null,null,"NO2BZD5","Nitrobenzene-d5",null,null,null,null,null,null,null,null,"Nitrogen, Total (as N)","kg/L,g/L,mg/L,ppth,ug/L,ng/L,pg/L,mg/cm2,g/day,g/year,kg/day,kg/month,kg/year,lb/day,lbs/week,lbs/month,lbs/year,mg/day,mg/kg,ug/kg,ng/g,ulbs/day,ug/day,t/day","Calculation for Total Nitrogen: TKN + NO2 + NO3 [CALCN];Inorganic Anions by Ion Chromatography [E300.0];Nitrogen- & Phosphorus-Containing Pest. in Water by GC [E507];Nitrogen, Ammonia (as N) [E350.1];Nitrogen, Kjeldahl, Total [E351.1];Nitrogen, Kjeldahl, Total [E351.2];Nitrogen, Kjeldahl, Total [E351.4];Nitrogen, Kjeldahl, Total Modified [E351.4M];Nitrogen, Nitrate (as N) [E352.1];Nitrogen, Nitrate-Nitrate Modified [E353.2M];Nitrogen, Nitrate-Nitrite [E353.2];Nitrogen, Nitrite [E354.1];Standard Method (19th) 4500-N(org) A: Calc. for Org. N (TKN-NH3) [A4500NA];Standard Method (19th) 4500-N(org) B: Macro-Kjeldahl Method [A4500NB];Standard Method (19th) 4500-NH: Nitrogen (Ammonia) [A4500NH];Data Unavailable [DU]"]
[null,null,null,"A210B","Standard Method (19th) 210B: Salinity by Hydrometric Method [A210B]",null,null,null,null,null,null,"TOTN","Nitrogen, Total (as N)",null,null,null,null,null,null,null,null,"Nitrogen, Total Dissolved (as N)","kg/L,g/L,mg/L,ppth,ug/L,ng/L,pg/L,mg/cm2,g/day,g/year,kg/day,kg/month,kg/year,lb/day,lbs/week,lbs/month,lbs/year,mg/day,mg/kg,ug/kg,ng/g,ulbs/day,ug/day,t/day","Data Unavailable [DU]"]
[null,null,null,"A2120B","Standard Method (19th) 2120 B: Color by Visual Comparison [A2120B]",null,null,null,null,null,"L","N","Nitrogen, Total Dissolved (as N)",null,null,null,null,null,null,null,null,"Nitrogen, Total Inorganic (as N)","kg/L,g/L,mg/L,ppth,ug/L,ng/L,pg/L,mg/cm2,g/day,g/year,kg/day,kg/month,kg/year,lb/day,lbs/week,lbs/month,lbs/year,mg/day,mg/kg,ug/kg,ng/g,ulbs/day,ug/day,t/day","Calculation for Inorganic Nitrogen: NO2 + NO3 + NH3 [CALCNIO];Inorganic Anions by Ion Chromatography [E300.0];Nitrogen, Ammonia (as N) [E350.1];Standard Method (19th) 4500-NH: Nitrogen (Ammonia) [A4500NH];Data Unavailable [DU]"]
[null,null,null,"A2130B","Standard Method (19th) 2130 B: Turbidity by Nephelometric Method [A2130B]",null,null,null,null,null,null,"IN","Nitrogen, Total Inorganic (as N)",null,null,null,null,null,null,null,null,"Nitrogen, Total Organic (as N)","kg/L,g/L,mg/L,ppth,ug/L,ng/L,pg/L,mg/cm2,g/day,g/year,kg/day,kg/month,kg/year,lb/day,lbs/week,lbs/month,lbs/year,mg/day,mg/kg,ug/kg,ng/g,ulbs/day,ug/day,t/day","Calculation for Total Nitrogen: TKN + NO2 + NO3 [CALCN];Extractable Priority Pollutants [E625];Nitrogen, Kjeldahl, Total [E351.2];Nitrogen, Kjeldahl, Total [E351.3];Semivolatile Organic Compounds by GC/MS [SW8270C];Semivolatile Organic Compounds by Isotope Dilution GCMS [E1625C];Standard Method (19th) 4500-N(org) A: Calc. for Org. N (TKN-NH3) [A4500NA];Standard Method (19th) 4500-N(org) B: Macro-Kjeldahl Method [A4500NB];Standard Method (19th) 4500-NH: Nitrogen (Ammonia) [A4500NH];Standard Method (19th) 4500-N(org) C: Semi-Micro-Kjeldahl [A4500NC];Standard Method (20th) 4500-NO2 B: N (Nitrite) Colorimetric [4500NB];Standard Method (20th) 4500-NH3 G: N (Ammonia) Auto Phenate [A4500NG];Data Unavailable [DU]"]
[null,null,null,"A2150B","Standard Method (19th) 2150 B: Threshold Odor Test [A2150B]",null,null,null,null,null,null,"ON","Nitrogen, Total Organic (as N)",null,null,null,null,null,null,null,null,"Nitroglycerin","ug/L","Nitroaromatics, Nitramines, and Nitrate Esters by HPLC [SW8330B];Data Unavailable [DU]"]
[null,null,null,"A2330B","Standard Method (19th) 2330 B: Langelier Index [A2330B]",null,null,null,null,null,null,"NTG","Nitroglycerin",null,null,null,null,null,null,null,null,"N-Methyl perfluorooctane sulfonamide",{"$f":"$AG$8","v":"kg/L,g/L,mg/L,ppth,ug/L,ng/L,pg/L,mg/cm2,g/day,g/year,kg/day,kg/month,kg/year,lb/day,lbs/week,lbs/month,lbs/year,mg/day,mg/kg,ug/kg,ng/g,ulbs/day,ug/day,t/day"},"Data Unavailable [DU]"]
[null,null,null,"A2510B","Standard Method (19th) 2510 B: Specific Conductance [A2510B]",null,null,null,null,null,null,"MEFOSA","N-Methyl perfluorooctane sulfonamide",null,null,null,null,null,null,null,null,"N-Methyl perfluorooctane sulfonamidoacetic acid","kg/L,g/L,mg/L,ppth,ug/L,ng/L,pg/L,mg/cm2,g/day,g/year,kg/day,kg/month,kg/year,lb/day,lbs/week,lbs/month,lbs/year,mg/day,mg/kg,ug/kg,ng/g,ulbs/day,ug/day,t/day","Data Unavailable [DU]"]
[null,null,null,"A2540B","Standard Method (19th) 2540 B: Total Solids Dried at 103-105C [A2540B]",null,null,null,null,null,null,"NMEFOSAA","N-Methyl perfluorooctane sulfonamidoacetic acid",null,null,null,null,null,null,null,null,"N-Methyl perfluorooctane sulfonamidoethanol","kg/L,g/L,mg/L,ppth,ug/L,ng/L,pg/L,mg/cm2,g/day,g/year,kg/day,kg/month,kg/year,lb/day,lbs/week,lbs/month,lbs/year,mg/day,mg/kg,ug/kg,ng/g,ulbs/day,ug/day,t/day","Data Unavailable [DU]"]
[null,null,null,"A2540C","Standard Method (19th) 2540 C: Total Diss. Solids at 180 deg. [A2540C]",null,null,null,null,null,null,"MEFOSE","N-Methyl perfluorooctane sulfonamidoethanol",null,null,null,null,null,null,null,null,"n-Nitrosodiethylamine","kg/L,g/L,mg/L,ppth,ug/L,ng/L,pg/L,mg/cm2,g/day,g/year,kg/day,kg/month,kg/year,lb/day,lbs/week,lbs/month,lbs/year,mg/day,mg/kg,ug/kg,ng/g,ulbs/day,ug/day,t/day","Data Unavailable [DU]"]
[null,null,null,"A2540D","Standard Method (19th) 2540 D: Tot. Sus. Solids Dried 103-105C [A2540D]",null,null,null,null,null,null,"NNSE ","n-Nitrosodiethylamine",null,null,null,null,null,null,null,null,"N-Nitrosodimethylamine","kg/L,g/L,mg/L,ppth,ug/L,ng/L,pg/L,mg/cm2,g/day,g/year,kg/day,kg/month,kg/year,lb/day,lbs/week,lbs/month,lbs/year,mg/day,mg/kg,ug/kg,ng/g,ulbs/day,ug/day,t/day","Extractable Priority Pollutants [E625];Extractable Priority Pollutants by GC/MS SIM [E625SIM];GC/MS SIM Method [SIM];HISTORICAL: Semivolatile Organic Compounds by GC/MS [SW8270];HISTORICAL: Semivolatile Organic Compounds by GC/MS [SW8270A];Organochlorine Pesticides and PCBs [E608];Organochlorine Pesticides by Gas Chromatography [SW8081A];Semivolatile Organic Compounds by GC/MS - Open Scan [8270COS];Semivolatile Organic Compounds by GC/MS [SW8270C];Semivolatile Organic Compounds by Isotope Dilution GCMS [E1625C];Semivolatile Organic Compounds by SPE & GC/MS [E526];Volatile Organic Compounds by GC/MS [SW8260B];Volatile Organic Compounds by GC/MS SIM [8260SIM];Volatile Organic Compounds EPA Method 624 [E624];Base/Neutrals and Acids by GC/MS [E625.1];Data Unavailable [DU]"]
[null,null,null,"A2540E","Standard Method (19th) 2540 E: Fixd/Volatile Solids Ignited [A2540E]",null,null,null,null,null,null,"NNSM","N-Nitrosodimethylamine",null,null,null,null,null,null,null,null,"N-Nitrosodi-n-Propylamine","kg/L,g/L,mg/L,ppth,ug/L,ng/L,pg/L,mg/cm2,g/day,g/year,kg/day,kg/month,kg/year,lb/day,lbs/week,lbs/month,lbs/year,mg/day,mg/kg,ug/kg,ng/g,ulbs/day,ug/day,t/day","Extractable Priority Pollutants [E625];Extractable Priority Pollutants by GC/MS SIM [E625SIM];GC/MS SIM Method [SIM];HISTORICAL: Semivolatile Organic Compounds by GC/MS [SW8270];HISTORICAL: Semivolatile Organic Compounds by GC/MS [SW8270A];Organochlorine Pesticides and PCBs [E608];Organochlorine Pesticides by Gas Chromatography [SW8081A];Semivolatile Organic Compounds by GC/MS - Open Scan [8270COS];Semivolatile Organic Compounds by GC/MS [SW8270C];Semivolatile Organic Compounds by Isotope Dilution GCMS [E1625C];Volatile Organic Compounds by GC/MS [SW8260B];Volatile Organic Compounds by GC/MS SIM [8260SIM];Base/Neutrals and Acids by GC/MS [E625.1];Data Unavailable [DU]"]
[null,null,null,"A2540F","Standard Method (19th) 2540 F: Settleable Solids [A2540F]",null,null,null,null,null,null,"NNSPR","N-Nitrosodi-n-Propylamine",null,null,null,null,null,null,null,null,"N-Nitrosodiphenylamine","kg/L,g/L,mg/L,ppth,ug/L,ng/L,pg/L,mg/cm2,g/day,g/year,kg/day,kg/month,kg/year,lb/day,lbs/week,lbs/month,lbs/year,mg/day,mg/kg,ug/kg,ng/g,ulbs/day,ug/day,t/day","Extractable Priority Pollutants [E625];Extractable Priority Pollutants by GC/MS SIM [E625SIM];GC/MS SIM Method [SIM];HISTORICAL: Semivolatile Organic Compounds by GC/MS [SW8270];HISTORICAL: Semivolatile Organic Compounds by GC/MS [SW8270A];Organochlorine Pesticides and PCBs [E608];Organochlorine Pesticides by Gas Chromatography [SW8081A];Semivolatile Organic Compounds by GC/MS - Open Scan [8270COS];Semivolatile Organic Compounds by GC/MS [SW8270C];Semivolatile Organic Compounds by Isotope Dilution GCMS [E1625C];Semivolatile Organic Compounds by SPE & GC/MS [E526];Volatile Organic Compounds by GC/MS [SW8260B];Volatile Organic Compounds by GC/MS SIM [8260SIM];Base/Neutrals and Acids by GC/MS [E625.1];Data Unavailable [DU]"]
[null,null,null,"A2540G","Standard Method (19th) 2540 G: Total, Fixed and Vol. Solids [A2540G]",null,null,null,null,null,null,"NNSPH","N-Nitrosodiphenylamine",null,null,null,null,null,null,null,null,"n-Nitrosomethylethylamine","kg/L,g/L,mg/L,ppth,ug/L,ng/L,pg/L,mg/cm2,g/day,g/year,kg/day,kg/month,kg/year,lb/day,lbs/week,lbs/month,lbs/year,mg/day,mg/kg,ug/kg,ng/g,ulbs/day,ug/day,t/day","Extractable Priority Pollutants [E625];Extractable Priority Pollutants by GC/MS SIM [E625SIM];GC/MS SIM Method [SIM];HISTORICAL: Semivolatile Organic Compounds by GC/MS [SW8270];HISTORICAL: Semivolatile Organic Compounds by GC/MS [SW8270A];Nitrosamines in Drinking Water by Solid Phase Extraction by GCMS [E521];Semivolatile Organic Compounds by GC/MS - Open Scan [8270COS];Semivolatile Organic Compounds by GC/MS [SW8270C];Semivolatile Organic Compounds by Isotope Dilution GCMS [E1625C];Semivolatile Organic Compounds by SPE & GC/MS [E526];Base/Neutrals and Acids by GC/MS [E625.1];Data Unavailable [DU]"]
[null,null,null,"A2550B","Standard Method (19th) 2550 B: Temperature, Lab and Field Methods [A2550B]",null,null,null,null,null,null,"NNSME","n-Nitrosomethylethylamine",null,null,null,null,null,null,null,null,"n-Octadecane","kg/L,g/L,mg/L,ppth,ug/L,ng/L,pg/L,mg/cm2,g/day,g/year,kg/day,kg/month,kg/year,lb/day,lbs/week,lbs/month,lbs/year,mg/day,mg/kg,ug/kg,ng/g,ulbs/day,ug/day,t/day","Base/Neutrals and Acids by GC/MS [E625.1];Data Unavailable [DU]"]
[null,null,null,"A2580B","Standard Method (19th) 2580 B: Oxidation-Reduction Potential [A2580B]",null,null,null,null,null,null,"593-45-3","n-Octadecane",null,null,null,null,null,null,null,null,"Nonafluoro-3,6-dioxaheptanoic acid (NFDHA)","kg/L,g/L,mg/L,ppth,ug/L,ng/L,pg/L,mg/cm2,g/day,g/year,kg/day,kg/month,kg/year,lb/day,lbs/week,lbs/month,lbs/year,mg/day,mg/kg,ug/kg,ng/g,ulbs/day,ug/day,t/day","Data Unavailable [DU]"]
[null,null,null,"A3111B","Standard Method (19th) 3111 B: Metals, Direct Air-Acetylene Flame [A3111B]",null,null,null,null,null,null,"NFDHA","Nonafluoro-3,6-dioxaheptanoic acid (NFDHA)",null,null,null,null,null,null,null,null,"n-Propylbenzene","kg/L,g/L,mg/L,ppth,ug/L,ng/L,pg/L,mg/cm2,g/day,g/year,kg/day,kg/month,kg/year,lb/day,lbs/week,lbs/month,lbs/year,mg/day,mg/kg,ug/kg,ng/g,ulbs/day,ug/day,t/day","HISTORICAL: Volatile Organic Compounds by GC/MS [SW8260];Semivolatile Organic Compounds by GC/MS [SW8270C];Volatile Organic Compounds by GC/MS [SW8260B];Data Unavailable [DU]"]
[null,null,null,"A3112B","Standard Method (19th) 3112 B: Metals by Cold-Vapor AAS [A3112B]",null,null,null,null,null,null,"PBZN","n-Propylbenzene",null,null,null,null,null,null,null,null,"Octahydro-1,3,5,7-tetranitro-1,3,5,7-tetrazocine (HMX)","ug/L","Nitroaromatics, Nitramines, and Nitrate Esters by HPLC [SW8330B];Data Unavailable [DU]"]
[null,null,null,"A3113","Standard Method (19th) 3113: Metals by Electrothermal AAS [A3113]",null,null,null,null,null,null,"HMX","Octahydro-1,3,5,7-tetranitro-1,3,5,7-tetrazocine (HMX)",null,null,null,null,null,null,null,null,"Odor","T.O.N.","Data Unavailable [DU]"]
[null,null,null,"A3113B","Standard Method (19th) 3113: Metals by Furnace AAS [A3113B]",null,null,null,null,null,null,"ODOR","Odor",null,null,null,null,null,null,null,null,"Oil and Grease",{"$f":"$AG$8","v":"kg/L,g/L,mg/L,ppth,ug/L,ng/L,pg/L,mg/cm2,g/day,g/year,kg/day,kg/month,kg/year,lb/day,lbs/week,lbs/month,lbs/year,mg/day,mg/kg,ug/kg,ng/g,ulbs/day,ug/day,t/day"},"Halogenated Volatile Organics by Headspace [3810HVO];HEM and SGT-HEM by Extraction and Gravimetry, Rev. A [E1664A];HEM and SGT-HEM by Extraction and Gravimetry, Rev. B [E1664B];HISTORICAL: HEM and SGT-HEM by Extraction and Gravimetry [E1664];Modified SW8015 for Gasoline or Diesel Determination [M8015];Oil and Grease, Total Recoverable (Spectrophotometric IR) [E413.2];Oil and Grease, Total Recoverable [E413.1];Petroleum Hydrocarbons, Total Recoverable [E418.1];Standard Method (19th) 5520 F: Oil & Grease Hydrocarbons [A5520F];Standard Method 5520 B: Oil & Grease Partition-Gravimetric Method [A5520B];Standard Method 5520 C: Oil & Grease Partition-Infrared Method [A5520C];Standard Method 5520 D: Oil & Grease Soxhlet Extraction Method [A5520D];Data Unavailable [DU]"]
[null,null,null,"A3500FD","Standard Method (19th) 3500 Fe D: Phenanthroline Meth for Fe2 [A3500FD]",null,null,null,null,null,null,"OILGREASE","Oil and Grease",null,null,null,null,null,null,null,null,"Orthophosphate, Dissolved (as P)",{"$f":"$AG$8","v":"kg/L,g/L,mg/L,ppth,ug/L,ng/L,pg/L,mg/cm2,g/day,g/year,kg/day,kg/month,kg/year,lb/day,lbs/week,lbs/month,lbs/year,mg/day,mg/kg,ug/kg,ng/g,ulbs/day,ug/day,t/day"},"Inorganic Anions by Ion Chromatography [E300.0];Phosphorus, All Forms (as P) [E365.2];Phosphorus, All Forms (Colorimetric, Ascorbic Acid ) [E365.3];Phosphorus, All Forms, (Colorimetric, Automated, Ascorbic Acid ) [E365.1];Phosphorus, Reactive Soluble [E365.3M];Phosphorus, Total (Colorimetric, Automated Block Digestor, AA II) [E365.4];Standard Method (20th) 4500-P E: Phosphorus Ascorbic Acid Method [A4500PE];Data Unavailable [DU]"]
[null,null,null,"A3500CD","Standard Method (19th) 3500-Cr D: Chromium by Colorimetric Method [A3500CD]",null,null,null,null,null,"L","PORTHO","Orthophosphate, Dissolved (as P)",null,null,null,null,null,null,null,null,"Orthophosphate, Total (as P)",{"$f":"$AG$8","v":"kg/L,g/L,mg/L,ppth,ug/L,ng/L,pg/L,mg/cm2,g/day,g/year,kg/day,kg/month,kg/year,lb/day,lbs/week,lbs/month,lbs/year,mg/day,mg/kg,ug/kg,ng/g,ulbs/day,ug/day,t/day"},"Inorganic Anions by Ion Chromatography [E300.0];Phosphorus, All Forms (as P) [E365.2];Phosphorus, All Forms (Colorimetric, Ascorbic Acid ) [E365.3];Phosphorus, All Forms, (Colorimetric, Automated, Ascorbic Acid ) [E365.1];Phosphorus, Reactive Soluble [E365.3M];Phosphorus, Total (Colorimetric, Automated Block Digestor, AA II) [E365.4];Standard Method (20th) 4500-P E: Phosphorus Ascorbic Acid Method [A4500PE];Data Unavailable [DU]"]
[null,null,null,"A3500FE","Standard Method (19th) 3500-Fe D: Penanthroline Method [A3500FE]",null,null,null,null,null,null,"PORTHO","Orthophosphate, Total (as P)",null,null,null,null,null,null,null,null,"Oxamyl",{"$f":"$AG$8","v":"kg/L,g/L,mg/L,ppth,ug/L,ng/L,pg/L,mg/cm2,g/day,g/year,kg/day,kg/month,kg/year,lb/day,lbs/week,lbs/month,lbs/year,mg/day,mg/kg,ug/kg,ng/g,ulbs/day,ug/day,t/day"},"Nitrogen- & Phosphorus-Containing Pest. in Water by GC [E507];N-Methylcarbamoyloximes & N-Methylcarbamates in Water by HPLC [E531.1];Pesticides, Carbamate and Urea [E632];Data Unavailable [DU]"]
[null,null,null,"A4500ND","Standard Method (19th) 4500 ND: Persulfate Method (Proposed) [A4500ND]",null,null,null,null,null,null,"OXAMYL","Oxamyl",null,null,null,null,null,null,null,null,"Oxidation-Reduction Potential","millivolts","Standard Method (19th) 2580 B: Oxidation-Reduction Potential [A2580B];Data Unavailable [DU]"]
[null,null,null,"A4500BB","Standard Method (19th) 4500-B B: Boron by Curcumin Method [A4500BB]",null,null,null,null,null,null,"REDOX","Oxidation-Reduction Potential",null,null,null,null,null,null,null,null,"Oxychlordane",{"$f":"$AG$8","v":"kg/L,g/L,mg/L,ppth,ug/L,ng/L,pg/L,mg/cm2,g/day,g/year,kg/day,kg/month,kg/year,lb/day,lbs/week,lbs/month,lbs/year,mg/day,mg/kg,ug/kg,ng/g,ulbs/day,ug/day,t/day"},"Extractable Priority Pollutants [E625];Organochlorine Pesticides and PCBs [E608];Semivolatile Organic Compounds by Isotope Dilution GCMS [E1625C];Volatile Organic Compounds by GC/MS [SW8260B];Organochlorine Pesticides and PCBs by GC/HSD [E608.3];Data Unavailable [DU]"]
[null,null,null,"A4500C","Standard Method (19th) 4500-Cl C: Mercuric Nitrate Method [A4500C]",null,null,null,null,null,null,"OCD","Oxychlordane",null,null,null,null,null,null,null,null,"o-Xylene",{"$f":"$AG$8","v":"kg/L,g/L,mg/L,ppth,ug/L,ng/L,pg/L,mg/cm2,g/day,g/year,kg/day,kg/month,kg/year,lb/day,lbs/week,lbs/month,lbs/year,mg/day,mg/kg,ug/kg,ng/g,ulbs/day,ug/day,t/day"},"Extractable Priority Pollutants [E625];GC/MS SIM Method [SIM];HISTORICAL: Volatile Organic Compounds by GC/MS [SW8260];Volatile Organic Compounds by GC/MS [SW8260B];Volatile Organic Compounds EPA Method 624 [E624];Purgeables by GC/MS [E624.1];Data Unavailable [DU]"]
[null,null,null,"A4500LD","Standard Method (19th) 4500-Cl D: Amperometric Titration [A4500LD]",null,null,null,null,null,null,"XYLO","o-Xylene",null,null,null,null,null,null,null,null,"Ozone Residual",{"$f":"$AG$8","v":"kg/L,g/L,mg/L,ppth,ug/L,ng/L,pg/L,mg/cm2,g/day,g/year,kg/day,kg/month,kg/year,lb/day,lbs/week,lbs/month,lbs/year,mg/day,mg/kg,ug/kg,ng/g,ulbs/day,ug/day,t/day"},"Data Unavailable [DU]"]
[null,null,null,"A4500LE","Standard Method (19th) 4500-Cl E: Low-Level Amperiometric Titration [A4500LE]",null,null,null,null,null,null,"O3RES","Ozone Residual",null,null,null,null,null,null,null,null,"Paraquat                 ",{"$f":"$AG$8","v":"kg/L,g/L,mg/L,ppth,ug/L,ng/L,pg/L,mg/cm2,g/day,g/year,kg/day,kg/month,kg/year,lb/day,lbs/week,lbs/month,lbs/year,mg/day,mg/kg,ug/kg,ng/g,ulbs/day,ug/day,t/day"},"Diquat and Paraquat by LSE and HPLC [E549.2];Data Unavailable [DU]"]
[null,null,null,"A4500CL","Standard Method (19th) 4500-Cl G: Chlorine: DPD Colorimetric [A4500CL]",null,null,null,null,null,null,"PARAQUAT","Paraquat                 ",null,null,null,null,null,null,null,null,"Parathion",{"$f":"$AG$8","v":"kg/L,g/L,mg/L,ppth,ug/L,ng/L,pg/L,mg/cm2,g/day,g/year,kg/day,kg/month,kg/year,lb/day,lbs/week,lbs/month,lbs/year,mg/day,mg/kg,ug/kg,ng/g,ulbs/day,ug/day,t/day"},"Determination of Organophosphorus Pesticides [E614];Extractable Priority Pollutants [E625];Extractable Priority Pollutants by GC/MS SIM [E625SIM];HISTORICAL: Organophosphorus Compounds by GC [SW8141];Organochlorine Pesticides and PCBs [E608];Organophosphorus Compounds by Gas Chromatography [SW8141A];Data Unavailable [DU]"]
[null,null,null,"A4500B","Standard Method (19th) 4500-Cl: Chloride (Argentometric Method) [A4500B]",null,null,null,null,null,null,"PARAE","Parathion",null,null,null,null,null,null,null,null,"Pasteurization Contact Time","seconds","Data Unavailable [DU]"]
[null,null,null,"A4500I","Standard Method (19th) 4500-ClO2 B: ClO2: Iodometric [A4500I]",null,null,null,null,null,null,"PCT","Pasteurization Contact Time",null,null,null,null,null,null,null,null,"PCB 001","pg/L,ug/L","Chlorinated Biphenyl Congeners in Multiple Matrices by HRGC/HRMS (2010) [E1668C];Chlorinated Biphenyl Congeners in Multiple Matrices by HRGC/HRMS [E1668A];Organochlorine Pesticides and PCBs [E608];Organochlorine Pesticides by Gas Chromatography [SW8081A];Polychlorinated Biphenyls (PCBs) by Gas Chromatography [SW8082];Data Unavailable [DU]"]
[null,null,null,"A4500CC","Standard Method (19th) 4500-CN C: CN, Total after Distillation [A4500CC]",null,null,null,null,null,null,"CBPH2       ","PCB 001",null,null,null,null,null,null,null,null,"PCB 002","pg/L,ug/L","Chlorinated Biphenyl Congeners in Multiple Matrices by HRGC/HRMS (2010) [E1668C];Chlorinated Biphenyl Congeners in Multiple Matrices by HRGC/HRMS [E1668A];Organochlorine Pesticides and PCBs [E608];Organochlorine Pesticides by Gas Chromatography [SW8081A];Polychlorinated Biphenyls (PCBs) by Gas Chromatography [SW8082];Data Unavailable [DU]"]
[null,null,null,"A4500E","Standard Method (19th) 4500-CN E: Colorimetric Method [A4500E]",null,null,null,null,null,null,"CBPH3     ","PCB 002",null,null,null,null,null,null,null,null,"PCB 003","pg/L,ug/L","Chlorinated Biphenyl Congeners in Multiple Matrices by HRGC/HRMS (2010) [E1668C];Chlorinated Biphenyl Congeners in Multiple Matrices by HRGC/HRMS [E1668A];Organochlorine Pesticides and PCBs [E608];Organochlorine Pesticides by Gas Chromatography [SW8081A];Polychlorinated Biphenyls (PCBs) by Gas Chromatography [SW8082];Data Unavailable [DU]"]
[null,null,null,"A4500CE","Standard Method (19th) 4500-CN E: Total CN [A4500CE]",null,null,null,null,null,null,"CBPH4       ","PCB 003",null,null,null,null,null,null,null,null,"PCB 004","pg/L,ug/L","Chlorinated Biphenyl Congeners in Multiple Matrices by HRGC/HRMS (2010) [E1668C];Chlorinated Biphenyl Congeners in Multiple Matrices by HRGC/HRMS [E1668A];Organochlorine Pesticides and PCBs [E608];Organochlorine Pesticides by Gas Chromatography [SW8081A];Polychlorinated Biphenyls (PCBs) by Gas Chromatography [SW8082];Data Unavailable [DU]"]
[null,null,null,"A4500CN","Standard Method (19th) 4500-CN I: Weak Acid Dissociable CN [A4500CN]",null,null,null,null,null,null,"DCBPH22  ","PCB 004",null,null,null,null,null,null,null,null,"PCB 005","pg/L,ug/L","Chlorinated Biphenyl Congeners in Multiple Matrices by HRGC/HRMS (2010) [E1668C];Chlorinated Biphenyl Congeners in Multiple Matrices by HRGC/HRMS [E1668A];Organochlorine Pesticides and PCBs [E608];Organochlorine Pesticides by Gas Chromatography [SW8081A];Polychlorinated Biphenyls (PCBs) by Gas Chromatography [SW8082];Data Unavailable [DU]"]
[null,null,null,"A4500M","Standard Method (19th) 4500-CN M: Thiocyanate [A4500M]",null,null,null,null,null,null,"DCBPH23     ","PCB 005",null,null,null,null,null,null,null,null,"PCB 006","pg/L,ug/L","Chlorinated Biphenyl Congeners in Multiple Matrices by HRGC/HRMS (2010) [E1668C];Chlorinated Biphenyl Congeners in Multiple Matrices by HRGC/HRMS [E1668A];Organochlorine Pesticides and PCBs [E608];Organochlorine Pesticides by Gas Chromatography [SW8081A];Polychlorinated Biphenyls (PCBs) by Gas Chromatography [SW8082];Data Unavailable [DU]"]
[null,null,null,"A4500FC","Standard Method (19th) 4500-F C: Flouride by Ion-Select. Electrode [A4500FC]",null,null,null,null,null,null,"DCBPH23PR","PCB 006",null,null,null,null,null,null,null,null,"PCB 007","pg/L,ug/L","Chlorinated Biphenyl Congeners in Multiple Matrices by HRGC/HRMS (2010) [E1668C];Chlorinated Biphenyl Congeners in Multiple Matrices by HRGC/HRMS [E1668A];Organochlorine Pesticides and PCBs [E608];Organochlorine Pesticides by Gas Chromatography [SW8081A];Polychlorinated Biphenyls (PCBs) by Gas Chromatography [SW8082];Data Unavailable [DU]"]
[null,null,null,"A4500HB","Standard Method (19th) 4500-H+ B: pH by Electrometric Method [A4500HB]",null,null,null,null,null,null,"PCB7","PCB 007",null,null,null,null,null,null,null,null,"PCB 008","pg/L,ug/L","Chlorinated Biphenyl Congeners in Multiple Matrices by HRGC/HRMS (2010) [E1668C];Chlorinated Biphenyl Congeners in Multiple Matrices by HRGC/HRMS [E1668A];Organochlorine Pesticides and PCBs [E608];Organochlorine Pesticides by Gas Chromatography [SW8081A];Polychlorinated Biphenyls (PCBs) by Gas Chromatography [SW8082];Data Unavailable [DU]"]
[null,null,null,"A4500H","Standard Method (19th) 4500-H+: pH Value [A4500H]",null,null,null,null,null,null,"PCB8","PCB 008",null,null,null,null,null,null,null,null,"PCB 009","pg/L,ug/L","Chlorinated Biphenyl Congeners in Multiple Matrices by HRGC/HRMS (2010) [E1668C];Chlorinated Biphenyl Congeners in Multiple Matrices by HRGC/HRMS [E1668A];Organochlorine Pesticides and PCBs [E608];Organochlorine Pesticides by Gas Chromatography [SW8081A];Polychlorinated Biphenyls (PCBs) by Gas Chromatography [SW8082];Data Unavailable [DU]"]
[null,null,null,"A4500NA","Standard Method (19th) 4500-N(org) A: Calc. for Org. N (TKN-NH3) [A4500NA]",null,null,null,null,null,null,"PCB9","PCB 009",null,null,null,null,null,null,null,null,"PCB 010","pg/L,ug/L","Chlorinated Biphenyl Congeners in Multiple Matrices by HRGC/HRMS (2010) [E1668C];Chlorinated Biphenyl Congeners in Multiple Matrices by HRGC/HRMS [E1668A];Organochlorine Pesticides and PCBs [E608];Organochlorine Pesticides by Gas Chromatography [SW8081A];Polychlorinated Biphenyls (PCBs) by Gas Chromatography [SW8082];Data Unavailable [DU]"]
[null,null,null,"A4500NB","Standard Method (19th) 4500-N(org) B: Macro-Kjeldahl Method [A4500NB]",null,null,null,null,null,null,"PCB10","PCB 010",null,null,null,null,null,null,null,null,"PCB 011","pg/L,ug/L","Chlorinated Biphenyl Congeners in Multiple Matrices by HRGC/HRMS (2010) [E1668C];Chlorinated Biphenyl Congeners in Multiple Matrices by HRGC/HRMS [E1668A];Organochlorine Pesticides and PCBs [E608];Organochlorine Pesticides by Gas Chromatography [SW8081A];Polychlorinated Biphenyls (PCBs) by Gas Chromatography [SW8082];Data Unavailable [DU]"]
[null,null,null,"A4500NC","Standard Method (19th) 4500-N(org) C: Semi-Micro-Kjeldahl [A4500NC]",null,null,null,null,null,null,"PCB11","PCB 011",null,null,null,null,null,null,null,null,"PCB 012","pg/L,ug/L","Chlorinated Biphenyl Congeners in Multiple Matrices by HRGC/HRMS (2010) [E1668C];Chlorinated Biphenyl Congeners in Multiple Matrices by HRGC/HRMS [E1668A];Organochlorine Pesticides and PCBs [E608];Organochlorine Pesticides by Gas Chromatography [SW8081A];Polychlorinated Biphenyls (PCBs) by Gas Chromatography [SW8082];Data Unavailable [DU]"]
[null,null,null,"A4500NH","Standard Method (19th) 4500-NH: Nitrogen (Ammonia) [A4500NH]",null,null,null,null,null,null,"PCB12","PCB 012",null,null,null,null,null,null,null,null,"PCB 013","pg/L,ug/L","Chlorinated Biphenyl Congeners in Multiple Matrices by HRGC/HRMS (2010) [E1668C];Chlorinated Biphenyl Congeners in Multiple Matrices by HRGC/HRMS [E1668A];Organochlorine Pesticides and PCBs [E608];Organochlorine Pesticides by Gas Chromatography [SW8081A];Polychlorinated Biphenyls (PCBs) by Gas Chromatography [SW8082];Data Unavailable [DU]"]
[null,null,null,"A4500OG","Standard Method (19th) 4500-O G:Diss. O by Membrane Electrode [A4500OG]",null,null,null,null,null,null,"DCBP34     ","PCB 013",null,null,null,null,null,null,null,null,"PCB 014","pg/L,ug/L","Chlorinated Biphenyl Congeners in Multiple Matrices by HRGC/HRMS (2010) [E1668C];Chlorinated Biphenyl Congeners in Multiple Matrices by HRGC/HRMS [E1668A];Organochlorine Pesticides and PCBs [E608];Organochlorine Pesticides by Gas Chromatography [SW8081A];Polychlorinated Biphenyls (PCBs) by Gas Chromatography [SW8082];Data Unavailable [DU]"]
[null,null,null,"A4500SB","Standard Method (19th) 4500-S B: Sep. of Sol./Insol. Sulfides [A4500SB]",null,null,null,null,null,null,"DCBP35   ","PCB 014",null,null,null,null,null,null,null,null,"PCB 015","pg/L,ug/L","Chlorinated Biphenyl Congeners in Multiple Matrices by HRGC/HRMS (2010) [E1668C];Chlorinated Biphenyl Congeners in Multiple Matrices by HRGC/HRMS [E1668A];Organochlorine Pesticides and PCBs [E608];Organochlorine Pesticides by Gas Chromatography [SW8081A];Polychlorinated Biphenyls (PCBs) by Gas Chromatography [SW8082];Data Unavailable [DU]"]
[null,null,null,"A4500SD","Standard Method (19th) 4500-S D: Methylene Blue Method [A4500SD]",null,null,null,null,null,null,"PCB15","PCB 015",null,null,null,null,null,null,null,null,"PCB 016","pg/L,ug/L","Chlorinated Biphenyl Congeners in Multiple Matrices by HRGC/HRMS (2010) [E1668C];Chlorinated Biphenyl Congeners in Multiple Matrices by HRGC/HRMS [E1668A];Organochlorine Pesticides and PCBs [E608];Organochlorine Pesticides by Gas Chromatography [SW8081A];Polychlorinated Biphenyls (PCBs) by Gas Chromatography [SW8082];Data Unavailable [DU]"]
[null,null,null,"A4500SF","Standard Method (19th) 4500-S F: Sulfide by Iodometric Method [A4500SF]",null,null,null,null,null,null,"PCB16","PCB 016",null,null,null,null,null,null,null,null,"PCB 017","pg/L,ug/L","Chlorinated Biphenyl Congeners in Multiple Matrices by HRGC/HRMS (2010) [E1668C];Chlorinated Biphenyl Congeners in Multiple Matrices by HRGC/HRMS [E1668A];Organochlorine Pesticides and PCBs [E608];Organochlorine Pesticides by Gas Chromatography [SW8081A];Polychlorinated Biphenyls (PCBs) by Gas Chromatography [SW8082];Data Unavailable [DU]"]
[null,null,null,"A4500SH","Standard Method (19th) 4500-S H: Calc. of Un-ionized H2S [A4500SH]",null,null,null,null,null,null,"TCBP224","PCB 017",null,null,null,null,null,null,null,null,"PCB 018","pg/L,ug/L","Chlorinated Biphenyl Congeners in Multiple Matrices by HRGC/HRMS (2010) [E1668C];Chlorinated Biphenyl Congeners in Multiple Matrices by HRGC/HRMS [E1668A];Organochlorine Pesticides and PCBs [E608];Organochlorine Pesticides by Gas Chromatography [SW8081A];Polychlorinated Biphenyls (PCBs) by Gas Chromatography [SW8082];Data Unavailable [DU]"]
[null,null,null,"A5220B","Standard Method (19th) 5220 B: COD by Open Reflux Method [A5220B]",null,null,null,null,null,null,"PCB18","PCB 018",null,null,null,null,null,null,null,null,"PCB 019","pg/L,ug/L","Chlorinated Biphenyl Congeners in Multiple Matrices by HRGC/HRMS (2010) [E1668C];Chlorinated Biphenyl Congeners in Multiple Matrices by HRGC/HRMS [E1668A];Organochlorine Pesticides and PCBs [E608];Organochlorine Pesticides by Gas Chromatography [SW8081A];Polychlorinated Biphenyls (PCBs) by Gas Chromatography [SW8082];Data Unavailable [DU]"]
[null,null,null,"A5220C","Standard Method (19th) 5220 C: COD Closed Reflux, Titrimetric [A5220C]",null,null,null,null,null,null,"TCBP226   ","PCB 019",null,null,null,null,null,null,null,null,"PCB 020","pg/L,ug/L","Chlorinated Biphenyl Congeners in Multiple Matrices by HRGC/HRMS (2010) [E1668C];Chlorinated Biphenyl Congeners in Multiple Matrices by HRGC/HRMS [E1668A];Organochlorine Pesticides and PCBs [E608];Organochlorine Pesticides by Gas Chromatography [SW8081A];Polychlorinated Biphenyls (PCBs) by Gas Chromatography [SW8082];Data Unavailable [DU]"]
[null,null,null,"A5220D","Standard Method (19th) 5220 D: COD Closed Reflux, Colorimetric [A5220D]",null,null,null,null,null,null,"PCB20","PCB 020",null,null,null,null,null,null,null,null,"PCB 021","pg/L,ug/L","Chlorinated Biphenyl Congeners in Multiple Matrices by HRGC/HRMS (2010) [E1668C];Chlorinated Biphenyl Congeners in Multiple Matrices by HRGC/HRMS [E1668A];Organochlorine Pesticides and PCBs [E608];Organochlorine Pesticides by Gas Chromatography [SW8081A];Polychlorinated Biphenyls (PCBs) by Gas Chromatography [SW8082];Data Unavailable [DU]"]
[null,null,null,"A5310B","Standard Method (19th) 5310 B: TOC by Combustion-Infrared [A5310B]",null,null,null,null,null,null,"PCB21","PCB 021",null,null,null,null,null,null,null,null,"PCB 022","pg/L,ug/L","Chlorinated Biphenyl Congeners in Multiple Matrices by HRGC/HRMS (2010) [E1668C];Chlorinated Biphenyl Congeners in Multiple Matrices by HRGC/HRMS [E1668A];Organochlorine Pesticides and PCBs [E608];Organochlorine Pesticides by Gas Chromatography [SW8081A];Polychlorinated Biphenyls (PCBs) by Gas Chromatography [SW8082];Data Unavailable [DU]"]
[null,null,null,"A5310C","Standard Method (19th) 5310 C: TOC by Persulfate-UV Oxidation [A5310C]",null,null,null,null,null,null,"PCB22","PCB 022",null,null,null,null,null,null,null,null,"PCB 023","pg/L,ug/L","Chlorinated Biphenyl Congeners in Multiple Matrices by HRGC/HRMS (2010) [E1668C];Chlorinated Biphenyl Congeners in Multiple Matrices by HRGC/HRMS [E1668A];Organochlorine Pesticides and PCBs [E608];Organochlorine Pesticides by Gas Chromatography [SW8081A];Polychlorinated Biphenyls (PCBs) by Gas Chromatography [SW8082];Data Unavailable [DU]"]
[null,null,null,"A5520F","Standard Method (19th) 5520 F: Oil & Grease Hydrocarbons [A5520F]",null,null,null,null,null,null,"TCBP235   ","PCB 023",null,null,null,null,null,null,null,null,"PCB 024","pg/L,ug/L","Chlorinated Biphenyl Congeners in Multiple Matrices by HRGC/HRMS (2010) [E1668C];Chlorinated Biphenyl Congeners in Multiple Matrices by HRGC/HRMS [E1668A];Organochlorine Pesticides and PCBs [E608];Organochlorine Pesticides by Gas Chromatography [SW8081A];Polychlorinated Biphenyls (PCBs) by Gas Chromatography [SW8082];Data Unavailable [DU]"]
[null,null,null,"A7110B","Standard Method (19th) 7110 B: Evap. Method for Gross Alpha-Beta [A7110B]",null,null,null,null,null,null,"PCB24","PCB 024",null,null,null,null,null,null,null,null,"PCB 025","pg/L,ug/L","Chlorinated Biphenyl Congeners in Multiple Matrices by HRGC/HRMS (2010) [E1668C];Chlorinated Biphenyl Congeners in Multiple Matrices by HRGC/HRMS [E1668A];Organochlorine Pesticides and PCBs [E608];Organochlorine Pesticides by Gas Chromatography [SW8081A];Polychlorinated Biphenyls (PCBs) by Gas Chromatography [SW8082];Data Unavailable [DU]"]
[null,null,null,"A7110C","Standard Method (19th) 7110 C: Gross Alpha Radioactivity in DW by Coprecipitation [A7110C]",null,null,null,null,null,null,"PCB25","PCB 025",null,null,null,null,null,null,null,null,"PCB 026","pg/L,ug/L","Chlorinated Biphenyl Congeners in Multiple Matrices by HRGC/HRMS (2010) [E1668C];Chlorinated Biphenyl Congeners in Multiple Matrices by HRGC/HRMS [E1668A];Organochlorine Pesticides and PCBs [E608];Organochlorine Pesticides by Gas Chromatography [SW8081A];Polychlorinated Biphenyls (PCBs) by Gas Chromatography [SW8082];Data Unavailable [DU]"]
[null,null,null,"A9223B","Standard Method (19th) 9223 B: Chromogenic Substrate Coliform [A9223B]",null,null,null,null,null,null,"PCB26","PCB 026",null,null,null,null,null,null,null,null,"PCB 027","pg/L,ug/L","Chlorinated Biphenyl Congeners in Multiple Matrices by HRGC/HRMS (2010) [E1668C];Chlorinated Biphenyl Congeners in Multiple Matrices by HRGC/HRMS [E1668A];Organochlorine Pesticides and PCBs [E608];Organochlorine Pesticides by Gas Chromatography [SW8081A];Polychlorinated Biphenyls (PCBs) by Gas Chromatography [SW8082];Data Unavailable [DU]"]
[null,null,null,"A9230B","Standard Method (19th) 9230 B: Fecal Strep Multiple Tube Tech. [A9230B]",null,null,null,null,null,null,"PCB27","PCB 027",null,null,null,null,null,null,null,null,"PCB 028","pg/L,ug/L","Chlorinated Biphenyl Congeners in Multiple Matrices by HRGC/HRMS (2010) [E1668C];Chlorinated Biphenyl Congeners in Multiple Matrices by HRGC/HRMS [E1668A];Organochlorine Pesticides and PCBs [E608];Organochlorine Pesticides by Gas Chromatography [SW8081A];Polychlorinated Biphenyls (PCBs) by Gas Chromatography [SW8082];Data Unavailable [DU]"]
[null,null,null,"A3500CB","Standard Method (20th) 3500-Cr B: Colorimetric Method [A3500CB]",null,null,null,null,null,null,"PCB28","PCB 028",null,null,null,null,null,null,null,null,"PCB 029","pg/L,ug/L","Chlorinated Biphenyl Congeners in Multiple Matrices by HRGC/HRMS (2010) [E1668C];Chlorinated Biphenyl Congeners in Multiple Matrices by HRGC/HRMS [E1668A];Organochlorine Pesticides and PCBs [E608];Organochlorine Pesticides by Gas Chromatography [SW8081A];Polychlorinated Biphenyls (PCBs) by Gas Chromatography [SW8082];Data Unavailable [DU]"]
[null,null,null,"A4500CA","Standard Method (20th) 4500 Cl- C: Iodometric Method II [A4500CA]",null,null,null,null,null,null,"PCB29","PCB 029",null,null,null,null,null,null,null,null,"PCB 030","pg/L,ug/L","Chlorinated Biphenyl Congeners in Multiple Matrices by HRGC/HRMS (2010) [E1668C];Chlorinated Biphenyl Congeners in Multiple Matrices by HRGC/HRMS [E1668A];Organochlorine Pesticides and PCBs [E608];Organochlorine Pesticides by Gas Chromatography [SW8081A];Polychlorinated Biphenyls (PCBs) by Gas Chromatography [SW8082];Data Unavailable [DU]"]
[null,null,null,"A4500NG","Standard Method (20th) 4500-NH3 G: N (Ammonia) Auto Phenate [A4500NG]",null,null,null,null,null,null,"PCB30","PCB 030",null,null,null,null,null,null,null,null,"PCB 031","pg/L,ug/L","Chlorinated Biphenyl Congeners in Multiple Matrices by HRGC/HRMS (2010) [E1668C];Chlorinated Biphenyl Congeners in Multiple Matrices by HRGC/HRMS [E1668A];Organochlorine Pesticides and PCBs [E608];Organochlorine Pesticides by Gas Chromatography [SW8081A];Polychlorinated Biphenyls (PCBs) by Gas Chromatography [SW8082];Data Unavailable [DU]"]
[null,null,null,"4500NB","Standard Method (20th) 4500-NO2 B: N (Nitrite) Colorimetric [4500NB]",null,null,null,null,null,null,"PCB31","PCB 031",null,null,null,null,null,null,null,null,"PCB 032","pg/L,ug/L","Chlorinated Biphenyl Congeners in Multiple Matrices by HRGC/HRMS (2010) [E1668C];Chlorinated Biphenyl Congeners in Multiple Matrices by HRGC/HRMS [E1668A];Organochlorine Pesticides and PCBs [E608];Organochlorine Pesticides by Gas Chromatography [SW8081A];Polychlorinated Biphenyls (PCBs) by Gas Chromatography [SW8082];Data Unavailable [DU]"]
[null,null,null,"A4500NE","Standard Method (20th) 4500-NO3 E: Cadmium Reduction Method [A4500NE]",null,null,null,null,null,null,"PCB32","PCB 032",null,null,null,null,null,null,null,null,"PCB 033","pg/L,ug/L","Chlorinated Biphenyl Congeners in Multiple Matrices by HRGC/HRMS (2010) [E1668C];Chlorinated Biphenyl Congeners in Multiple Matrices by HRGC/HRMS [E1668A];Organochlorine Pesticides and PCBs [E608];Organochlorine Pesticides by Gas Chromatography [SW8081A];Polychlorinated Biphenyls (PCBs) by Gas Chromatography [SW8082];Data Unavailable [DU]"]
[null,null,null,"A4500PE","Standard Method (20th) 4500-P E: Phosphorus Ascorbic Acid Method [A4500PE]",null,null,null,null,null,null,"PCB33","PCB 033",null,null,null,null,null,null,null,null,"PCB 034","pg/L,ug/L","Chlorinated Biphenyl Congeners in Multiple Matrices by HRGC/HRMS (2010) [E1668C];Chlorinated Biphenyl Congeners in Multiple Matrices by HRGC/HRMS [E1668A];Organochlorine Pesticides and PCBs [E608];Organochlorine Pesticides by Gas Chromatography [SW8081A];Polychlorinated Biphenyls (PCBs) by Gas Chromatography [SW8082];Data Unavailable [DU]"]
[null,null,null,"A1030F1","Standard Method 1030F1: Cation-Anion Balance Calculation [A1030F1]",null,null,null,null,null,null,"PCB34","PCB 034",null,null,null,null,null,null,null,null,"PCB 035","pg/L,ug/L","Chlorinated Biphenyl Congeners in Multiple Matrices by HRGC/HRMS (2010) [E1668C];Chlorinated Biphenyl Congeners in Multiple Matrices by HRGC/HRMS [E1668A];Organochlorine Pesticides and PCBs [E608];Organochlorine Pesticides by Gas Chromatography [SW8081A];Polychlorinated Biphenyls (PCBs) by Gas Chromatography [SW8082];Data Unavailable [DU]"]
[null,null,null,"A2340B","Standard Method 2340 B: Hardness by Calculation [A2340B]",null,null,null,null,null,null,"PCB35","PCB 035",null,null,null,null,null,null,null,null,"PCB 036","pg/L,ug/L","Chlorinated Biphenyl Congeners in Multiple Matrices by HRGC/HRMS (2010) [E1668C];Chlorinated Biphenyl Congeners in Multiple Matrices by HRGC/HRMS [E1668A];Organochlorine Pesticides and PCBs [E608];Organochlorine Pesticides by Gas Chromatography [SW8081A];Polychlorinated Biphenyls (PCBs) by Gas Chromatography [SW8082];Data Unavailable [DU]"]
[null,null,null,"A2340C","Standard Method 2340 C: Hardness by Calc.-EDTA Titrimetric Method [A2340C]",null,null,null,null,null,null,"PCB36","PCB 036",null,null,null,null,null,null,null,null,"PCB 037","pg/L,ug/L","Chlorinated Biphenyl Congeners in Multiple Matrices by HRGC/HRMS (2010) [E1668C];Chlorinated Biphenyl Congeners in Multiple Matrices by HRGC/HRMS [E1668A];Organochlorine Pesticides and PCBs [E608];Organochlorine Pesticides by Gas Chromatography [SW8081A];Polychlorinated Biphenyls (PCBs) by Gas Chromatography [SW8082];Data Unavailable [DU]"]
[null,null,null,"A2520B","Standard Method 2520 B: Salinity [A2520B]",null,null,null,null,null,null,"PCB37","PCB 037",null,null,null,null,null,null,null,null,"PCB 038","pg/L,ug/L","Chlorinated Biphenyl Congeners in Multiple Matrices by HRGC/HRMS (2010) [E1668C];Chlorinated Biphenyl Congeners in Multiple Matrices by HRGC/HRMS [E1668A];Organochlorine Pesticides and PCBs [E608];Organochlorine Pesticides by Gas Chromatography [SW8081A];Polychlorinated Biphenyls (PCBs) by Gas Chromatography [SW8082];Data Unavailable [DU]"]
[null,null,null,"A2530B","Standard Method 2530 B: Particulate Floatables (1997) [A2530B]",null,null,null,null,null,null,"PCB38","PCB 038",null,null,null,null,null,null,null,null,"PCB 039","pg/L,ug/L","Chlorinated Biphenyl Congeners in Multiple Matrices by HRGC/HRMS (2010) [E1668C];Chlorinated Biphenyl Congeners in Multiple Matrices by HRGC/HRMS [E1668A];Organochlorine Pesticides and PCBs [E608];Organochlorine Pesticides by Gas Chromatography [SW8081A];Polychlorinated Biphenyls (PCBs) by Gas Chromatography [SW8082];Data Unavailable [DU]"]
[null,null,null,"A2710F","Standard Method 2710 F: Specific Gravity [A2710F]",null,null,null,null,null,null,"TCB345   ","PCB 039",null,null,null,null,null,null,null,null,"PCB 040","pg/L,ug/L","Chlorinated Biphenyl Congeners in Multiple Matrices by HRGC/HRMS (2010) [E1668C];Chlorinated Biphenyl Congeners in Multiple Matrices by HRGC/HRMS [E1668A];Organochlorine Pesticides and PCBs [E608];Organochlorine Pesticides by Gas Chromatography [SW8081A];Polychlorinated Biphenyls (PCBs) by Gas Chromatography [SW8082];Data Unavailable [DU]"]
[null,null,null,"4500CLF","Standard Method 4500-Cl F: Chlorine by DPD Ferrous Titrimetric [4500CLF]",null,null,null,null,null,null,"PCB40","PCB 040",null,null,null,null,null,null,null,null,"PCB 041","pg/L,ug/L","Chlorinated Biphenyl Congeners in Multiple Matrices by HRGC/HRMS (2010) [E1668C];Chlorinated Biphenyl Congeners in Multiple Matrices by HRGC/HRMS [E1668A];Organochlorine Pesticides and PCBs [E608];Organochlorine Pesticides by Gas Chromatography [SW8081A];Polychlorinated Biphenyls (PCBs) by Gas Chromatography [SW8082];Data Unavailable [DU]"]
[null,null,null,"A4500DA","Standard Method 4500-CO2 D: CO2 and Forms of Alkalinity by Calc. [A4500DA]",null,null,null,null,null,null,"TECB2234    ","PCB 041",null,null,null,null,null,null,null,null,"PCB 042","pg/L,ug/L","Chlorinated Biphenyl Congeners in Multiple Matrices by HRGC/HRMS (2010) [E1668C];Chlorinated Biphenyl Congeners in Multiple Matrices by HRGC/HRMS [E1668A];Organochlorine Pesticides and PCBs [E608];Organochlorine Pesticides by Gas Chromatography [SW8081A];Polychlorinated Biphenyls (PCBs) by Gas Chromatography [SW8082];Data Unavailable [DU]"]
[null,null,null,"A45001C","Standard Method 4500-NH3 C: N (Ammonia) Titrimetric [A45001C]",null,null,null,null,null,null,"PCB42","PCB 042",null,null,null,null,null,null,null,null,"PCB 043","pg/L,ug/L","Chlorinated Biphenyl Congeners in Multiple Matrices by HRGC/HRMS (2010) [E1668C];Chlorinated Biphenyl Congeners in Multiple Matrices by HRGC/HRMS [E1668A];Organochlorine Pesticides and PCBs [E608];Organochlorine Pesticides by Gas Chromatography [SW8081A];Polychlorinated Biphenyls (PCBs) by Gas Chromatography [SW8082];Data Unavailable [DU]"]
[null,null,null,"A4500PF","Standard Method 4500-P F: Determination of Phosphorus by Automated Ascorbic Acid Reduction Method[A4500PF]",null,null,null,null,null,null,"PCB43","PCB 043",null,null,null,null,null,null,null,null,"PCB 044","pg/L,ug/L","Chlorinated Biphenyl Congeners in Multiple Matrices by HRGC/HRMS (2010) [E1668C];Chlorinated Biphenyl Congeners in Multiple Matrices by HRGC/HRMS [E1668A];Organochlorine Pesticides and PCBs [E608];Organochlorine Pesticides by Gas Chromatography [SW8081A];Polychlorinated Biphenyls (PCBs) by Gas Chromatography [SW8082];Data Unavailable [DU]"]
[null,null,null,"A5520B","Standard Method 5520 B: Oil & Grease Partition-Gravimetric Method [A5520B]",null,null,null,null,null,null,"PCB44","PCB 044",null,null,null,null,null,null,null,null,"PCB 045","pg/L,ug/L","Chlorinated Biphenyl Congeners in Multiple Matrices by HRGC/HRMS (2010) [E1668C];Chlorinated Biphenyl Congeners in Multiple Matrices by HRGC/HRMS [E1668A];Organochlorine Pesticides and PCBs [E608];Organochlorine Pesticides by Gas Chromatography [SW8081A];Polychlorinated Biphenyls (PCBs) by Gas Chromatography [SW8082];Data Unavailable [DU]"]
[null,null,null,"A5520C","Standard Method 5520 C: Oil & Grease Partition-Infrared Method [A5520C]",null,null,null,null,null,null,"PCB45","PCB 045",null,null,null,null,null,null,null,null,"PCB 046","pg/L,ug/L","Chlorinated Biphenyl Congeners in Multiple Matrices by HRGC/HRMS (2010) [E1668C];Chlorinated Biphenyl Congeners in Multiple Matrices by HRGC/HRMS [E1668A];Organochlorine Pesticides and PCBs [E608];Organochlorine Pesticides by Gas Chromatography [SW8081A];Polychlorinated Biphenyls (PCBs) by Gas Chromatography [SW8082];Data Unavailable [DU]"]
[null,null,null,"A5520D","Standard Method 5520 D: Oil & Grease Soxhlet Extraction Method [A5520D]",null,null,null,null,null,null,"PCB46","PCB 046",null,null,null,null,null,null,null,null,"PCB 047","pg/L,ug/L","Chlorinated Biphenyl Congeners in Multiple Matrices by HRGC/HRMS (2010) [E1668C];Chlorinated Biphenyl Congeners in Multiple Matrices by HRGC/HRMS [E1668A];Organochlorine Pesticides and PCBs [E608];Organochlorine Pesticides by Gas Chromatography [SW8081A];Polychlorinated Biphenyls (PCBs) by Gas Chromatography [SW8082];Data Unavailable [DU]"]
[null,null,null,"A5520E","Standard Method 5520 E: Oil & Grease Extraction for Sludge Sample [A5520E]",null,null,null,null,null,null,"PCB47","PCB 047",null,null,null,null,null,null,null,null,"PCB 048","pg/L,ug/L","Chlorinated Biphenyl Congeners in Multiple Matrices by HRGC/HRMS (2010) [E1668C];Chlorinated Biphenyl Congeners in Multiple Matrices by HRGC/HRMS [E1668A];Organochlorine Pesticides and PCBs [E608];Organochlorine Pesticides by Gas Chromatography [SW8081A];Polychlorinated Biphenyls (PCBs) by Gas Chromatography [SW8082];Data Unavailable [DU]"]
[null,null,null,"A5540A","Standard Method 5540 A: Surfactants (MBAS) [A5540A]",null,null,null,null,null,null,"PCB48","PCB 048",null,null,null,null,null,null,null,null,"PCB 049","pg/L,ug/L","Chlorinated Biphenyl Congeners in Multiple Matrices by HRGC/HRMS (2010) [E1668C];Chlorinated Biphenyl Congeners in Multiple Matrices by HRGC/HRMS [E1668A];Organochlorine Pesticides and PCBs [E608];Organochlorine Pesticides by Gas Chromatography [SW8081A];Polychlorinated Biphenyls (PCBs) by Gas Chromatography [SW8082];Data Unavailable [DU]"]
[null,null,null,"A5540C","Standard Method 5540 C: Determ. of Methylene Blue Active Subst. [A5540C]",null,null,null,null,null,null,"PCB49","PCB 049",null,null,null,null,null,null,null,null,"PCB 050","pg/L,ug/L","Chlorinated Biphenyl Congeners in Multiple Matrices by HRGC/HRMS (2010) [E1668C];Chlorinated Biphenyl Congeners in Multiple Matrices by HRGC/HRMS [E1668A];Organochlorine Pesticides and PCBs [E608];Organochlorine Pesticides by Gas Chromatography [SW8081A];Polychlorinated Biphenyls (PCBs) by Gas Chromatography [SW8082];Data Unavailable [DU]"]
[null,null,null,"A5540D","Standard Method 5540 D: Nonionic Surfactants as CTAS [A5540D]",null,null,null,null,null,null,"PCB50","PCB 050",null,null,null,null,null,null,null,null,"PCB 051","pg/L,ug/L","Chlorinated Biphenyl Congeners in Multiple Matrices by HRGC/HRMS (2010) [E1668C];Chlorinated Biphenyl Congeners in Multiple Matrices by HRGC/HRMS [E1668A];Organochlorine Pesticides and PCBs [E608];Organochlorine Pesticides by Gas Chromatography [SW8081A];Polychlorinated Biphenyls (PCBs) by Gas Chromatography [SW8082];Data Unavailable [DU]"]
[null,null,null,"A5550B","Standard Method 5550 B: Tannin and Lignin [A5550B]",null,null,null,null,null,null,"PCB51","PCB 051",null,null,null,null,null,null,null,null,"PCB 052","pg/L,ug/L","Chlorinated Biphenyl Congeners in Multiple Matrices by HRGC/HRMS (2010) [E1668C];Chlorinated Biphenyl Congeners in Multiple Matrices by HRGC/HRMS [E1668A];Organochlorine Pesticides and PCBs [E608];Organochlorine Pesticides by Gas Chromatography [SW8081A];Polychlorinated Biphenyls (PCBs) by Gas Chromatography [SW8082];Data Unavailable [DU]"]
[null,null,null,"A9215B","Standard Method 9215 B: Heterotrophic Plate Count-Pour Plate [A9215B]",null,null,null,null,null,null,"PCB52","PCB 052",null,null,null,null,null,null,null,null,"PCB 053","pg/L,ug/L","Chlorinated Biphenyl Congeners in Multiple Matrices by HRGC/HRMS (2010) [E1668C];Chlorinated Biphenyl Congeners in Multiple Matrices by HRGC/HRMS [E1668A];Organochlorine Pesticides and PCBs [E608];Organochlorine Pesticides by Gas Chromatography [SW8081A];Polychlorinated Biphenyls (PCBs) by Gas Chromatography [SW8082];Data Unavailable [DU]"]
[null,null,null,"A9215D","Standard Method 9215 D: Heterotrophic Plate Count-Membrane Filter [A9215D]",null,null,null,null,null,null,"PCB53","PCB 053",null,null,null,null,null,null,null,null,"PCB 054","pg/L,ug/L","Chlorinated Biphenyl Congeners in Multiple Matrices by HRGC/HRMS (2010) [E1668C];Chlorinated Biphenyl Congeners in Multiple Matrices by HRGC/HRMS [E1668A];Organochlorine Pesticides and PCBs [E608];Organochlorine Pesticides by Gas Chromatography [SW8081A];Polychlorinated Biphenyls (PCBs) by Gas Chromatography [SW8082];Data Unavailable [DU]"]
[null,null,null,"A9221BE","Standard Method 9221 B&E: Total & Fecal Coliform [A9221BE]",null,null,null,null,null,null,"PCB54","PCB 054",null,null,null,null,null,null,null,null,"PCB 055","pg/L,ug/L","Chlorinated Biphenyl Congeners in Multiple Matrices by HRGC/HRMS (2010) [E1668C];Chlorinated Biphenyl Congeners in Multiple Matrices by HRGC/HRMS [E1668A];Organochlorine Pesticides and PCBs [E608];Organochlorine Pesticides by Gas Chromatography [SW8081A];Polychlorinated Biphenyls (PCBs) by Gas Chromatography [SW8082];Data Unavailable [DU]"]
[null,null,null,"A9221B","Standard Method 9221 B: Total Coliform Fermentation Technique [A9221B]",null,null,null,null,null,null,"PCB55","PCB 055",null,null,null,null,null,null,null,null,"PCB 056","pg/L,ug/L","Chlorinated Biphenyl Congeners in Multiple Matrices by HRGC/HRMS (2010) [E1668C];Chlorinated Biphenyl Congeners in Multiple Matrices by HRGC/HRMS [E1668A];Organochlorine Pesticides and PCBs [E608];Organochlorine Pesticides by Gas Chromatography [SW8081A];Polychlorinated Biphenyls (PCBs) by Gas Chromatography [SW8082];Data Unavailable [DU]"]
[null,null,null,"A9221E","Standard Method 9221 E: Fecal Coliform [A9221E]",null,null,null,null,null,null,"PCB56","PCB 056",null,null,null,null,null,null,null,null,"PCB 057","pg/L,ug/L","Chlorinated Biphenyl Congeners in Multiple Matrices by HRGC/HRMS (2010) [E1668C];Chlorinated Biphenyl Congeners in Multiple Matrices by HRGC/HRMS [E1668A];Organochlorine Pesticides and PCBs [E608];Organochlorine Pesticides by Gas Chromatography [SW8081A];Polychlorinated Biphenyls (PCBs) by Gas Chromatography [SW8082];Data Unavailable [DU]"]
[null,null,null,"A9221F","Standard Method 9221 F: Escherichia coli (Proposed) [A9221F]",null,null,null,null,null,null,"PCB57","PCB 057",null,null,null,null,null,null,null,null,"PCB 058","pg/L,ug/L","Chlorinated Biphenyl Congeners in Multiple Matrices by HRGC/HRMS (2010) [E1668C];Chlorinated Biphenyl Congeners in Multiple Matrices by HRGC/HRMS [E1668A];Organochlorine Pesticides and PCBs [E608];Organochlorine Pesticides by Gas Chromatography [SW8081A];Polychlorinated Biphenyls (PCBs) by Gas Chromatography [SW8082];Data Unavailable [DU]"]
[null,null,null,"A9222B","Standard Method 9222 B: Total Coliform Membrane Filter Procedure [A9222B]",null,null,null,null,null,null,"PCB58","PCB 058",null,null,null,null,null,null,null,null,"PCB 059","pg/L,ug/L","Chlorinated Biphenyl Congeners in Multiple Matrices by HRGC/HRMS (2010) [E1668C];Chlorinated Biphenyl Congeners in Multiple Matrices by HRGC/HRMS [E1668A];Organochlorine Pesticides and PCBs [E608];Organochlorine Pesticides by Gas Chromatography [SW8081A];Polychlorinated Biphenyls (PCBs) by Gas Chromatography [SW8082];Data Unavailable [DU]"]
[null,null,null,"A9222D","Standard Method 9222 D: Fecal Coliform [A9222D]",null,null,null,null,null,null,"PCB59","PCB 059",null,null,null,null,null,null,null,null,"PCB 060","pg/L,ug/L","Chlorinated Biphenyl Congeners in Multiple Matrices by HRGC/HRMS (2010) [E1668C];Chlorinated Biphenyl Congeners in Multiple Matrices by HRGC/HRMS [E1668A];Organochlorine Pesticides and PCBs [E608];Organochlorine Pesticides by Gas Chromatography [SW8081A];Polychlorinated Biphenyls (PCBs) by Gas Chromatography [SW8082];Data Unavailable [DU]"]
[null,null,null,"A9230D","Standard Method 9230 D: Fluorogenic Substrate Enterococcus Test [A9230D]",null,null,null,null,null,null,"PCB60","PCB 060",null,null,null,null,null,null,null,null,"PCB 061","pg/L,ug/L","Chlorinated Biphenyl Congeners in Multiple Matrices by HRGC/HRMS (2010) [E1668C];Chlorinated Biphenyl Congeners in Multiple Matrices by HRGC/HRMS [E1668A];Organochlorine Pesticides and PCBs [E608];Organochlorine Pesticides by Gas Chromatography [SW8081A];Polychlorinated Biphenyls (PCBs) by Gas Chromatography [SW8082];Data Unavailable [DU]"]
[null,null,null,"A9240D","Standard Method 9240 D: Isolation of Iron and Sulfur Bacteria [A9240D]",null,null,null,null,null,null,"PCB61","PCB 061",null,null,null,null,null,null,null,null,"PCB 062","pg/L,ug/L","Chlorinated Biphenyl Congeners in Multiple Matrices by HRGC/HRMS (2010) [E1668C];Chlorinated Biphenyl Congeners in Multiple Matrices by HRGC/HRMS [E1668A];Organochlorine Pesticides and PCBs [E608];Organochlorine Pesticides by Gas Chromatography [SW8081A];Polychlorinated Biphenyls (PCBs) by Gas Chromatography [SW8082];Data Unavailable [DU]"]
[null,null,null,"A3114B","Standard Methods (19th) 3114 B: Metals by Gaseuous Hydride AAS [A3114B]",null,null,null,null,null,null,"PCB62","PCB 062",null,null,null,null,null,null,null,null,"PCB 063","pg/L,ug/L","Chlorinated Biphenyl Congeners in Multiple Matrices by HRGC/HRMS (2010) [E1668C];Chlorinated Biphenyl Congeners in Multiple Matrices by HRGC/HRMS [E1668A];Organochlorine Pesticides and PCBs [E608];Organochlorine Pesticides by Gas Chromatography [SW8081A];Polychlorinated Biphenyls (PCBs) by Gas Chromatography [SW8082];Data Unavailable [DU]"]
[null,null,null,"4500NHH","Standard Methods 4500-NH3 H: Nitrogen (Ammonia) - Flow Injection Analysis (1997) [4500NHH]",null,null,null,null,null,null,"PCB63","PCB 063",null,null,null,null,null,null,null,null,"PCB 064","pg/L,ug/L","Chlorinated Biphenyl Congeners in Multiple Matrices by HRGC/HRMS (2010) [E1668C];Chlorinated Biphenyl Congeners in Multiple Matrices by HRGC/HRMS [E1668A];Organochlorine Pesticides and PCBs [E608];Organochlorine Pesticides by Gas Chromatography [SW8081A];Polychlorinated Biphenyls (PCBs) by Gas Chromatography [SW8082];Data Unavailable [DU]"]
[null,null,null,"A4500PG","Standard Methods 4500-P G: Determination of Phosphorus by Flow Injection Analysis for Orthophosphate",null,null,null,null,null,null,"PCB64","PCB 064",null,null,null,null,null,null,null,null,"PCB 065","pg/L,ug/L","Chlorinated Biphenyl Congeners in Multiple Matrices by HRGC/HRMS (2010) [E1668C];Chlorinated Biphenyl Congeners in Multiple Matrices by HRGC/HRMS [E1668A];Organochlorine Pesticides and PCBs [E608];Organochlorine Pesticides by Gas Chromatography [SW8081A];Polychlorinated Biphenyls (PCBs) by Gas Chromatography [SW8082];Data Unavailable [DU]"]
[null,null,null,"A4500PH","Standard Methods 4500-P H: Manual Digestion and Flow Injection Analysis for Total Phosphorus",null,null,null,null,null,null,"PCB65","PCB 065",null,null,null,null,null,null,null,null,"PCB 066","pg/L,ug/L","Chlorinated Biphenyl Congeners in Multiple Matrices by HRGC/HRMS (2010) [E1668C];Chlorinated Biphenyl Congeners in Multiple Matrices by HRGC/HRMS [E1668A];Organochlorine Pesticides and PCBs [E608];Organochlorine Pesticides by Gas Chromatography [SW8081A];Polychlorinated Biphenyls (PCBs) by Gas Chromatography [SW8082];Data Unavailable [DU]"]
[null,null,null,"A5310D","Standard Methods 5310D: Wet-Oxidation Method [A5310D]",null,null,null,null,null,null,"PCB66","PCB 066",null,null,null,null,null,null,null,null,"PCB 067","pg/L,ug/L","Chlorinated Biphenyl Congeners in Multiple Matrices by HRGC/HRMS (2010) [E1668C];Chlorinated Biphenyl Congeners in Multiple Matrices by HRGC/HRMS [E1668A];Organochlorine Pesticides and PCBs [E608];Organochlorine Pesticides by Gas Chromatography [SW8081A];Polychlorinated Biphenyls (PCBs) by Gas Chromatography [SW8082];Data Unavailable [DU]"]
[null,null,null,"SW7780","Strontium (AA, Direct Aspiration) [SW7780]",null,null,null,null,null,null,"PCB67","PCB 067",null,null,null,null,null,null,null,null,"PCB 068","pg/L,ug/L","Chlorinated Biphenyl Congeners in Multiple Matrices by HRGC/HRMS (2010) [E1668C];Chlorinated Biphenyl Congeners in Multiple Matrices by HRGC/HRMS [E1668A];Organochlorine Pesticides and PCBs [E608];Organochlorine Pesticides by Gas Chromatography [SW8081A];Polychlorinated Biphenyls (PCBs) by Gas Chromatography [SW8082];Data Unavailable [DU]"]
[null,null,null,"SW9038","Sulfate (Turbidimetric) [SW9038]",null,null,null,null,null,null,"PCB68","PCB 068",null,null,null,null,null,null,null,null,"PCB 069","pg/L,ug/L","Chlorinated Biphenyl Congeners in Multiple Matrices by HRGC/HRMS (2010) [E1668C];Chlorinated Biphenyl Congeners in Multiple Matrices by HRGC/HRMS [E1668A];Organochlorine Pesticides and PCBs [E608];Organochlorine Pesticides by Gas Chromatography [SW8081A];Polychlorinated Biphenyls (PCBs) by Gas Chromatography [SW8082];Data Unavailable [DU]"]
[null,null,null,"E375.1","Sulfate [E375.1]",null,null,null,null,null,null,"PCB69","PCB 069",null,null,null,null,null,null,null,null,"PCB 070","pg/L,ug/L","Chlorinated Biphenyl Congeners in Multiple Matrices by HRGC/HRMS (2010) [E1668C];Chlorinated Biphenyl Congeners in Multiple Matrices by HRGC/HRMS [E1668A];Organochlorine Pesticides and PCBs [E608];Organochlorine Pesticides by Gas Chromatography [SW8081A];Polychlorinated Biphenyls (PCBs) by Gas Chromatography [SW8082];Data Unavailable [DU]"]
[null,null,null,"E375.2","Sulfate [E375.2]",null,null,null,null,null,null,"PCB70","PCB 070",null,null,null,null,null,null,null,null,"PCB 071","pg/L,ug/L","Chlorinated Biphenyl Congeners in Multiple Matrices by HRGC/HRMS (2010) [E1668C];Chlorinated Biphenyl Congeners in Multiple Matrices by HRGC/HRMS [E1668A];Organochlorine Pesticides and PCBs [E608];Organochlorine Pesticides by Gas Chromatography [SW8081A];Polychlorinated Biphenyls (PCBs) by Gas Chromatography [SW8082];Data Unavailable [DU]"]
[null,null,null,"E375.3","Sulfate [E375.3]",null,null,null,null,null,null,"PCB71","PCB 071",null,null,null,null,null,null,null,null,"PCB 072","pg/L,ug/L","Chlorinated Biphenyl Congeners in Multiple Matrices by HRGC/HRMS (2010) [E1668C];Chlorinated Biphenyl Congeners in Multiple Matrices by HRGC/HRMS [E1668A];Organochlorine Pesticides and PCBs [E608];Organochlorine Pesticides by Gas Chromatography [SW8081A];Polychlorinated Biphenyls (PCBs) by Gas Chromatography [SW8082];Data Unavailable [DU]"]
[null,null,null,"E375.4","Sulfate [E375.4]",null,null,null,null,null,null,"PCB72","PCB 072",null,null,null,null,null,null,null,null,"PCB 073","pg/L,ug/L","Chlorinated Biphenyl Congeners in Multiple Matrices by HRGC/HRMS (2010) [E1668C];Chlorinated Biphenyl Congeners in Multiple Matrices by HRGC/HRMS [E1668A];Organochlorine Pesticides and PCBs [E608];Organochlorine Pesticides by Gas Chromatography [SW8081A];Polychlorinated Biphenyls (PCBs) by Gas Chromatography [SW8082];Data Unavailable [DU]"]
[null,null,null,"E376.1","Sulfide [E376.1]",null,null,null,null,null,null,"PCB73","PCB 073",null,null,null,null,null,null,null,null,"PCB 074","pg/L,ug/L","Chlorinated Biphenyl Congeners in Multiple Matrices by HRGC/HRMS (2010) [E1668C];Chlorinated Biphenyl Congeners in Multiple Matrices by HRGC/HRMS [E1668A];Organochlorine Pesticides and PCBs [E608];Organochlorine Pesticides by Gas Chromatography [SW8081A];Polychlorinated Biphenyls (PCBs) by Gas Chromatography [SW8082];Data Unavailable [DU]"]
[null,null,null,"E376.2","Sulfide [E376.2]",null,null,null,null,null,null,"PCB74","PCB 074",null,null,null,null,null,null,null,null,"PCB 075","pg/L,ug/L","Chlorinated Biphenyl Congeners in Multiple Matrices by HRGC/HRMS (2010) [E1668C];Chlorinated Biphenyl Congeners in Multiple Matrices by HRGC/HRMS [E1668A];Organochlorine Pesticides and PCBs [E608];Organochlorine Pesticides by Gas Chromatography [SW8081A];Polychlorinated Biphenyls (PCBs) by Gas Chromatography [SW8082];Data Unavailable [DU]"]
[null,null,null,"E377.1","Sulfite [E377.1]",null,null,null,null,null,null,"PCB75","PCB 075",null,null,null,null,null,null,null,null,"PCB 076","pg/L,ug/L","Chlorinated Biphenyl Congeners in Multiple Matrices by HRGC/HRMS (2010) [E1668C];Chlorinated Biphenyl Congeners in Multiple Matrices by HRGC/HRMS [E1668A];Organochlorine Pesticides and PCBs [E608];Organochlorine Pesticides by Gas Chromatography [SW8081A];Polychlorinated Biphenyls (PCBs) by Gas Chromatography [SW8082];Data Unavailable [DU]"]
[null,null,null,"SW7.1","SW-846, Chapter 7.1: Ignitability [SW7.1]",null,null,null,null,null,null,"PCB76","PCB 076",null,null,null,null,null,null,null,null,"PCB 077","pg/L,ug/L","Chlorinated Biphenyl Congeners in Multiple Matrices by HRGC/HRMS (2010) [E1668C];Chlorinated Biphenyl Congeners in Multiple Matrices by HRGC/HRMS [E1668A];Organochlorine Pesticides and PCBs [E608];Organochlorine Pesticides by Gas Chromatography [SW8081A];Polychlorinated Biphenyls (PCBs) by Gas Chromatography [SW8082];Data Unavailable [DU]"]
[null,null,null,"SW7.2","SW-846, Chapter 7.2: Corrosivity [SW7.2]",null,null,null,null,null,null,"PCB77","PCB 077",null,null,null,null,null,null,null,null,"PCB 078","pg/L,ug/L","Chlorinated Biphenyl Congeners in Multiple Matrices by HRGC/HRMS (2010) [E1668C];Chlorinated Biphenyl Congeners in Multiple Matrices by HRGC/HRMS [E1668A];Organochlorine Pesticides and PCBs [E608];Organochlorine Pesticides by Gas Chromatography [SW8081A];Polychlorinated Biphenyls (PCBs) by Gas Chromatography [SW8082];Data Unavailable [DU]"]
[null,null,null,"SW7.3","SW-846, Chapter 7.3: Cyanide/Sulfide Reactivity [SW7.3]",null,null,null,null,null,null,"PCB78","PCB 078",null,null,null,null,null,null,null,null,"PCB 079","pg/L,ug/L","Chlorinated Biphenyl Congeners in Multiple Matrices by HRGC/HRMS (2010) [E1668C];Chlorinated Biphenyl Congeners in Multiple Matrices by HRGC/HRMS [E1668A];Organochlorine Pesticides and PCBs [E608];Organochlorine Pesticides by Gas Chromatography [SW8081A];Polychlorinated Biphenyls (PCBs) by Gas Chromatography [SW8082];Data Unavailable [DU]"]
[null,null,null,"E170.1","Temperature [E170.1]",null,null,null,null,null,null,"PCB79","PCB 079",null,null,null,null,null,null,null,null,"PCB 080","pg/L,ug/L","Chlorinated Biphenyl Congeners in Multiple Matrices by HRGC/HRMS (2010) [E1668C];Chlorinated Biphenyl Congeners in Multiple Matrices by HRGC/HRMS [E1668A];Organochlorine Pesticides and PCBs [E608];Organochlorine Pesticides by Gas Chromatography [SW8081A];Polychlorinated Biphenyls (PCBs) by Gas Chromatography [SW8082];Data Unavailable [DU]"]
[null,null,null,"E1613A","Tetra thru Octa-Chlorinated Dioxins and Furans by Isotope Dilutin [E1613A]",null,null,null,null,null,null,"PCB80","PCB 080",null,null,null,null,null,null,null,null,"PCB 081","pg/L,ug/L","Chlorinated Biphenyl Congeners in Multiple Matrices by HRGC/HRMS (2010) [E1668C];Chlorinated Biphenyl Congeners in Multiple Matrices by HRGC/HRMS [E1668A];Organochlorine Pesticides and PCBs [E608];Organochlorine Pesticides by Gas Chromatography [SW8081A];Polychlorinated Biphenyls (PCBs) by Gas Chromatography [SW8082];Data Unavailable [DU]"]
[null,null,null,"E1613B","Tetra-through Octa-Chlorinated Dioxins and Furans by HRGC/HRMS [E1613B]",null,null,null,null,null,null,"PCB81","PCB 081",null,null,null,null,null,null,null,null,"PCB 082","pg/L,ug/L","Chlorinated Biphenyl Congeners in Multiple Matrices by HRGC/HRMS (2010) [E1668C];Chlorinated Biphenyl Congeners in Multiple Matrices by HRGC/HRMS [E1668A];Organochlorine Pesticides and PCBs [E608];Organochlorine Pesticides by Gas Chromatography [SW8081A];Polychlorinated Biphenyls (PCBs) by Gas Chromatography [SW8082];Data Unavailable [DU]"]
[null,null,null,"SW7840","Thallium (AA, Direct Aspiration) [SW7840]",null,null,null,null,null,null,"PCB82","PCB 082",null,null,null,null,null,null,null,null,"PCB 083","pg/L,ug/L","Chlorinated Biphenyl Congeners in Multiple Matrices by HRGC/HRMS (2010) [E1668C];Chlorinated Biphenyl Congeners in Multiple Matrices by HRGC/HRMS [E1668A];Organochlorine Pesticides and PCBs [E608];Organochlorine Pesticides by Gas Chromatography [SW8081A];Polychlorinated Biphenyls (PCBs) by Gas Chromatography [SW8082];Data Unavailable [DU]"]
[null,null,null,"SW7841","Thallium (AA, furnace Technique) [SW7841]",null,null,null,null,null,null,"PCB83","PCB 083",null,null,null,null,null,null,null,null,"PCB 084","pg/L,ug/L","Chlorinated Biphenyl Congeners in Multiple Matrices by HRGC/HRMS (2010) [E1668C];Chlorinated Biphenyl Congeners in Multiple Matrices by HRGC/HRMS [E1668A];Organochlorine Pesticides and PCBs [E608];Organochlorine Pesticides by Gas Chromatography [SW8081A];Polychlorinated Biphenyls (PCBs) by Gas Chromatography [SW8082];Data Unavailable [DU]"]
[null,null,null,"CL279.2","Thallium (AA, Furnace) - modified for CLP [CL279.2]",null,null,null,null,null,null,"PCB84","PCB 084",null,null,null,null,null,null,null,null,"PCB 085","pg/L,ug/L","Chlorinated Biphenyl Congeners in Multiple Matrices by HRGC/HRMS (2010) [E1668C];Chlorinated Biphenyl Congeners in Multiple Matrices by HRGC/HRMS [E1668A];Organochlorine Pesticides and PCBs [E608];Organochlorine Pesticides by Gas Chromatography [SW8081A];Polychlorinated Biphenyls (PCBs) by Gas Chromatography [SW8082];Data Unavailable [DU]"]
[null,null,null,"E279.2","Thallium (AA, Furnace) [E279.2]",null,null,null,null,null,null,"PCB85","PCB 085",null,null,null,null,null,null,null,null,"PCB 086","pg/L,ug/L","Chlorinated Biphenyl Congeners in Multiple Matrices by HRGC/HRMS (2010) [E1668C];Chlorinated Biphenyl Congeners in Multiple Matrices by HRGC/HRMS [E1668A];Organochlorine Pesticides and PCBs [E608];Organochlorine Pesticides by Gas Chromatography [SW8081A];Polychlorinated Biphenyls (PCBs) by Gas Chromatography [SW8082];Data Unavailable [DU]"]
[null,null,null,"E282.1","Tin (AA, Direct Aspiration) [E282.1]",null,null,null,null,null,null,"PCB86","PCB 086",null,null,null,null,null,null,null,null,"PCB 087","pg/L,ug/L","Chlorinated Biphenyl Congeners in Multiple Matrices by HRGC/HRMS (2010) [E1668C];Chlorinated Biphenyl Congeners in Multiple Matrices by HRGC/HRMS [E1668A];Organochlorine Pesticides and PCBs [E608];Organochlorine Pesticides by Gas Chromatography [SW8081A];Polychlorinated Biphenyls (PCBs) by Gas Chromatography [SW8082];Data Unavailable [DU]"]
[null,null,null,"SW7870","Tin (AA, Direct Aspiration) [SW7870]",null,null,null,null,null,null,"PCB87","PCB 087",null,null,null,null,null,null,null,null,"PCB 088","pg/L,ug/L","Chlorinated Biphenyl Congeners in Multiple Matrices by HRGC/HRMS (2010) [E1668C];Chlorinated Biphenyl Congeners in Multiple Matrices by HRGC/HRMS [E1668A];Organochlorine Pesticides and PCBs [E608];Organochlorine Pesticides by Gas Chromatography [SW8081A];Polychlorinated Biphenyls (PCBs) by Gas Chromatography [SW8082];Data Unavailable [DU]"]
[null,null,null,"E283.1","Titanium (AA, Direct Aspiration) [E283.1]",null,null,null,null,null,null,"PCB88","PCB 088",null,null,null,null,null,null,null,null,"PCB 089","pg/L,ug/L","Chlorinated Biphenyl Congeners in Multiple Matrices by HRGC/HRMS (2010) [E1668C];Chlorinated Biphenyl Congeners in Multiple Matrices by HRGC/HRMS [E1668A];Organochlorine Pesticides and PCBs [E608];Organochlorine Pesticides by Gas Chromatography [SW8081A];Polychlorinated Biphenyls (PCBs) by Gas Chromatography [SW8082];Data Unavailable [DU]"]
[null,null,null,"E283.2","Titanium (AA, Furnace Technique) [E283.2]",null,null,null,null,null,null,"PCB89","PCB 089",null,null,null,null,null,null,null,null,"PCB 090","pg/L,ug/L","Chlorinated Biphenyl Congeners in Multiple Matrices by HRGC/HRMS (2010) [E1668C];Chlorinated Biphenyl Congeners in Multiple Matrices by HRGC/HRMS [E1668A];Organochlorine Pesticides and PCBs [E608];Organochlorine Pesticides by Gas Chromatography [SW8081A];Polychlorinated Biphenyls (PCBs) by Gas Chromatography [SW8082];Data Unavailable [DU]"]
[null,null,null,"SW9014","Titrimetric and Manual Spectrophotometric Determ. for Cyanide [SW9014]",null,null,null,null,null,null,"PCB90","PCB 090",null,null,null,null,null,null,null,null,"PCB 091","pg/L,ug/L","Chlorinated Biphenyl Congeners in Multiple Matrices by HRGC/HRMS (2010) [E1668C];Chlorinated Biphenyl Congeners in Multiple Matrices by HRGC/HRMS [E1668A];Organochlorine Pesticides and PCBs [E608];Organochlorine Pesticides by Gas Chromatography [SW8081A];Polychlorinated Biphenyls (PCBs) by Gas Chromatography [SW8082];Data Unavailable [DU]"]
[null,null,null,"SW9034","Titrimetric Proc. for Acid-Soluble/Insoluble Sulfides [SW9034]",null,null,null,null,null,null,"PCB91","PCB 091",null,null,null,null,null,null,null,null,"PCB 092","pg/L,ug/L","Chlorinated Biphenyl Congeners in Multiple Matrices by HRGC/HRMS (2010) [E1668C];Chlorinated Biphenyl Congeners in Multiple Matrices by HRGC/HRMS [E1668A];Organochlorine Pesticides and PCBs [E608];Organochlorine Pesticides by Gas Chromatography [SW8081A];Polychlorinated Biphenyls (PCBs) by Gas Chromatography [SW8082];Data Unavailable [DU]"]
[null,null,null,"SW9012A","Total and Amenable Cyanide (Auto. Colorimetric/Off-line Distill.) [SW9012A]",null,null,null,null,null,null,"PCB92","PCB 092",null,null,null,null,null,null,null,null,"PCB 093","pg/L,ug/L","Chlorinated Biphenyl Congeners in Multiple Matrices by HRGC/HRMS (2010) [E1668C];Chlorinated Biphenyl Congeners in Multiple Matrices by HRGC/HRMS [E1668A];Organochlorine Pesticides and PCBs [E608];Organochlorine Pesticides by Gas Chromatography [SW8081A];Polychlorinated Biphenyls (PCBs) by Gas Chromatography [SW8082];Data Unavailable [DU]"]
[null,null,null,"SW9010B","Total and Amenable Cyanide: Distillation [SW9010B]",null,null,null,null,null,null,"PCB93","PCB 093",null,null,null,null,null,null,null,null,"PCB 094","pg/L,ug/L","Chlorinated Biphenyl Congeners in Multiple Matrices by HRGC/HRMS (2010) [E1668C];Chlorinated Biphenyl Congeners in Multiple Matrices by HRGC/HRMS [E1668A];Organochlorine Pesticides and PCBs [E608];Organochlorine Pesticides by Gas Chromatography [SW8081A];Polychlorinated Biphenyls (PCBs) by Gas Chromatography [SW8082];Data Unavailable [DU]"]
[null,null,null,"BTSNTOT","Total Butyltins [BTSNTOT]",null,null,null,null,null,null,"PCB94","PCB 094",null,null,null,null,null,null,null,null,"PCB 095","pg/L,ug/L","Chlorinated Biphenyl Congeners in Multiple Matrices by HRGC/HRMS (2010) [E1668C];Chlorinated Biphenyl Congeners in Multiple Matrices by HRGC/HRMS [E1668A];Organochlorine Pesticides and PCBs [E608];Organochlorine Pesticides by Gas Chromatography [SW8081A];Polychlorinated Biphenyls (PCBs) by Gas Chromatography [SW8082];Data Unavailable [DU]"]
[null,null,null,"SW9077","Total Chlorine in New and Used Petroleum Products [SW9077]",null,null,null,null,null,null,"PCB95","PCB 095",null,null,null,null,null,null,null,null,"PCB 096","pg/L,ug/L","Chlorinated Biphenyl Congeners in Multiple Matrices by HRGC/HRMS (2010) [E1668C];Chlorinated Biphenyl Congeners in Multiple Matrices by HRGC/HRMS [E1668A];Organochlorine Pesticides and PCBs [E608];Organochlorine Pesticides by Gas Chromatography [SW8081A];Polychlorinated Biphenyls (PCBs) by Gas Chromatography [SW8082];Data Unavailable [DU]"]
[null,null,null,"SW9076","Total Chlorine in Petroleum Products by Oxidative Combst. [SW9076]",null,null,null,null,null,null,"PCB96","PCB 096",null,null,null,null,null,null,null,null,"PCB 097","pg/L,ug/L","Chlorinated Biphenyl Congeners in Multiple Matrices by HRGC/HRMS (2010) [E1668C];Chlorinated Biphenyl Congeners in Multiple Matrices by HRGC/HRMS [E1668A];Organochlorine Pesticides and PCBs [E608];Organochlorine Pesticides by Gas Chromatography [SW8081A];Polychlorinated Biphenyls (PCBs) by Gas Chromatography [SW8082];Data Unavailable [DU]"]
[null,null,null,"SW9132","Total Coliform: Membrane-Filter Technique [SW9132]",null,null,null,null,null,null,"PCB97","PCB 097",null,null,null,null,null,null,null,null,"PCB 098","pg/L,ug/L","Chlorinated Biphenyl Congeners in Multiple Matrices by HRGC/HRMS (2010) [E1668C];Chlorinated Biphenyl Congeners in Multiple Matrices by HRGC/HRMS [E1668A];Organochlorine Pesticides and PCBs [E608];Organochlorine Pesticides by Gas Chromatography [SW8081A];Polychlorinated Biphenyls (PCBs) by Gas Chromatography [SW8082];Data Unavailable [DU]"]
[null,null,null,"SW9131","Total Coliform: Multiple Tube Fermentation Technique [SW9131]",null,null,null,null,null,null,"PCB98","PCB 098",null,null,null,null,null,null,null,null,"PCB 099","pg/L,ug/L","Chlorinated Biphenyl Congeners in Multiple Matrices by HRGC/HRMS (2010) [E1668C];Chlorinated Biphenyl Congeners in Multiple Matrices by HRGC/HRMS [E1668A];Organochlorine Pesticides and PCBs [E608];Organochlorine Pesticides by Gas Chromatography [SW8081A];Polychlorinated Biphenyls (PCBs) by Gas Chromatography [SW8082];Data Unavailable [DU]"]
[null,null,null,"CL335.2","Total Cyanide - modified for CLP [CL335.2]",null,null,null,null,null,null,"PCB99","PCB 099",null,null,null,null,null,null,null,null,"PCB 100","pg/L,ug/L","Chlorinated Biphenyl Congeners in Multiple Matrices by HRGC/HRMS (2010) [E1668C];Chlorinated Biphenyl Congeners in Multiple Matrices by HRGC/HRMS [E1668A];Organochlorine Pesticides and PCBs [E608];Organochlorine Pesticides by Gas Chromatography [SW8081A];Polychlorinated Biphenyls (PCBs) by Gas Chromatography [SW8082];Data Unavailable [DU]"]
[null,null,null,"E335.3","Total Cyanide (Colorimetric, Automated UV) [E335.3]",null,null,null,null,null,null,"PCB100","PCB 100",null,null,null,null,null,null,null,null,"PCB 101","pg/L,ug/L","Chlorinated Biphenyl Congeners in Multiple Matrices by HRGC/HRMS (2010) [E1668C];Chlorinated Biphenyl Congeners in Multiple Matrices by HRGC/HRMS [E1668A];Organochlorine Pesticides and PCBs [E608];Organochlorine Pesticides by Gas Chromatography [SW8081A];Polychlorinated Biphenyls (PCBs) by Gas Chromatography [SW8082];Data Unavailable [DU]"]
[null,null,null,"E335.2","Total Cyanide [E335.2]",null,null,null,null,null,null,"PCB101","PCB 101",null,null,null,null,null,null,null,null,"PCB 102","pg/L,ug/L","Chlorinated Biphenyl Congeners in Multiple Matrices by HRGC/HRMS (2010) [E1668C];Chlorinated Biphenyl Congeners in Multiple Matrices by HRGC/HRMS [E1668A];Organochlorine Pesticides and PCBs [E608];Organochlorine Pesticides by Gas Chromatography [SW8081A];Polychlorinated Biphenyls (PCBs) by Gas Chromatography [SW8082];Data Unavailable [DU]"]
[null,null,null,"E335.4","Total Cyanide by Semi-automated Colorimetry [E335.4]",null,null,null,null,null,null,"PCB102","PCB 102",null,null,null,null,null,null,null,null,"PCB 103","pg/L,ug/L","Chlorinated Biphenyl Congeners in Multiple Matrices by HRGC/HRMS (2010) [E1668C];Chlorinated Biphenyl Congeners in Multiple Matrices by HRGC/HRMS [E1668A];Organochlorine Pesticides and PCBs [E608];Organochlorine Pesticides by Gas Chromatography [SW8081A];Polychlorinated Biphenyls (PCBs) by Gas Chromatography [SW8082];Data Unavailable [DU]"]
[null,null,null,"SW9060","Total Organic Carbon  (TOC) [SW9060]",null,null,null,null,null,null,"PCB103","PCB 103",null,null,null,null,null,null,null,null,"PCB 104","pg/L,ug/L","Chlorinated Biphenyl Congeners in Multiple Matrices by HRGC/HRMS (2010) [E1668C];Chlorinated Biphenyl Congeners in Multiple Matrices by HRGC/HRMS [E1668A];Organochlorine Pesticides and PCBs [E608];Organochlorine Pesticides by Gas Chromatography [SW8081A];Polychlorinated Biphenyls (PCBs) by Gas Chromatography [SW8082];Data Unavailable [DU]"]
[null,null,null,"E415.1","Total Organic Carbon (Combustion or Oxidation) [E415.1]",null,null,null,null,null,null,"PCB104","PCB 104",null,null,null,null,null,null,null,null,"PCB 105","pg/L,ug/L","Chlorinated Biphenyl Congeners in Multiple Matrices by HRGC/HRMS (2010) [E1668C];Chlorinated Biphenyl Congeners in Multiple Matrices by HRGC/HRMS [E1668A];Organochlorine Pesticides and PCBs [E608];Organochlorine Pesticides by Gas Chromatography [SW8081A];Polychlorinated Biphenyls (PCBs) by Gas Chromatography [SW8082];Data Unavailable [DU]"]
[null,null,null,"E415.3","Total Organic Carbon (UV Absorbance) [E415.3]",null,null,null,null,null,null,"PCB105","PCB 105",null,null,null,null,null,null,null,null,"PCB 106","pg/L,ug/L","Chlorinated Biphenyl Congeners in Multiple Matrices by HRGC/HRMS (2010) [E1668C];Chlorinated Biphenyl Congeners in Multiple Matrices by HRGC/HRMS [E1668A];Organochlorine Pesticides and PCBs [E608];Organochlorine Pesticides by Gas Chromatography [SW8081A];Polychlorinated Biphenyls (PCBs) by Gas Chromatography [SW8082];Data Unavailable [DU]"]
[null,null,null,"E415.2","Total Organic Carbon (UV Promoted, Persulfate Oxidation) [E415.2]",null,null,null,null,null,null,"PCB106","PCB 106",null,null,null,null,null,null,null,null,"PCB 107","pg/L,ug/L","Chlorinated Biphenyl Congeners in Multiple Matrices by HRGC/HRMS (2010) [E1668C];Chlorinated Biphenyl Congeners in Multiple Matrices by HRGC/HRMS [E1668A];Organochlorine Pesticides and PCBs [E608];Organochlorine Pesticides by Gas Chromatography [SW8081A];Polychlorinated Biphenyls (PCBs) by Gas Chromatography [SW8082];Data Unavailable [DU]"]
[null,null,null,"8260TPH","Total Petroleum Hydrocarbons (TPH) by GC/MS [8260TPH]",null,null,null,null,null,null,"PCB107","PCB 107",null,null,null,null,null,null,null,null,"PCB 108","pg/L,ug/L","Chlorinated Biphenyl Congeners in Multiple Matrices by HRGC/HRMS (2010) [E1668C];Chlorinated Biphenyl Congeners in Multiple Matrices by HRGC/HRMS [E1668A];Organochlorine Pesticides and PCBs [E608];Organochlorine Pesticides by Gas Chromatography [SW8081A];Polychlorinated Biphenyls (PCBs) by Gas Chromatography [SW8082];Data Unavailable [DU]"]
[null,null,null,"8260TPB","Total Petroleum Hydrocarbons plus BTEX by GC/MS [8260TPB]",null,null,null,null,null,null,"PCB108","PCB 108",null,null,null,null,null,null,null,null,"PCB 109","pg/L,ug/L","Chlorinated Biphenyl Congeners in Multiple Matrices by HRGC/HRMS (2010) [E1668C];Chlorinated Biphenyl Congeners in Multiple Matrices by HRGC/HRMS [E1668A];Organochlorine Pesticides and PCBs [E608];Organochlorine Pesticides by Gas Chromatography [SW8081A];Polychlorinated Biphenyls (PCBs) by Gas Chromatography [SW8082];Data Unavailable [DU]"]
[null,null,null,"E420.4","Total Recoverable Phenolics by Semi-automated Colorimetry [E420.4]",null,null,null,null,null,null,"PCB109","PCB 109",null,null,null,null,null,null,null,null,"PCB 110","pg/L,ug/L","Chlorinated Biphenyl Congeners in Multiple Matrices by HRGC/HRMS (2010) [E1668C];Chlorinated Biphenyl Congeners in Multiple Matrices by HRGC/HRMS [E1668A];Organochlorine Pesticides and PCBs [E608];Organochlorine Pesticides by Gas Chromatography [SW8081A];Polychlorinated Biphenyls (PCBs) by Gas Chromatography [SW8082];Data Unavailable [DU]"]
[null,null,null,"E1638","Trace Elements in Ambient Waters by ICP-MS [E1638]",null,null,null,null,null,null,"PCB110","PCB 110",null,null,null,null,null,null,null,null,"PCB 111","pg/L,ug/L","Chlorinated Biphenyl Congeners in Multiple Matrices by HRGC/HRMS (2010) [E1668C];Chlorinated Biphenyl Congeners in Multiple Matrices by HRGC/HRMS [E1668A];Organochlorine Pesticides and PCBs [E608];Organochlorine Pesticides by Gas Chromatography [SW8081A];Polychlorinated Biphenyls (PCBs) by Gas Chromatography [SW8082];Data Unavailable [DU]"]
[null,null,null,"E1639","Trace Elements in Ambient Waters by Stabilized [E1639]",null,null,null,null,null,null,"PCB111","PCB 111",null,null,null,null,null,null,null,null,"PCB 112","pg/L,ug/L","Chlorinated Biphenyl Congeners in Multiple Matrices by HRGC/HRMS (2010) [E1668C];Chlorinated Biphenyl Congeners in Multiple Matrices by HRGC/HRMS [E1668A];Organochlorine Pesticides and PCBs [E608];Organochlorine Pesticides by Gas Chromatography [SW8081A];Polychlorinated Biphenyls (PCBs) by Gas Chromatography [SW8082];Data Unavailable [DU]"]
[null,null,null,"E1640","Trace Elements in Water by Preconcentration and ICP-MS [E1640]",null,null,null,null,null,null,"PCB112","PCB 112",null,null,null,null,null,null,null,null,"PCB 113","pg/L,ug/L","Chlorinated Biphenyl Congeners in Multiple Matrices by HRGC/HRMS (2010) [E1668C];Chlorinated Biphenyl Congeners in Multiple Matrices by HRGC/HRMS [E1668A];Organochlorine Pesticides and PCBs [E608];Organochlorine Pesticides by Gas Chromatography [SW8081A];Polychlorinated Biphenyls (PCBs) by Gas Chromatography [SW8082];Data Unavailable [DU]"]
[null,null,null,"E619","Triazine Pesticides [E619]",null,null,null,null,null,null,"PCB113","PCB 113",null,null,null,null,null,null,null,null,"PCB 114","pg/L,ug/L","Chlorinated Biphenyl Congeners in Multiple Matrices by HRGC/HRMS (2010) [E1668C];Chlorinated Biphenyl Congeners in Multiple Matrices by HRGC/HRMS [E1668A];Organochlorine Pesticides and PCBs [E608];Organochlorine Pesticides by Gas Chromatography [SW8081A];Polychlorinated Biphenyls (PCBs) by Gas Chromatography [SW8082];Data Unavailable [DU]"]
[null,null,null,"E906.0","Tritium in Drinking Water [E906.0]",null,null,null,null,null,null,"PCB114","PCB 114",null,null,null,null,null,null,null,null,"PCB 115","pg/L,ug/L","Chlorinated Biphenyl Congeners in Multiple Matrices by HRGC/HRMS (2010) [E1668C];Chlorinated Biphenyl Congeners in Multiple Matrices by HRGC/HRMS [E1668A];Organochlorine Pesticides and PCBs [E608];Organochlorine Pesticides by Gas Chromatography [SW8081A];Polychlorinated Biphenyls (PCBs) by Gas Chromatography [SW8082];Data Unavailable [DU]"]
[null,null,null,"E180.1","Turbidity (Nephelometric) [E180.1]",null,null,null,null,null,null,"PCB115","PCB 115",null,null,null,null,null,null,null,null,"PCB 116","pg/L,ug/L","Chlorinated Biphenyl Congeners in Multiple Matrices by HRGC/HRMS (2010) [E1668C];Chlorinated Biphenyl Congeners in Multiple Matrices by HRGC/HRMS [E1668A];Organochlorine Pesticides and PCBs [E608];Organochlorine Pesticides by Gas Chromatography [SW8081A];Polychlorinated Biphenyls (PCBs) by Gas Chromatography [SW8082];Data Unavailable [DU]"]
[null,null,null,"E908.0","Uranium in Drinking Water - Radiochemical Method [E908.0]",null,null,null,null,null,null,"PCB116","PCB 116",null,null,null,null,null,null,null,null,"PCB 117","pg/L,ug/L","Chlorinated Biphenyl Congeners in Multiple Matrices by HRGC/HRMS (2010) [E1668C];Chlorinated Biphenyl Congeners in Multiple Matrices by HRGC/HRMS [E1668A];Organochlorine Pesticides and PCBs [E608];Organochlorine Pesticides by Gas Chromatography [SW8081A];Polychlorinated Biphenyls (PCBs) by Gas Chromatography [SW8082];Data Unavailable [DU]"]
[null,null,null,"USDA60","USDA Handbook No. 60: Exchangeable Sodium Percentage [USDA60]",null,null,null,null,null,null,"PCB117","PCB 117",null,null,null,null,null,null,null,null,"PCB 118","pg/L,ug/L","Chlorinated Biphenyl Congeners in Multiple Matrices by HRGC/HRMS (2010) [E1668C];Chlorinated Biphenyl Congeners in Multiple Matrices by HRGC/HRMS [E1668A];Organochlorine Pesticides and PCBs [E608];Organochlorine Pesticides by Gas Chromatography [SW8081A];Polychlorinated Biphenyls (PCBs) by Gas Chromatography [SW8082];Data Unavailable [DU]"]
[null,null,null,"E286.1","Vanadium (AA, Direct Aspiration) [E286.1]",null,null,null,null,null,null,"PCB118","PCB 118",null,null,null,null,null,null,null,null,"PCB 119","pg/L,ug/L","Chlorinated Biphenyl Congeners in Multiple Matrices by HRGC/HRMS (2010) [E1668C];Chlorinated Biphenyl Congeners in Multiple Matrices by HRGC/HRMS [E1668A];Organochlorine Pesticides and PCBs [E608];Organochlorine Pesticides by Gas Chromatography [SW8081A];Polychlorinated Biphenyls (PCBs) by Gas Chromatography [SW8082];Data Unavailable [DU]"]
[null,null,null,"SW7910","Vanadium (AA, Direct Aspiration) [SW7910]",null,null,null,null,null,null,"PCB119","PCB 119",null,null,null,null,null,null,null,null,"PCB 120","pg/L,ug/L","Chlorinated Biphenyl Congeners in Multiple Matrices by HRGC/HRMS (2010) [E1668C];Chlorinated Biphenyl Congeners in Multiple Matrices by HRGC/HRMS [E1668A];Organochlorine Pesticides and PCBs [E608];Organochlorine Pesticides by Gas Chromatography [SW8081A];Polychlorinated Biphenyls (PCBs) by Gas Chromatography [SW8082];Data Unavailable [DU]"]
[null,null,null,"E286.2","Vanadium (AA, Furnace Technique) [E286.2]",null,null,null,null,null,null,"PCB120","PCB 120",null,null,null,null,null,null,null,null,"PCB 121","pg/L,ug/L","Chlorinated Biphenyl Congeners in Multiple Matrices by HRGC/HRMS (2010) [E1668C];Chlorinated Biphenyl Congeners in Multiple Matrices by HRGC/HRMS [E1668A];Organochlorine Pesticides and PCBs [E608];Organochlorine Pesticides by Gas Chromatography [SW8081A];Polychlorinated Biphenyls (PCBs) by Gas Chromatography [SW8082];Data Unavailable [DU]"]
[null,null,null,"SW7911","Vanadium (AA, Furnace Technique) [SW7911]",null,null,null,null,null,null,"PCB121","PCB 121",null,null,null,null,null,null,null,null,"PCB 122","pg/L,ug/L","Chlorinated Biphenyl Congeners in Multiple Matrices by HRGC/HRMS (2010) [E1668C];Chlorinated Biphenyl Congeners in Multiple Matrices by HRGC/HRMS [E1668A];Organochlorine Pesticides and PCBs [E608];Organochlorine Pesticides by Gas Chromatography [SW8081A];Polychlorinated Biphenyls (PCBs) by Gas Chromatography [SW8082];Data Unavailable [DU]"]
[null,null,null,"8260FAB","VOCs by GC/MS Fuel Additives Plus BTEX [8260FAB]",null,null,null,null,null,null,"PCB122","PCB 122",null,null,null,null,null,null,null,null,"PCB 123","pg/L,ug/L","Chlorinated Biphenyl Congeners in Multiple Matrices by HRGC/HRMS (2010) [E1668C];Chlorinated Biphenyl Congeners in Multiple Matrices by HRGC/HRMS [E1668A];Organochlorine Pesticides and PCBs [E608];Organochlorine Pesticides by Gas Chromatography [SW8081A];Polychlorinated Biphenyls (PCBs) by Gas Chromatography [SW8082];Data Unavailable [DU]"]
[null,null,null,"8260BOS","Volatile Organic Compounds by GC/MS - Open Scan [8260BOS]",null,null,null,null,null,null,"PCB123","PCB 123",null,null,null,null,null,null,null,null,"PCB 124","pg/L,ug/L","Chlorinated Biphenyl Congeners in Multiple Matrices by HRGC/HRMS (2010) [E1668C];Chlorinated Biphenyl Congeners in Multiple Matrices by HRGC/HRMS [E1668A];Organochlorine Pesticides and PCBs [E608];Organochlorine Pesticides by Gas Chromatography [SW8081A];Polychlorinated Biphenyls (PCBs) by Gas Chromatography [SW8082];Data Unavailable [DU]"]
[null,null,null,"SW8240B","Volatile Organic Compounds by GC/MS [SW8240B]",null,null,null,null,null,null,"PCB124","PCB 124",null,null,null,null,null,null,null,null,"PCB 125","pg/L,ug/L","Chlorinated Biphenyl Congeners in Multiple Matrices by HRGC/HRMS (2010) [E1668C];Chlorinated Biphenyl Congeners in Multiple Matrices by HRGC/HRMS [E1668A];Organochlorine Pesticides and PCBs [E608];Organochlorine Pesticides by Gas Chromatography [SW8081A];Polychlorinated Biphenyls (PCBs) by Gas Chromatography [SW8082];Data Unavailable [DU]"]
[null,null,null,"SW8260B","Volatile Organic Compounds by GC/MS [SW8260B]",null,null,null,null,null,null,"PCB125","PCB 125",null,null,null,null,null,null,null,null,"PCB 126","pg/L,ug/L","Chlorinated Biphenyl Congeners in Multiple Matrices by HRGC/HRMS (2010) [E1668C];Chlorinated Biphenyl Congeners in Multiple Matrices by HRGC/HRMS [E1668A];Organochlorine Pesticides and PCBs [E608];Organochlorine Pesticides by Gas Chromatography [SW8081A];Polychlorinated Biphenyls (PCBs) by Gas Chromatography [SW8082];Data Unavailable [DU]"]
[null,null,null,"8260FA","Volatile Organic Compounds by GC/MS Fuel Additives [8260FA]",null,null,null,null,null,null,"PCB126","PCB 126",null,null,null,null,null,null,null,null,"PCB 127","pg/L,ug/L","Chlorinated Biphenyl Congeners in Multiple Matrices by HRGC/HRMS (2010) [E1668C];Chlorinated Biphenyl Congeners in Multiple Matrices by HRGC/HRMS [E1668A];Organochlorine Pesticides and PCBs [E608];Organochlorine Pesticides by Gas Chromatography [SW8081A];Polychlorinated Biphenyls (PCBs) by Gas Chromatography [SW8082];Data Unavailable [DU]"]
[null,null,null,"8260+OX","Volatile Organic Compounds by GC/MS plus Oxygenates [8260+OX]",null,null,null,null,null,null,"PCB127","PCB 127",null,null,null,null,null,null,null,null,"PCB 128","pg/L,ug/L","Chlorinated Biphenyl Congeners in Multiple Matrices by HRGC/HRMS (2010) [E1668C];Chlorinated Biphenyl Congeners in Multiple Matrices by HRGC/HRMS [E1668A];Organochlorine Pesticides and PCBs [E608];Organochlorine Pesticides by Gas Chromatography [SW8081A];Polychlorinated Biphenyls (PCBs) by Gas Chromatography [SW8082];Data Unavailable [DU]"]
[null,null,null,"8260SIM","Volatile Organic Compounds by GC/MS SIM [8260SIM]",null,null,null,null,null,null,"PCB128","PCB 128",null,null,null,null,null,null,null,null,"PCB 129","pg/L,ug/L","Chlorinated Biphenyl Congeners in Multiple Matrices by HRGC/HRMS (2010) [E1668C];Chlorinated Biphenyl Congeners in Multiple Matrices by HRGC/HRMS [E1668A];Organochlorine Pesticides and PCBs [E608];Organochlorine Pesticides by Gas Chromatography [SW8081A];Polychlorinated Biphenyls (PCBs) by Gas Chromatography [SW8082];Data Unavailable [DU]"]
[null,null,null,"E1624","Volatile Organic Compounds by Isotope Diltuion GC/MS [E1624]",null,null,null,null,null,null,"PCB129","PCB 129",null,null,null,null,null,null,null,null,"PCB 130","pg/L,ug/L","Chlorinated Biphenyl Congeners in Multiple Matrices by HRGC/HRMS (2010) [E1668C];Chlorinated Biphenyl Congeners in Multiple Matrices by HRGC/HRMS [E1668A];Organochlorine Pesticides and PCBs [E608];Organochlorine Pesticides by Gas Chromatography [SW8081A];Polychlorinated Biphenyls (PCBs) by Gas Chromatography [SW8082];Data Unavailable [DU]"]
[null,null,null,"E524.2","Volatile Organic Compounds by Purge and Trap [E524.2]",null,null,null,null,null,null,"PCB130","PCB 130",null,null,null,null,null,null,null,null,"PCB 131","pg/L,ug/L","Chlorinated Biphenyl Congeners in Multiple Matrices by HRGC/HRMS (2010) [E1668C];Chlorinated Biphenyl Congeners in Multiple Matrices by HRGC/HRMS [E1668A];Organochlorine Pesticides and PCBs [E608];Organochlorine Pesticides by Gas Chromatography [SW8081A];Polychlorinated Biphenyls (PCBs) by Gas Chromatography [SW8082];Data Unavailable [DU]"]
[null,null,null,"E624","Volatile Organic Compounds EPA Method 624 [E624]",null,null,null,null,null,null,"PCB131","PCB 131",null,null,null,null,null,null,null,null,"PCB 132","pg/L,ug/L","Chlorinated Biphenyl Congeners in Multiple Matrices by HRGC/HRMS (2010) [E1668C];Chlorinated Biphenyl Congeners in Multiple Matrices by HRGC/HRMS [E1668A];Organochlorine Pesticides and PCBs [E608];Organochlorine Pesticides by Gas Chromatography [SW8081A];Polychlorinated Biphenyls (PCBs) by Gas Chromatography [SW8082];Data Unavailable [DU]"]
[null,null,null,"E502.2","Volatile Organic Compounds in Water by Purge and Trap [E502.2]",null,null,null,null,null,null,"PCB132","PCB 132",null,null,null,null,null,null,null,null,"PCB 133","pg/L,ug/L","Chlorinated Biphenyl Congeners in Multiple Matrices by HRGC/HRMS (2010) [E1668C];Chlorinated Biphenyl Congeners in Multiple Matrices by HRGC/HRMS [E1668A];Organochlorine Pesticides and PCBs [E608];Organochlorine Pesticides by Gas Chromatography [SW8081A];Polychlorinated Biphenyls (PCBs) by Gas Chromatography [SW8082];Data Unavailable [DU]"]
[null,null,null,"SW8021F","Volatiles by GC/Gasoline Range Organics (SW8021B/8015) [SW8021F]",null,null,null,null,null,null,"PCB133","PCB 133",null,null,null,null,null,null,null,null,"PCB 134","pg/L,ug/L","Chlorinated Biphenyl Congeners in Multiple Matrices by HRGC/HRMS (2010) [E1668C];Chlorinated Biphenyl Congeners in Multiple Matrices by HRGC/HRMS [E1668A];Organochlorine Pesticides and PCBs [E608];Organochlorine Pesticides by Gas Chromatography [SW8081A];Polychlorinated Biphenyls (PCBs) by Gas Chromatography [SW8082];Data Unavailable [DU]"]
[null,null,null,"WBLACK","Walkley-Black Method, Organic Carbon (TOC) [WBLACK]",null,null,null,null,null,null,"PCB134","PCB 134",null,null,null,null,null,null,null,null,"PCB 135","pg/L,ug/L","Chlorinated Biphenyl Congeners in Multiple Matrices by HRGC/HRMS (2010) [E1668C];Chlorinated Biphenyl Congeners in Multiple Matrices by HRGC/HRMS [E1668A];Organochlorine Pesticides and PCBs [E608];Organochlorine Pesticides by Gas Chromatography [SW8081A];Polychlorinated Biphenyls (PCBs) by Gas Chromatography [SW8082];Data Unavailable [DU]"]
[null,null,null,"E289.1","Zinc (AA, Direct Aspiration) [E289.1]",null,null,null,null,null,null,"PCB135","PCB 135",null,null,null,null,null,null,null,null,"PCB 136","pg/L,ug/L","Chlorinated Biphenyl Congeners in Multiple Matrices by HRGC/HRMS (2010) [E1668C];Chlorinated Biphenyl Congeners in Multiple Matrices by HRGC/HRMS [E1668A];Organochlorine Pesticides and PCBs [E608];Organochlorine Pesticides by Gas Chromatography [SW8081A];Polychlorinated Biphenyls (PCBs) by Gas Chromatography [SW8082];Data Unavailable [DU]"]
[null,null,null,"SW7950","Zinc (AA, Direct Aspiration) [SW7950]",null,null,null,null,null,null,"PCB136","PCB 136",null,null,null,null,null,null,null,null,"PCB 137","pg/L,ug/L","Chlorinated Biphenyl Congeners in Multiple Matrices by HRGC/HRMS (2010) [E1668C];Chlorinated Biphenyl Congeners in Multiple Matrices by HRGC/HRMS [E1668A];Organochlorine Pesticides and PCBs [E608];Organochlorine Pesticides by Gas Chromatography [SW8081A];Polychlorinated Biphenyls (PCBs) by Gas Chromatography [SW8082];Data Unavailable [DU]"]
[null,null,null,"SW7951","Zinc (AA, Furnace Technique) [SW7951]",null,null,null,null,null,null,"PCB137","PCB 137",null,null,null,null,null,null,null,null,"PCB 138","pg/L,ug/L","Chlorinated Biphenyl Congeners in Multiple Matrices by HRGC/HRMS (2010) [E1668C];Chlorinated Biphenyl Congeners in Multiple Matrices by HRGC/HRMS [E1668A];Organochlorine Pesticides and PCBs [E608];Organochlorine Pesticides by Gas Chromatography [SW8081A];Polychlorinated Biphenyls (PCBs) by Gas Chromatography [SW8082];Data Unavailable [DU]"]
[null,null,null,"E289.2","Zinc (AA, Furnace) [E289.2]",null,null,null,null,null,null,"PCB138","PCB 138",null,null,null,null,null,null,null,null,"PCB 139","pg/L,ug/L","Chlorinated Biphenyl Congeners in Multiple Matrices by HRGC/HRMS (2010) [E1668C];Chlorinated Biphenyl Congeners in Multiple Matrices by HRGC/HRMS [E1668A];Organochlorine Pesticides and PCBs [E608];Organochlorine Pesticides by Gas Chromatography [SW8081A];Polychlorinated Biphenyls (PCBs) by Gas Chromatography [SW8082];Data Unavailable [DU]"]
[null,null,null,null,null,null,null,null,null,null,null,"PCB139","PCB 139",null,null,null,null,null,null,null,null,"PCB 140","pg/L,ug/L","Chlorinated Biphenyl Congeners in Multiple Matrices by HRGC/HRMS (2010) [E1668C];Chlorinated Biphenyl Congeners in Multiple Matrices by HRGC/HRMS [E1668A];Organochlorine Pesticides and PCBs [E608];Organochlorine Pesticides by Gas Chromatography [SW8081A];Polychlorinated Biphenyls (PCBs) by Gas Chromatography [SW8082];Data Unavailable [DU]"]
[null,null,null,null,null,null,null,null,null,null,null,"PCB140","PCB 140",null,null,null,null,null,null,null,null,"PCB 141","pg/L,ug/L","Chlorinated Biphenyl Congeners in Multiple Matrices by HRGC/HRMS (2010) [E1668C];Chlorinated Biphenyl Congeners in Multiple Matrices by HRGC/HRMS [E1668A];Organochlorine Pesticides and PCBs [E608];Organochlorine Pesticides by Gas Chromatography [SW8081A];Polychlorinated Biphenyls (PCBs) by Gas Chromatography [SW8082];Data Unavailable [DU]"]
[null,null,null,null,null,null,null,null,null,null,null,"PCB141","PCB 141",null,null,null,null,null,null,null,null,"PCB 142","pg/L,ug/L","Chlorinated Biphenyl Congeners in Multiple Matrices by HRGC/HRMS (2010) [E1668C];Chlorinated Biphenyl Congeners in Multiple Matrices by HRGC/HRMS [E1668A];Organochlorine Pesticides and PCBs [E608];Organochlorine Pesticides by Gas Chromatography [SW8081A];Polychlorinated Biphenyls (PCBs) by Gas Chromatography [SW8082];Data Unavailable [DU]"]
[null,null,null,null,null,null,null,null,null,null,null,"PCB142","PCB 142",null,null,null,null,null,null,null,null,"PCB 143","pg/L,ug/L","Chlorinated Biphenyl Congeners in Multiple Matrices by HRGC/HRMS (2010) [E1668C];Chlorinated Biphenyl Congeners in Multiple Matrices by HRGC/HRMS [E1668A];Organochlorine Pesticides and PCBs [E608];Organochlorine Pesticides by Gas Chromatography [SW8081A];Polychlorinated Biphenyls (PCBs) by Gas Chromatography [SW8082];Data Unavailable [DU]"]
[null,null,null,null,null,null,null,null,null,null,null,"PCB143","PCB 143",null,null,null,null,null,null,null,null,"PCB 144","pg/L,ug/L","Chlorinated Biphenyl Congeners in Multiple Matrices by HRGC/HRMS (2010) [E1668C];Chlorinated Biphenyl Congeners in Multiple Matrices by HRGC/HRMS [E1668A];Organochlorine Pesticides and PCBs [E608];Organochlorine Pesticides by Gas Chromatography [SW8081A];Polychlorinated Biphenyls (PCBs) by Gas Chromatography [SW8082];Data Unavailable [DU]"]
[null,null,null,null,null,null,null,null,null,null,null,"PCB144","PCB 144",null,null,null,null,null,null,null,null,"PCB 145","pg/L,ug/L","Chlorinated Biphenyl Congeners in Multiple Matrices by HRGC/HRMS (2010) [E1668C];Chlorinated Biphenyl Congeners in Multiple Matrices by HRGC/HRMS [E1668A];Organochlorine Pesticides and PCBs [E608];Organochlorine Pesticides by Gas Chromatography [SW8081A];Polychlorinated Biphenyls (PCBs) by Gas Chromatography [SW8082];Data Unavailable [DU]"]
[null,null,null,null,null,null,null,null,null,null,null,"PCB145","PCB 145",null,null,null,null,null,null,null,null,"PCB 146","pg/L,ug/L","Chlorinated Biphenyl Congeners in Multiple Matrices by HRGC/HRMS (2010) [E1668C];Chlorinated Biphenyl Congeners in Multiple Matrices by HRGC/HRMS [E1668A];Organochlorine Pesticides and PCBs [E608];Organochlorine Pesticides by Gas Chromatography [SW8081A];Polychlorinated Biphenyls (PCBs) by Gas Chromatography [SW8082];Data Unavailable [DU]"]
[null,null,null,null,null,null,null,null,null,null,null,"PCB146","PCB 146",null,null,null,null,null,null,null,null,"PCB 147","pg/L,ug/L","Chlorinated Biphenyl Congeners in Multiple Matrices by HRGC/HRMS (2010) [E1668C];Chlorinated Biphenyl Congeners in Multiple Matrices by HRGC/HRMS [E1668A];Organochlorine Pesticides and PCBs [E608];Organochlorine Pesticides by Gas Chromatography [SW8081A];Polychlorinated Biphenyls (PCBs) by Gas Chromatography [SW8082];Data Unavailable [DU]"]
[null,null,null,null,null,null,null,null,null,null,null,"PCB147","PCB 147",null,null,null,null,null,null,null,null,"PCB 148","pg/L,ug/L","Chlorinated Biphenyl Congeners in Multiple Matrices by HRGC/HRMS (2010) [E1668C];Chlorinated Biphenyl Congeners in Multiple Matrices by HRGC/HRMS [E1668A];Organochlorine Pesticides and PCBs [E608];Organochlorine Pesticides by Gas Chromatography [SW8081A];Polychlorinated Biphenyls (PCBs) by Gas Chromatography [SW8082];Data Unavailable [DU]"]
[null,null,null,null,null,null,null,null,null,null,null,"PCB148","PCB 148",null,null,null,null,null,null,null,null,"PCB 149","pg/L,ug/L","Chlorinated Biphenyl Congeners in Multiple Matrices by HRGC/HRMS (2010) [E1668C];Chlorinated Biphenyl Congeners in Multiple Matrices by HRGC/HRMS [E1668A];Organochlorine Pesticides and PCBs [E608];Organochlorine Pesticides by Gas Chromatography [SW8081A];Polychlorinated Biphenyls (PCBs) by Gas Chromatography [SW8082];Data Unavailable [DU]"]
[null,null,null,null,null,null,null,null,null,null,null,"PCB149","PCB 149",null,null,null,null,null,null,null,null,"PCB 150","pg/L,ug/L","Chlorinated Biphenyl Congeners in Multiple Matrices by HRGC/HRMS (2010) [E1668C];Chlorinated Biphenyl Congeners in Multiple Matrices by HRGC/HRMS [E1668A];Organochlorine Pesticides and PCBs [E608];Organochlorine Pesticides by Gas Chromatography [SW8081A];Polychlorinated Biphenyls (PCBs) by Gas Chromatography [SW8082];Data Unavailable [DU]"]
[null,null,null,null,null,null,null,null,null,null,null,"PCB150","PCB 150",null,null,null,null,null,null,null,null,"PCB 151","pg/L,ug/L","Chlorinated Biphenyl Congeners in Multiple Matrices by HRGC/HRMS (2010) [E1668C];Chlorinated Biphenyl Congeners in Multiple Matrices by HRGC/HRMS [E1668A];Organochlorine Pesticides and PCBs [E608];Organochlorine Pesticides by Gas Chromatography [SW8081A];Polychlorinated Biphenyls (PCBs) by Gas Chromatography [SW8082];Data Unavailable [DU]"]
[null,null,null,null,null,null,null,null,null,null,null,"PCB151","PCB 151",null,null,null,null,null,null,null,null,"PCB 152","pg/L,ug/L","Chlorinated Biphenyl Congeners in Multiple Matrices by HRGC/HRMS (2010) [E1668C];Chlorinated Biphenyl Congeners in Multiple Matrices by HRGC/HRMS [E1668A];Organochlorine Pesticides and PCBs [E608];Organochlorine Pesticides by Gas Chromatography [SW8081A];Polychlorinated Biphenyls (PCBs) by Gas Chromatography [SW8082];Data Unavailable [DU]"]
[null,null,null,null,null,null,null,null,null,null,null,"PCB152","PCB 152",null,null,null,null,null,null,null,null,"PCB 153","pg/L,ug/L","Chlorinated Biphenyl Congeners in Multiple Matrices by HRGC/HRMS (2010) [E1668C];Chlorinated Biphenyl Congeners in Multiple Matrices by HRGC/HRMS [E1668A];Organochlorine Pesticides and PCBs [E608];Organochlorine Pesticides by Gas Chromatography [SW8081A];Polychlorinated Biphenyls (PCBs) by Gas Chromatography [SW8082];Data Unavailable [DU]"]
[null,null,null,null,null,null,null,null,null,null,null,"PCB153","PCB 153",null,null,null,null,null,null,null,null,"PCB 154","pg/L,ug/L","Chlorinated Biphenyl Congeners in Multiple Matrices by HRGC/HRMS (2010) [E1668C];Chlorinated Biphenyl Congeners in Multiple Matrices by HRGC/HRMS [E1668A];Organochlorine Pesticides and PCBs [E608];Organochlorine Pesticides by Gas Chromatography [SW8081A];Polychlorinated Biphenyls (PCBs) by Gas Chromatography [SW8082];Data Unavailable [DU]"]
[null,null,null,null,null,null,null,null,null,null,null,"PCB154","PCB 154",null,null,null,null,null,null,null,null,"PCB 155","pg/L,ug/L","Chlorinated Biphenyl Congeners in Multiple Matrices by HRGC/HRMS (2010) [E1668C];Chlorinated Biphenyl Congeners in Multiple Matrices by HRGC/HRMS [E1668A];Organochlorine Pesticides and PCBs [E608];Organochlorine Pesticides by Gas Chromatography [SW8081A];Polychlorinated Biphenyls (PCBs) by Gas Chromatography [SW8082];Data Unavailable [DU]"]
[null,null,null,null,null,null,null,null,null,null,null,"PCB155","PCB 155",null,null,null,null,null,null,null,null,"PCB 156","pg/L,ug/L","Chlorinated Biphenyl Congeners in Multiple Matrices by HRGC/HRMS (2010) [E1668C];Chlorinated Biphenyl Congeners in Multiple Matrices by HRGC/HRMS [E1668A];Organochlorine Pesticides and PCBs [E608];Organochlorine Pesticides by Gas Chromatography [SW8081A];Polychlorinated Biphenyls (PCBs) by Gas Chromatography [SW8082];Data Unavailable [DU]"]
[null,null,null,null,null,null,null,null,null,null,null,"PCB156","PCB 156",null,null,null,null,null,null,null,null,"PCB 157","pg/L,ug/L","Chlorinated Biphenyl Congeners in Multiple Matrices by HRGC/HRMS (2010) [E1668C];Chlorinated Biphenyl Congeners in Multiple Matrices by HRGC/HRMS [E1668A];Organochlorine Pesticides and PCBs [E608];Organochlorine Pesticides by Gas Chromatography [SW8081A];Polychlorinated Biphenyls (PCBs) by Gas Chromatography [SW8082];Data Unavailable [DU]"]
[null,null,null,null,null,null,null,null,null,null,null,"PCB157","PCB 157",null,null,null,null,null,null,null,null,"PCB 158","pg/L,ug/L","Chlorinated Biphenyl Congeners in Multiple Matrices by HRGC/HRMS (2010) [E1668C];Chlorinated Biphenyl Congeners in Multiple Matrices by HRGC/HRMS [E1668A];Organochlorine Pesticides and PCBs [E608];Organochlorine Pesticides by Gas Chromatography [SW8081A];Polychlorinated Biphenyls (PCBs) by Gas Chromatography [SW8082];Data Unavailable [DU]"]
[null,null,null,null,null,null,null,null,null,null,null,"PCB158","PCB 158",null,null,null,null,null,null,null,null,"PCB 159","pg/L,ug/L","Chlorinated Biphenyl Congeners in Multiple Matrices by HRGC/HRMS (2010) [E1668C];Chlorinated Biphenyl Congeners in Multiple Matrices by HRGC/HRMS [E1668A];Organochlorine Pesticides and PCBs [E608];Organochlorine Pesticides by Gas Chromatography [SW8081A];Polychlorinated Biphenyls (PCBs) by Gas Chromatography [SW8082];Data Unavailable [DU]"]
[null,null,null,null,null,null,null,null,null,null,null,"PCB159","PCB 159",null,null,null,null,null,null,null,null,"PCB 160","pg/L,ug/L","Chlorinated Biphenyl Congeners in Multiple Matrices by HRGC/HRMS (2010) [E1668C];Chlorinated Biphenyl Congeners in Multiple Matrices by HRGC/HRMS [E1668A];Organochlorine Pesticides and PCBs [E608];Organochlorine Pesticides by Gas Chromatography [SW8081A];Polychlorinated Biphenyls (PCBs) by Gas Chromatography [SW8082];Data Unavailable [DU]"]
[null,null,null,null,null,null,null,null,null,null,null,"PCB160","PCB 160",null,null,null,null,null,null,null,null,"PCB 161","pg/L,ug/L","Chlorinated Biphenyl Congeners in Multiple Matrices by HRGC/HRMS (2010) [E1668C];Chlorinated Biphenyl Congeners in Multiple Matrices by HRGC/HRMS [E1668A];Organochlorine Pesticides and PCBs [E608];Organochlorine Pesticides by Gas Chromatography [SW8081A];Polychlorinated Biphenyls (PCBs) by Gas Chromatography [SW8082];Data Unavailable [DU]"]
[null,null,null,null,null,null,null,null,null,null,null,"PCB161","PCB 161",null,null,null,null,null,null,null,null,"PCB 162","pg/L,ug/L","Chlorinated Biphenyl Congeners in Multiple Matrices by HRGC/HRMS (2010) [E1668C];Chlorinated Biphenyl Congeners in Multiple Matrices by HRGC/HRMS [E1668A];Organochlorine Pesticides and PCBs [E608];Organochlorine Pesticides by Gas Chromatography [SW8081A];Polychlorinated Biphenyls (PCBs) by Gas Chromatography [SW8082];Data Unavailable [DU]"]
[null,null,null,null,null,null,null,null,null,null,null,"PCB162","PCB 162",null,null,null,null,null,null,null,null,"PCB 163","pg/L,ug/L","Chlorinated Biphenyl Congeners in Multiple Matrices by HRGC/HRMS (2010) [E1668C];Chlorinated Biphenyl Congeners in Multiple Matrices by HRGC/HRMS [E1668A];Organochlorine Pesticides and PCBs [E608];Organochlorine Pesticides by Gas Chromatography [SW8081A];Polychlorinated Biphenyls (PCBs) by Gas Chromatography [SW8082];Data Unavailable [DU]"]
[null,null,null,null,null,null,null,null,null,null,null,"PCB163","PCB 163",null,null,null,null,null,null,null,null,"PCB 164","pg/L,ug/L","Chlorinated Biphenyl Congeners in Multiple Matrices by HRGC/HRMS (2010) [E1668C];Chlorinated Biphenyl Congeners in Multiple Matrices by HRGC/HRMS [E1668A];Organochlorine Pesticides and PCBs [E608];Organochlorine Pesticides by Gas Chromatography [SW8081A];Polychlorinated Biphenyls (PCBs) by Gas Chromatography [SW8082];Data Unavailable [DU]"]
[null,null,null,null,null,null,null,null,null,null,null,"PCB164","PCB 164",null,null,null,null,null,null,null,null,"PCB 165","pg/L,ug/L","Chlorinated Biphenyl Congeners in Multiple Matrices by HRGC/HRMS (2010) [E1668C];Chlorinated Biphenyl Congeners in Multiple Matrices by HRGC/HRMS [E1668A];Organochlorine Pesticides and PCBs [E608];Organochlorine Pesticides by Gas Chromatography [SW8081A];Polychlorinated Biphenyls (PCBs) by Gas Chromatography [SW8082];Data Unavailable [DU]"]
[null,null,null,null,null,null,null,null,null,null,null,"PCB165","PCB 165",null,null,null,null,null,null,null,null,"PCB 166","pg/L,ug/L","Chlorinated Biphenyl Congeners in Multiple Matrices by HRGC/HRMS (2010) [E1668C];Chlorinated Biphenyl Congeners in Multiple Matrices by HRGC/HRMS [E1668A];Organochlorine Pesticides and PCBs [E608];Organochlorine Pesticides by Gas Chromatography [SW8081A];Polychlorinated Biphenyls (PCBs) by Gas Chromatography [SW8082];Data Unavailable [DU]"]
[null,null,null,null,null,null,null,null,null,null,null,"PCB166","PCB 166",null,null,null,null,null,null,null,null,"PCB 167","pg/L,ug/L","Chlorinated Biphenyl Congeners in Multiple Matrices by HRGC/HRMS (2010) [E1668C];Chlorinated Biphenyl Congeners in Multiple Matrices by HRGC/HRMS [E1668A];Organochlorine Pesticides and PCBs [E608];Organochlorine Pesticides by Gas Chromatography [SW8081A];Polychlorinated Biphenyls (PCBs) by Gas Chromatography [SW8082];Data Unavailable [DU]"]
[null,null,null,null,null,null,null,null,null,null,null,"PCB167","PCB 167",null,null,null,null,null,null,null,null,"PCB 168","pg/L,ug/L","Chlorinated Biphenyl Congeners in Multiple Matrices by HRGC/HRMS (2010) [E1668C];Chlorinated Biphenyl Congeners in Multiple Matrices by HRGC/HRMS [E1668A];Organochlorine Pesticides and PCBs [E608];Organochlorine Pesticides by Gas Chromatography [SW8081A];Polychlorinated Biphenyls (PCBs) by Gas Chromatography [SW8082];Data Unavailable [DU]"]
[null,null,null,null,null,null,null,null,null,null,null,"PCB168","PCB 168",null,null,null,null,null,null,null,null,"PCB 169","pg/L,ug/L","Chlorinated Biphenyl Congeners in Multiple Matrices by HRGC/HRMS (2010) [E1668C];Chlorinated Biphenyl Congeners in Multiple Matrices by HRGC/HRMS [E1668A];Organochlorine Pesticides and PCBs [E608];Organochlorine Pesticides by Gas Chromatography [SW8081A];Polychlorinated Biphenyls (PCBs) by Gas Chromatography [SW8082];Data Unavailable [DU]"]
[null,null,null,null,null,null,null,null,null,null,null,"PCB169","PCB 169",null,null,null,null,null,null,null,null,"PCB 170","pg/L,ug/L","Chlorinated Biphenyl Congeners in Multiple Matrices by HRGC/HRMS (2010) [E1668C];Chlorinated Biphenyl Congeners in Multiple Matrices by HRGC/HRMS [E1668A];Organochlorine Pesticides and PCBs [E608];Organochlorine Pesticides by Gas Chromatography [SW8081A];Polychlorinated Biphenyls (PCBs) by Gas Chromatography [SW8082];Data Unavailable [DU]"]
[null,null,null,null,null,null,null,null,null,null,null,"PCB170","PCB 170",null,null,null,null,null,null,null,null,"PCB 171","pg/L,ug/L","Chlorinated Biphenyl Congeners in Multiple Matrices by HRGC/HRMS (2010) [E1668C];Chlorinated Biphenyl Congeners in Multiple Matrices by HRGC/HRMS [E1668A];Organochlorine Pesticides and PCBs [E608];Organochlorine Pesticides by Gas Chromatography [SW8081A];Polychlorinated Biphenyls (PCBs) by Gas Chromatography [SW8082];Data Unavailable [DU]"]
[null,null,null,null,null,null,null,null,null,null,null,"PCB171","PCB 171",null,null,null,null,null,null,null,null,"PCB 172","pg/L,ug/L","Chlorinated Biphenyl Congeners in Multiple Matrices by HRGC/HRMS (2010) [E1668C];Chlorinated Biphenyl Congeners in Multiple Matrices by HRGC/HRMS [E1668A];Organochlorine Pesticides and PCBs [E608];Organochlorine Pesticides by Gas Chromatography [SW8081A];Polychlorinated Biphenyls (PCBs) by Gas Chromatography [SW8082];Data Unavailable [DU]"]
[null,null,null,null,null,null,null,null,null,null,null,"PCB172","PCB 172",null,null,null,null,null,null,null,null,"PCB 173","pg/L,ug/L","Chlorinated Biphenyl Congeners in Multiple Matrices by HRGC/HRMS (2010) [E1668C];Chlorinated Biphenyl Congeners in Multiple Matrices by HRGC/HRMS [E1668A];Organochlorine Pesticides and PCBs [E608];Organochlorine Pesticides by Gas Chromatography [SW8081A];Polychlorinated Biphenyls (PCBs) by Gas Chromatography [SW8082];Data Unavailable [DU]"]
[null,null,null,null,null,null,null,null,null,null,null,"PCB173","PCB 173",null,null,null,null,null,null,null,null,"PCB 174","pg/L,ug/L","Chlorinated Biphenyl Congeners in Multiple Matrices by HRGC/HRMS (2010) [E1668C];Chlorinated Biphenyl Congeners in Multiple Matrices by HRGC/HRMS [E1668A];Organochlorine Pesticides and PCBs [E608];Organochlorine Pesticides by Gas Chromatography [SW8081A];Polychlorinated Biphenyls (PCBs) by Gas Chromatography [SW8082];Data Unavailable [DU]"]
[null,null,null,null,null,null,null,null,null,null,null,"PCB174","PCB 174",null,null,null,null,null,null,null,null,"PCB 175","pg/L,ug/L","Chlorinated Biphenyl Congeners in Multiple Matrices by HRGC/HRMS (2010) [E1668C];Chlorinated Biphenyl Congeners in Multiple Matrices by HRGC/HRMS [E1668A];Organochlorine Pesticides and PCBs [E608];Organochlorine Pesticides by Gas Chromatography [SW8081A];Polychlorinated Biphenyls (PCBs) by Gas Chromatography [SW8082];Data Unavailable [DU]"]
[null,null,null,null,null,null,null,null,null,null,null,"PCB175","PCB 175",null,null,null,null,null,null,null,null,"PCB 176","pg/L,ug/L","Chlorinated Biphenyl Congeners in Multiple Matrices by HRGC/HRMS (2010) [E1668C];Chlorinated Biphenyl Congeners in Multiple Matrices by HRGC/HRMS [E1668A];Organochlorine Pesticides and PCBs [E608];Organochlorine Pesticides by Gas Chromatography [SW8081A];Polychlorinated Biphenyls (PCBs) by Gas Chromatography [SW8082];Data Unavailable [DU]"]
[null,null,null,null,null,null,null,null,null,null,null,"PCB176","PCB 176",null,null,null,null,null,null,null,null,"PCB 177","pg/L,ug/L","Chlorinated Biphenyl Congeners in Multiple Matrices by HRGC/HRMS (2010) [E1668C];Chlorinated Biphenyl Congeners in Multiple Matrices by HRGC/HRMS [E1668A];Organochlorine Pesticides and PCBs [E608];Organochlorine Pesticides by Gas Chromatography [SW8081A];Polychlorinated Biphenyls (PCBs) by Gas Chromatography [SW8082];Data Unavailable [DU]"]
[null,null,null,null,null,null,null,null,null,null,null,"PCB177","PCB 177",null,null,null,null,null,null,null,null,"PCB 178","pg/L,ug/L","Chlorinated Biphenyl Congeners in Multiple Matrices by HRGC/HRMS (2010) [E1668C];Chlorinated Biphenyl Congeners in Multiple Matrices by HRGC/HRMS [E1668A];Organochlorine Pesticides and PCBs [E608];Organochlorine Pesticides by Gas Chromatography [SW8081A];Polychlorinated Biphenyls (PCBs) by Gas Chromatography [SW8082];Data Unavailable [DU]"]
[null,null,null,null,null,null,null,null,null,null,null,"PCB178","PCB 178",null,null,null,null,null,null,null,null,"PCB 179","pg/L,ug/L","Chlorinated Biphenyl Congeners in Multiple Matrices by HRGC/HRMS (2010) [E1668C];Chlorinated Biphenyl Congeners in Multiple Matrices by HRGC/HRMS [E1668A];Organochlorine Pesticides and PCBs [E608];Organochlorine Pesticides by Gas Chromatography [SW8081A];Polychlorinated Biphenyls (PCBs) by Gas Chromatography [SW8082];Data Unavailable [DU]"]
[null,null,null,null,null,null,null,null,null,null,null,"PCB179","PCB 179",null,null,null,null,null,null,null,null,"PCB 180","pg/L,ug/L","Chlorinated Biphenyl Congeners in Multiple Matrices by HRGC/HRMS (2010) [E1668C];Chlorinated Biphenyl Congeners in Multiple Matrices by HRGC/HRMS [E1668A];Organochlorine Pesticides and PCBs [E608];Organochlorine Pesticides by Gas Chromatography [SW8081A];Polychlorinated Biphenyls (PCBs) by Gas Chromatography [SW8082];Data Unavailable [DU]"]
[null,null,null,null,null,null,null,null,null,null,null,"PCB180","PCB 180",null,null,null,null,null,null,null,null,"PCB 181","pg/L,ug/L","Chlorinated Biphenyl Congeners in Multiple Matrices by HRGC/HRMS (2010) [E1668C];Chlorinated Biphenyl Congeners in Multiple Matrices by HRGC/HRMS [E1668A];Organochlorine Pesticides and PCBs [E608];Organochlorine Pesticides by Gas Chromatography [SW8081A];Polychlorinated Biphenyls (PCBs) by Gas Chromatography [SW8082];Data Unavailable [DU]"]
[null,null,null,null,null,null,null,null,null,null,null,"PCB181","PCB 181",null,null,null,null,null,null,null,null,"PCB 182","pg/L,ug/L","Chlorinated Biphenyl Congeners in Multiple Matrices by HRGC/HRMS (2010) [E1668C];Chlorinated Biphenyl Congeners in Multiple Matrices by HRGC/HRMS [E1668A];Organochlorine Pesticides and PCBs [E608];Organochlorine Pesticides by Gas Chromatography [SW8081A];Polychlorinated Biphenyls (PCBs) by Gas Chromatography [SW8082];Data Unavailable [DU]"]
[null,null,null,null,null,null,null,null,null,null,null,"PCB182","PCB 182",null,null,null,null,null,null,null,null,"PCB 183","pg/L,ug/L","Chlorinated Biphenyl Congeners in Multiple Matrices by HRGC/HRMS (2010) [E1668C];Chlorinated Biphenyl Congeners in Multiple Matrices by HRGC/HRMS [E1668A];Organochlorine Pesticides and PCBs [E608];Organochlorine Pesticides by Gas Chromatography [SW8081A];Polychlorinated Biphenyls (PCBs) by Gas Chromatography [SW8082];Data Unavailable [DU]"]
[null,null,null,null,null,null,null,null,null,null,null,"PCB183","PCB 183",null,null,null,null,null,null,null,null,"PCB 184","pg/L,ug/L","Chlorinated Biphenyl Congeners in Multiple Matrices by HRGC/HRMS (2010) [E1668C];Chlorinated Biphenyl Congeners in Multiple Matrices by HRGC/HRMS [E1668A];Organochlorine Pesticides and PCBs [E608];Organochlorine Pesticides by Gas Chromatography [SW8081A];Polychlorinated Biphenyls (PCBs) by Gas Chromatography [SW8082];Data Unavailable [DU]"]
[null,null,null,null,null,null,null,null,null,null,null,"PCB184","PCB 184",null,null,null,null,null,null,null,null,"PCB 185","pg/L,ug/L","Chlorinated Biphenyl Congeners in Multiple Matrices by HRGC/HRMS (2010) [E1668C];Chlorinated Biphenyl Congeners in Multiple Matrices by HRGC/HRMS [E1668A];Organochlorine Pesticides and PCBs [E608];Organochlorine Pesticides by Gas Chromatography [SW8081A];Polychlorinated Biphenyls (PCBs) by Gas Chromatography [SW8082];Data Unavailable [DU]"]
[null,null,null,null,null,null,null,null,null,null,null,"PCB185","PCB 185",null,null,null,null,null,null,null,null,"PCB 186","pg/L,ug/L","Chlorinated Biphenyl Congeners in Multiple Matrices by HRGC/HRMS (2010) [E1668C];Chlorinated Biphenyl Congeners in Multiple Matrices by HRGC/HRMS [E1668A];Organochlorine Pesticides and PCBs [E608];Organochlorine Pesticides by Gas Chromatography [SW8081A];Polychlorinated Biphenyls (PCBs) by Gas Chromatography [SW8082];Data Unavailable [DU]"]
[null,null,null,null,null,null,null,null,null,null,null,"PCB186","PCB 186",null,null,null,null,null,null,null,null,"PCB 187","pg/L,ug/L","Chlorinated Biphenyl Congeners in Multiple Matrices by HRGC/HRMS (2010) [E1668C];Chlorinated Biphenyl Congeners in Multiple Matrices by HRGC/HRMS [E1668A];Organochlorine Pesticides and PCBs [E608];Organochlorine Pesticides by Gas Chromatography [SW8081A];Polychlorinated Biphenyls (PCBs) by Gas Chromatography [SW8082];Data Unavailable [DU]"]
[null,null,null,null,null,null,null,null,null,null,null,"PCB187","PCB 187",null,null,null,null,null,null,null,null,"PCB 188","pg/L,ug/L","Chlorinated Biphenyl Congeners in Multiple Matrices by HRGC/HRMS (2010) [E1668C];Chlorinated Biphenyl Congeners in Multiple Matrices by HRGC/HRMS [E1668A];Organochlorine Pesticides and PCBs [E608];Organochlorine Pesticides by Gas Chromatography [SW8081A];Polychlorinated Biphenyls (PCBs) by Gas Chromatography [SW8082];Data Unavailable [DU]"]
[null,null,null,null,null,null,null,null,null,null,null,"PCB188","PCB 188",null,null,null,null,null,null,null,null,"PCB 189","pg/L,ug/L","Chlorinated Biphenyl Congeners in Multiple Matrices by HRGC/HRMS (2010) [E1668C];Chlorinated Biphenyl Congeners in Multiple Matrices by HRGC/HRMS [E1668A];Organochlorine Pesticides and PCBs [E608];Organochlorine Pesticides by Gas Chromatography [SW8081A];Polychlorinated Biphenyls (PCBs) by Gas Chromatography [SW8082];Data Unavailable [DU]"]
[null,null,null,null,null,null,null,null,null,null,null,"PCB189","PCB 189",null,null,null,null,null,null,null,null,"PCB 190","pg/L,ug/L","Chlorinated Biphenyl Congeners in Multiple Matrices by HRGC/HRMS (2010) [E1668C];Chlorinated Biphenyl Congeners in Multiple Matrices by HRGC/HRMS [E1668A];Organochlorine Pesticides and PCBs [E608];Organochlorine Pesticides by Gas Chromatography [SW8081A];Polychlorinated Biphenyls (PCBs) by Gas Chromatography [SW8082];Data Unavailable [DU]"]
[null,null,null,null,null,null,null,null,null,null,null,"PCB190","PCB 190",null,null,null,null,null,null,null,null,"PCB 191","pg/L,ug/L","Chlorinated Biphenyl Congeners in Multiple Matrices by HRGC/HRMS (2010) [E1668C];Chlorinated Biphenyl Congeners in Multiple Matrices by HRGC/HRMS [E1668A];Organochlorine Pesticides and PCBs [E608];Organochlorine Pesticides by Gas Chromatography [SW8081A];Polychlorinated Biphenyls (PCBs) by Gas Chromatography [SW8082];Data Unavailable [DU]"]
[null,null,null,null,null,null,null,null,null,null,null,"PCB191","PCB 191",null,null,null,null,null,null,null,null,"PCB 192","pg/L,ug/L","Chlorinated Biphenyl Congeners in Multiple Matrices by HRGC/HRMS (2010) [E1668C];Chlorinated Biphenyl Congeners in Multiple Matrices by HRGC/HRMS [E1668A];Organochlorine Pesticides and PCBs [E608];Organochlorine Pesticides by Gas Chromatography [SW8081A];Polychlorinated Biphenyls (PCBs) by Gas Chromatography [SW8082];Data Unavailable [DU]"]
[null,null,null,null,null,null,null,null,null,null,null,"PCB192","PCB 192",null,null,null,null,null,null,null,null,"PCB 193","pg/L,ug/L","Chlorinated Biphenyl Congeners in Multiple Matrices by HRGC/HRMS (2010) [E1668C];Chlorinated Biphenyl Congeners in Multiple Matrices by HRGC/HRMS [E1668A];Organochlorine Pesticides and PCBs [E608];Organochlorine Pesticides by Gas Chromatography [SW8081A];Polychlorinated Biphenyls (PCBs) by Gas Chromatography [SW8082];Data Unavailable [DU]"]
[null,null,null,null,null,null,null,null,null,null,null,"PCB193","PCB 193",null,null,null,null,null,null,null,null,"PCB 194","pg/L,ug/L","Chlorinated Biphenyl Congeners in Multiple Matrices by HRGC/HRMS (2010) [E1668C];Chlorinated Biphenyl Congeners in Multiple Matrices by HRGC/HRMS [E1668A];Organochlorine Pesticides and PCBs [E608];Organochlorine Pesticides by Gas Chromatography [SW8081A];Polychlorinated Biphenyls (PCBs) by Gas Chromatography [SW8082];Data Unavailable [DU]"]
[null,null,null,null,null,null,null,null,null,null,null,"PCB194","PCB 194",null,null,null,null,null,null,null,null,"PCB 195","pg/L,ug/L","Chlorinated Biphenyl Congeners in Multiple Matrices by HRGC/HRMS (2010) [E1668C];Chlorinated Biphenyl Congeners in Multiple Matrices by HRGC/HRMS [E1668A];Organochlorine Pesticides and PCBs [E608];Organochlorine Pesticides by Gas Chromatography [SW8081A];Polychlorinated Biphenyls (PCBs) by Gas Chromatography [SW8082];Data Unavailable [DU]"]
[null,null,null,null,null,null,null,null,null,null,null,"PCB195","PCB 195",null,null,null,null,null,null,null,null,"PCB 196","pg/L,ug/L","Chlorinated Biphenyl Congeners in Multiple Matrices by HRGC/HRMS (2010) [E1668C];Chlorinated Biphenyl Congeners in Multiple Matrices by HRGC/HRMS [E1668A];Organochlorine Pesticides and PCBs [E608];Organochlorine Pesticides by Gas Chromatography [SW8081A];Polychlorinated Biphenyls (PCBs) by Gas Chromatography [SW8082];Data Unavailable [DU]"]
[null,null,null,null,null,null,null,null,null,null,null,"PCB196","PCB 196",null,null,null,null,null,null,null,null,"PCB 197","pg/L,ug/L","Chlorinated Biphenyl Congeners in Multiple Matrices by HRGC/HRMS (2010) [E1668C];Chlorinated Biphenyl Congeners in Multiple Matrices by HRGC/HRMS [E1668A];Organochlorine Pesticides and PCBs [E608];Organochlorine Pesticides by Gas Chromatography [SW8081A];Polychlorinated Biphenyls (PCBs) by Gas Chromatography [SW8082];Data Unavailable [DU]"]
[null,null,null,null,null,null,null,null,null,null,null,"PCB197","PCB 197",null,null,null,null,null,null,null,null,"PCB 198","pg/L,ug/L","Chlorinated Biphenyl Congeners in Multiple Matrices by HRGC/HRMS (2010) [E1668C];Chlorinated Biphenyl Congeners in Multiple Matrices by HRGC/HRMS [E1668A];Organochlorine Pesticides and PCBs [E608];Organochlorine Pesticides by Gas Chromatography [SW8081A];Polychlorinated Biphenyls (PCBs) by Gas Chromatography [SW8082];Data Unavailable [DU]"]
[null,null,null,null,null,null,null,null,null,null,null,"PCB198","PCB 198",null,null,null,null,null,null,null,null,"PCB 199","pg/L,ug/L","Chlorinated Biphenyl Congeners in Multiple Matrices by HRGC/HRMS (2010) [E1668C];Chlorinated Biphenyl Congeners in Multiple Matrices by HRGC/HRMS [E1668A];Organochlorine Pesticides and PCBs [E608];Organochlorine Pesticides by Gas Chromatography [SW8081A];Polychlorinated Biphenyls (PCBs) by Gas Chromatography [SW8082];Data Unavailable [DU]"]
[null,null,null,null,null,null,null,null,null,null,null,"PCB199","PCB 199",null,null,null,null,null,null,null,null,"PCB 200","pg/L,ug/L","Chlorinated Biphenyl Congeners in Multiple Matrices by HRGC/HRMS (2010) [E1668C];Chlorinated Biphenyl Congeners in Multiple Matrices by HRGC/HRMS [E1668A];Organochlorine Pesticides and PCBs [E608];Organochlorine Pesticides by Gas Chromatography [SW8081A];Polychlorinated Biphenyls (PCBs) by Gas Chromatography [SW8082];Data Unavailable [DU]"]
[null,null,null,null,null,null,null,null,null,null,null,"PCB200","PCB 200",null,null,null,null,null,null,null,null,"PCB 201","pg/L,ug/L","Chlorinated Biphenyl Congeners in Multiple Matrices by HRGC/HRMS (2010) [E1668C];Chlorinated Biphenyl Congeners in Multiple Matrices by HRGC/HRMS [E1668A];Organochlorine Pesticides and PCBs [E608];Organochlorine Pesticides by Gas Chromatography [SW8081A];Polychlorinated Biphenyls (PCBs) by Gas Chromatography [SW8082];Data Unavailable [DU]"]
[null,null,null,null,null,null,null,null,null,null,null,"PCB201","PCB 201",null,null,null,null,null,null,null,null,"PCB 202","pg/L,ug/L","Chlorinated Biphenyl Congeners in Multiple Matrices by HRGC/HRMS (2010) [E1668C];Chlorinated Biphenyl Congeners in Multiple Matrices by HRGC/HRMS [E1668A];Organochlorine Pesticides and PCBs [E608];Organochlorine Pesticides by Gas Chromatography [SW8081A];Polychlorinated Biphenyls (PCBs) by Gas Chromatography [SW8082];Data Unavailable [DU]"]
[null,null,null,null,null,null,null,null,null,null,null,"PCB202","PCB 202",null,null,null,null,null,null,null,null,"PCB 203","pg/L,ug/L","Chlorinated Biphenyl Congeners in Multiple Matrices by HRGC/HRMS (2010) [E1668C];Chlorinated Biphenyl Congeners in Multiple Matrices by HRGC/HRMS [E1668A];Organochlorine Pesticides and PCBs [E608];Organochlorine Pesticides by Gas Chromatography [SW8081A];Polychlorinated Biphenyls (PCBs) by Gas Chromatography [SW8082];Data Unavailable [DU]"]
[null,null,null,null,null,null,null,null,null,null,null,"PCB203","PCB 203",null,null,null,null,null,null,null,null,"PCB 204","pg/L,ug/L","Chlorinated Biphenyl Congeners in Multiple Matrices by HRGC/HRMS (2010) [E1668C];Chlorinated Biphenyl Congeners in Multiple Matrices by HRGC/HRMS [E1668A];Organochlorine Pesticides and PCBs [E608];Organochlorine Pesticides by Gas Chromatography [SW8081A];Polychlorinated Biphenyls (PCBs) by Gas Chromatography [SW8082];Data Unavailable [DU]"]
[null,null,null,null,null,null,null,null,null,null,null,"PCB204","PCB 204",null,null,null,null,null,null,null,null,"PCB 205","pg/L,ug/L","Chlorinated Biphenyl Congeners in Multiple Matrices by HRGC/HRMS (2010) [E1668C];Chlorinated Biphenyl Congeners in Multiple Matrices by HRGC/HRMS [E1668A];Organochlorine Pesticides and PCBs [E608];Organochlorine Pesticides by Gas Chromatography [SW8081A];Polychlorinated Biphenyls (PCBs) by Gas Chromatography [SW8082];Data Unavailable [DU]"]
[null,null,null,null,null,null,null,null,null,null,null,"PCB205","PCB 205",null,null,null,null,null,null,null,null,"PCB 206","pg/L,ug/L","Chlorinated Biphenyl Congeners in Multiple Matrices by HRGC/HRMS (2010) [E1668C];Chlorinated Biphenyl Congeners in Multiple Matrices by HRGC/HRMS [E1668A];Organochlorine Pesticides and PCBs [E608];Organochlorine Pesticides by Gas Chromatography [SW8081A];Polychlorinated Biphenyls (PCBs) by Gas Chromatography [SW8082];Data Unavailable [DU]"]
[null,null,null,null,null,null,null,null,null,null,null,"PCB206","PCB 206",null,null,null,null,null,null,null,null,"PCB 207","pg/L,ug/L","Chlorinated Biphenyl Congeners in Multiple Matrices by HRGC/HRMS (2010) [E1668C];Chlorinated Biphenyl Congeners in Multiple Matrices by HRGC/HRMS [E1668A];Organochlorine Pesticides and PCBs [E608];Organochlorine Pesticides by Gas Chromatography [SW8081A];Polychlorinated Biphenyls (PCBs) by Gas Chromatography [SW8082];Data Unavailable [DU]"]
[null,null,null,null,null,null,null,null,null,null,null,"PCB207","PCB 207",null,null,null,null,null,null,null,null,"PCB 208","pg/L,ug/L","Chlorinated Biphenyl Congeners in Multiple Matrices by HRGC/HRMS (2010) [E1668C];Chlorinated Biphenyl Congeners in Multiple Matrices by HRGC/HRMS [E1668A];Organochlorine Pesticides and PCBs [E608];Organochlorine Pesticides by Gas Chromatography [SW8081A];Polychlorinated Biphenyls (PCBs) by Gas Chromatography [SW8082];Data Unavailable [DU]"]
[null,null,null,null,null,null,null,null,null,null,null,"PCB208","PCB 208",null,null,null,null,null,null,null,null,"PCB 209","pg/L,ug/L","Chlorinated Biphenyl Congeners in Multiple Matrices by HRGC/HRMS (2010) [E1668C];Chlorinated Biphenyl Congeners in Multiple Matrices by HRGC/HRMS [E1668A];Organochlorine Pesticides and PCBs [E608];Organochlorine Pesticides and PCBs by GC/HSD [E608.3];Organochlorine Pesticides by Gas Chromatography [SW8081A];Polychlorinated Biphenyls (PCBs) by Gas Chromatography [SW8082];Data Unavailable [DU]"]
[null,null,null,null,null,null,null,null,null,null,null,"CL10BZ2","PCB 209",null,null,null,null,null,null,null,null,"PCB-1016","ug/L,ng/L,mg/L,lb/day,mg/kg,ug/kg","Chlorinated Pesticides in Groundwater [E508];Extractable Priority Pollutants [E625];Extractable Priority Pollutants by GC/MS SIM [E625SIM];GC/MS SIM Method [SIM];HISTORICAL: Organochlorine Pesticides & PCBs as Aroclors by GC [SW8081];Organochlorine Pesticides and PCBs [E608];Organochlorine Pesticides by Gas Chromatography [SW8081A];PCB Oil [E6045];PCBs by Perchlorination & GC [E508A];Polychlorinated Biphenyls (PCBs) by Gas Chromatography [SW8082];Semivolatile Organic Compounds by Isotope Dilution GCMS [E1625C];Organochlorine Pesticides and PCBs by GC/HSD [E608.3];Data Unavailable [DU]"]
[null,null,null,null,null,null,null,null,null,null,null,"PCB1016","PCB-1016",null,null,null,null,null,null,null,null,"PCB-1221","ug/L,ng/L,mg/L,lb/day,mg/kg,ug/kg","Chlorinated Pesticides in Groundwater [E508];Extractable Priority Pollutants [E625];Extractable Priority Pollutants by GC/MS SIM [E625SIM];GC/MS SIM Method [SIM];HISTORICAL: Organochlorine Pesticides & PCBs as Aroclors by GC [SW8081];Organochlorine Pesticides and PCBs [E608];Organochlorine Pesticides by Gas Chromatography [SW8081A];PCB Oil [E6045];PCBs by Perchlorination & GC [E508A];Polychlorinated Biphenyls (PCBs) by Gas Chromatography [SW8082];Semivolatile Organic Compounds by Isotope Dilution GCMS [E1625C];Organochlorine Pesticides and PCBs by GC/HSD [E608.3];Data Unavailable [DU]"]
[null,null,null,null,null,null,null,null,null,null,null,"PCB1221","PCB-1221",null,null,null,null,null,null,null,null,"PCB-1232","ug/L,ng/L,mg/L,lb/day,mg/kg,ug/kg","Chlorinated Pesticides in Groundwater [E508];Extractable Priority Pollutants [E625];Extractable Priority Pollutants by GC/MS SIM [E625SIM];GC/MS SIM Method [SIM];HISTORICAL: Organochlorine Pesticides & PCBs as Aroclors by GC [SW8081];Organochlorine Pesticides and PCBs [E608];Organochlorine Pesticides by Gas Chromatography [SW8081A];PCB Oil [E6045];PCBs by Perchlorination & GC [E508A];Polychlorinated Biphenyls (PCBs) by Gas Chromatography [SW8082];Semivolatile Organic Compounds by Isotope Dilution GCMS [E1625C];Organochlorine Pesticides and PCBs by GC/HSD [E608.3];Data Unavailable [DU]"]
[null,null,null,null,null,null,null,null,null,null,null,"PCB1232","PCB-1232",null,null,null,null,null,null,null,null,"PCB-1242","ug/L,ng/L,mg/L,lb/day,mg/kg,ug/kg","Chlorinated Pesticides in Groundwater [E508];Extractable Priority Pollutants [E625];Extractable Priority Pollutants by GC/MS SIM [E625SIM];GC/MS SIM Method [SIM];HISTORICAL: Organochlorine Pesticides & PCBs as Aroclors by GC [SW8081];Organochlorine Pesticides and PCBs [E608];Organochlorine Pesticides by Gas Chromatography [SW8081A];PCB Oil [E6045];PCBs by Perchlorination & GC [E508A];Polychlorinated Biphenyls (PCBs) by Gas Chromatography [SW8082];Semivolatile Organic Compounds by Isotope Dilution GCMS [E1625C];Organochlorine Pesticides and PCBs by GC/HSD [E608.3];Data Unavailable [DU]"]
[null,null,null,null,null,null,null,null,null,null,null,"PCB1242","PCB-1242",null,null,null,null,null,null,null,null,"PCB-1248","ug/L,ng/L,mg/L,lb/day,mg/kg,ug/kg","Chlorinated Pesticides in Groundwater [E508];Extractable Priority Pollutants [E625];Extractable Priority Pollutants by GC/MS SIM [E625SIM];GC/MS SIM Method [SIM];HISTORICAL: Organochlorine Pesticides & PCBs as Aroclors by GC [SW8081];Organochlorine Pesticides and PCBs [E608];Organochlorine Pesticides by Gas Chromatography [SW8081A];PCB Oil [E6045];PCBs by Perchlorination & GC [E508A];Polychlorinated Biphenyls (PCBs) by Gas Chromatography [SW8082];Semivolatile Organic Compounds by Isotope Dilution GCMS [E1625C];Organochlorine Pesticides and PCBs by GC/HSD [E608.3];Data Unavailable [DU]"]
[null,null,null,null,null,null,null,null,null,null,null,"PCB1248","PCB-1248",null,null,null,null,null,null,null,null,"PCB-1254","ug/L,ng/L,mg/L,lb/day,mg/kg,ug/kg","Chlorinated Pesticides in Groundwater [E508];Extractable Priority Pollutants [E625];Extractable Priority Pollutants by GC/MS SIM [E625SIM];GC/MS SIM Method [SIM];HISTORICAL: Organochlorine Pesticides & PCBs as Aroclors by GC [SW8081];Organochlorine Pesticides and PCBs [E608];Organochlorine Pesticides by Gas Chromatography [SW8081A];PCB Oil [E6045];PCBs by Perchlorination & GC [E508A];Polychlorinated Biphenyls (PCBs) by Gas Chromatography [SW8082];Semivolatile Organic Compounds by Isotope Dilution GCMS [E1625C];Organochlorine Pesticides and PCBs by GC/HSD [E608.3];Data Unavailable [DU]"]
[null,null,null,null,null,null,null,null,null,null,null,"PCB1254","PCB-1254",null,null,null,null,null,null,null,null,"PCB-1260","ug/L,ng/L,mg/L,lb/day,mg/kg,ug/kg","Chlorinated Pesticides in Groundwater [E508];Extractable Priority Pollutants [E625];Extractable Priority Pollutants by GC/MS SIM [E625SIM];GC/MS SIM Method [SIM];HISTORICAL: Organochlorine Pesticides & PCBs as Aroclors by GC [SW8081];Organochlorine Pesticides and PCBs [E608];Organochlorine Pesticides by Gas Chromatography [SW8081A];PCB Oil [E6045];PCBs by Perchlorination & GC [E508A];Polychlorinated Biphenyls (PCBs) by Gas Chromatography [SW8082];Semivolatile Organic Compounds by Isotope Dilution GCMS [E1625C];Organochlorine Pesticides and PCBs by GC/HSD [E608.3];Data Unavailable [DU]"]
[null,null,null,null,null,null,null,null,null,null,null,"PCB1260","PCB-1260",null,null,null,null,null,null,null,null,"PCB-1262","ug/L,ng/L,mg/L,lb/day,mg/kg,ug/kg","Chlorinated Pesticides in Groundwater [E508];Extractable Priority Pollutants [E625];Extractable Priority Pollutants by GC/MS SIM [E625SIM];GC/MS SIM Method [SIM];HISTORICAL: Organochlorine Pesticides & PCBs as Aroclors by GC [SW8081];Organochlorine Pesticides and PCBs [E608];Organochlorine Pesticides by Gas Chromatography [SW8081A];PCB Oil [E6045];PCBs by Perchlorination & GC [E508A];Polychlorinated Biphenyls (PCBs) by Gas Chromatography [SW8082];Semivolatile Organic Compounds by Isotope Dilution GCMS [E1625C];Organochlorine Pesticides and PCBs by GC/HSD [E608.3];Data Unavailable [DU]"]
[null,null,null,null,null,null,null,null,null,null,null,"PCB1262","PCB-1262",null,null,null,null,null,null,null,null,"PCB-1268","ug/L,ng/L,mg/L,lb/day,mg/kg,ug/kg","Chlorinated Pesticides in Groundwater [E508];Extractable Priority Pollutants [E625];Extractable Priority Pollutants by GC/MS SIM [E625SIM];GC/MS SIM Method [SIM];HISTORICAL: Organochlorine Pesticides & PCBs as Aroclors by GC [SW8081];Organochlorine Pesticides and PCBs [E608];Organochlorine Pesticides by Gas Chromatography [SW8081A];PCB Oil [E6045];PCBs by Perchlorination & GC [E508A];Polychlorinated Biphenyls (PCBs) by Gas Chromatography [SW8082];Semivolatile Organic Compounds by Isotope Dilution GCMS [E1625C];Organochlorine Pesticides and PCBs by GC/HSD [E608.3];Data Unavailable [DU]"]
[null,null,null,null,null,null,null,null,null,null,null,"PCB1268","PCB-1268",null,null,null,null,null,null,null,null,"Penoxalin",{"$f":"$AG$8","v":"kg/L,g/L,mg/L,ppth,ug/L,ng/L,pg/L,mg/cm2,g/day,g/year,kg/day,kg/month,kg/year,lb/day,lbs/week,lbs/month,lbs/year,mg/day,mg/kg,ug/kg,ng/g,ulbs/day,ug/day,t/day"},"Organic Compounds in Drinking Water by LSE & CCGC/MS [E525.2];Data Unavailable [DU]"]
[null,null,null,null,null,null,null,null,null,null,null,"PENOXALIN","Penoxalin",null,null,null,null,null,null,null,null,"Penoxsulam",{"$f":"$AG$8","v":"kg/L,g/L,mg/L,ppth,ug/L,ng/L,pg/L,mg/cm2,g/day,g/year,kg/day,kg/month,kg/year,lb/day,lbs/week,lbs/month,lbs/year,mg/day,mg/kg,ug/kg,ng/g,ulbs/day,ug/day,t/day"},"Data Unavailable [DU]"]
[null,null,null,null,null,null,null,null,null,null,null,"PENOXSULAM","Penoxsulam",null,null,null,null,null,null,null,null,"Pentachloroethane",{"$f":"$AG$8","v":"kg/L,g/L,mg/L,ppth,ug/L,ng/L,pg/L,mg/cm2,g/day,g/year,kg/day,kg/month,kg/year,lb/day,lbs/week,lbs/month,lbs/year,mg/day,mg/kg,ug/kg,ng/g,ulbs/day,ug/day,t/day"},"Volatile Organic Compounds EPA Method 624 [E624];Data Unavailable [DU]"]
[null,null,null,null,null,null,null,null,null,null,null,"PCLEA","Pentachloroethane",null,null,null,null,null,null,null,null,"Pentachlorophenol",{"$f":"$AG$8","v":"kg/L,g/L,mg/L,ppth,ug/L,ng/L,pg/L,mg/cm2,g/day,g/year,kg/day,kg/month,kg/year,lb/day,lbs/week,lbs/month,lbs/year,mg/day,mg/kg,ug/kg,ng/g,ulbs/day,ug/day,t/day"},"Chlorinated Acids in Water by LLE [E515.3];Chlorinated Acids in Water by LLME [E515.4];Chlorinated Herbicides by GC [SW8151A];Determination of Chlorinated Acids in Water by GC/ECD [E515.1];Extractable Priority Pollutants [E625];Base/Neutrals and Acids by GC/MS [E625.1];Extractable Priority Pollutants by GC/MS SIM [E625SIM];GC/MS SIM Method [SIM];HISTORICAL: Semivolatile Organic Compounds by GC/MS [SW8270];HISTORICAL: Semivolatile Organic Compounds by GC/MS [SW8270A];Phenols by Gas Chromatography [SW8040A];Semivolatile Organic Compounds by GC/MS - Open Scan [8270COS];Semivolatile Organic Compounds by GC/MS [SW8270C];Semivolatile Organic Compounds by Isotope Dilution GCMS [E1625C];Volatile Organic Compounds by GC/MS [SW8260B];Volatile Organic Compounds by GC/MS SIM [8260SIM];Volatile Organic Compounds EPA Method 624 [E624];Data Unavailable [DU]"]
[null,null,null,null,null,null,null,null,null,null,null,"PCP","Pentachlorophenol",null,null,null,null,null,null,null,null,"Pentaerythritol tetranitrate (PETN)","ug/L","Nitroaromatics, Nitramines, and Nitrate Esters by HPLC [SW8330B];Data Unavailable [DU]"]
[null,null,null,null,null,null,null,null,null,null,null,"PETN","Pentaerythritol tetranitrate (PETN)",null,null,null,null,null,null,null,null,"Percent Moisture","%","Data Unavailable [DU]"]
[null,null,null,null,null,null,null,null,null,null,null,"MOIST","Percent Moisture",null,null,null,null,null,null,null,null,"Perchlorate",{"$f":"$AG$8","v":"kg/L,g/L,mg/L,ppth,ug/L,ng/L,pg/L,mg/cm2,g/day,g/year,kg/day,kg/month,kg/year,lb/day,lbs/week,lbs/month,lbs/year,mg/day,mg/kg,ug/kg,ng/g,ulbs/day,ug/day,t/day"},"Determ. of Perchlorate in Drinking Water using Ion Chromatography [E314.0];Determination of Perchlorate in Drinking Water by LCEI/MS [E331.0];Halogenated Volatile Organics by Headspace [3810HVO];Organochlorine Pesticides and PCBs [E608];Data Unavailable [DU]"]
[null,null,null,null,null,null,null,null,null,null,null,"PCATE","Perchlorate",null,null,null,null,null,null,null,null,"Perfluoro(2-ethoxyethane) sulfonic acid (PFEESA)",{"$f":"$AG$8","v":"kg/L,g/L,mg/L,ppth,ug/L,ng/L,pg/L,mg/cm2,g/day,g/year,kg/day,kg/month,kg/year,lb/day,lbs/week,lbs/month,lbs/year,mg/day,mg/kg,ug/kg,ng/g,ulbs/day,ug/day,t/day"},"PFAS in Aqueous, Solid, Biosolids, and Tissue Samples by LC-MS/MS-Draft [E1633-D];Data Unavailable [DU]"]
[null,null,null,null,null,null,null,null,null,null,null,"PFEESA","Perfluoro(2-ethoxyethane) sulfonic acid (PFEESA)",null,null,null,null,null,null,null,null,"Perfluoro-2-propoxypropanoic acid (PFPrOPrA)(GenX) (HFPO-DA)","ng/L,ug/L","PFAS in Aqueous, Solid, Biosolids, and Tissue Samples by LC-MS/MS-Draft [E1633-D];Data Unavailable [DU]"]
[null,null,null,null,null,null,null,null,null,null,null,"HFPO-DA","Perfluoro-2-propoxypropanoic acid (PFPrOPrA)(GenX) (HFPO-DA)",null,null,null,null,null,null,null,null,"Perfluoro-3-methoxypropanoic acid (PFMPA)",{"$f":"$AG$8","v":"kg/L,g/L,mg/L,ppth,ug/L,ng/L,pg/L,mg/cm2,g/day,g/year,kg/day,kg/month,kg/year,lb/day,lbs/week,lbs/month,lbs/year,mg/day,mg/kg,ug/kg,ng/g,ulbs/day,ug/day,t/day"},"PFAS in Aqueous, Solid, Biosolids, and Tissue Samples by LC-MS/MS-Draft [E1633-D];Data Unavailable [DU]"]
[null,null,null,null,null,null,null,null,null,null,null,"PFMPA","Perfluoro-3-methoxypropanoic acid (PFMPA)",null,null,null,null,null,null,null,null,"Perfluoro-4-methoxybutanoic acid (PFMBA)","kg/L,g/L,mg/L,ppth,ug/L,ng/L,pg/L,mg/cm2,g/day,g/year,kg/day,kg/month,kg/year,lb/day,lbs/week,lbs/month,lbs/year,mg/day,mg/kg,ug/kg,ng/g,ulbs/day,ug/day,t/day","PFAS in Aqueous, Solid, Biosolids, and Tissue Samples by LC-MS/MS-Draft [E1633-D];Data Unavailable [DU]"]
[null,null,null,null,null,null,null,null,null,null,null,"PFMBA","Perfluoro-4-methoxybutanoic acid (PFMBA)",null,null,null,null,null,null,null,null,"Perfluorobutanesulfonic acid","kg/L,g/L,mg/L,ppth,ug/L,ng/L,pg/L,mg/cm2,g/day,g/year,kg/day,kg/month,kg/year,lb/day,lbs/week,lbs/month,lbs/year,mg/day,mg/kg,ug/kg,ng/g,ulbs/day,ug/day,t/day","PFAS in Aqueous, Solid, Biosolids, and Tissue Samples by LC-MS/MS-Draft [E1633-D];Data Unavailable [DU]"]
[null,null,null,null,null,null,null,null,null,null,null,"PFBSA","Perfluorobutanesulfonic acid",null,null,null,null,null,null,null,null,"Perfluorobutanoic acid","kg/L,g/L,mg/L,ppth,ug/L,ng/L,pg/L,mg/cm2,g/day,g/year,kg/day,kg/month,kg/year,lb/day,lbs/week,lbs/month,lbs/year,mg/day,mg/kg,ug/kg,ng/g,ulbs/day,ug/day,t/day","PFAS in Aqueous, Solid, Biosolids, and Tissue Samples by LC-MS/MS-Draft [E1633-D];Data Unavailable [DU]"]
[null,null,null,null,null,null,null,null,null,null,null,"PFBA","Perfluorobutanoic acid",null,null,null,null,null,null,null,null,"Perfluorodecanesulfonic acid","kg/L,g/L,mg/L,ppth,ug/L,ng/L,pg/L,mg/cm2,g/day,g/year,kg/day,kg/month,kg/year,lb/day,lbs/week,lbs/month,lbs/year,mg/day,mg/kg,ug/kg,ng/g,ulbs/day,ug/day,t/day","PFAS in Aqueous, Solid, Biosolids, and Tissue Samples by LC-MS/MS-Draft [E1633-D];Data Unavailable [DU]"]
[null,null,null,null,null,null,null,null,null,null,null,"PFDSA","Perfluorodecanesulfonic acid",null,null,null,null,null,null,null,null,"Perfluorodecanoic acid","kg/L,g/L,mg/L,ppth,ug/L,ng/L,pg/L,mg/cm2,g/day,g/year,kg/day,kg/month,kg/year,lb/day,lbs/week,lbs/month,lbs/year,mg/day,mg/kg,ug/kg,ng/g,ulbs/day,ug/day,t/day","PFAS in Aqueous, Solid, Biosolids, and Tissue Samples by LC-MS/MS-Draft [E1633-D];Data Unavailable [DU]"]
[null,null,null,null,null,null,null,null,null,null,null,"PFNDCA","Perfluorodecanoic acid",null,null,null,null,null,null,null,null,"Perfluorododecane sulfonic acid (PFDoDS)","ng/L,ug/L","PFAS in Aqueous, Solid, Biosolids, and Tissue Samples by LC-MS/MS-Draft [E1633-D];Data Unavailable [DU]"]
[null,null,null,null,null,null,null,null,null,null,null,"PFDOS_A","Perfluorododecane sulfonic acid (PFDoDS)",null,null,null,null,null,null,null,null,"Perfluorododecanoic acid",{"$f":"$AG$8","v":"kg/L,g/L,mg/L,ppth,ug/L,ng/L,pg/L,mg/cm2,g/day,g/year,kg/day,kg/month,kg/year,lb/day,lbs/week,lbs/month,lbs/year,mg/day,mg/kg,ug/kg,ng/g,ulbs/day,ug/day,t/day"},"PFAS in Aqueous, Solid, Biosolids, and Tissue Samples by LC-MS/MS-Draft [E1633-D];Data Unavailable [DU]"]
[null,null,null,null,null,null,null,null,null,null,null,"PFDOA","Perfluorododecanoic acid",null,null,null,null,null,null,null,null,"Perfluoroheptanesulfonic acid","kg/L,g/L,mg/L,ppth,ug/L,ng/L,pg/L,mg/cm2,g/day,g/year,kg/day,kg/month,kg/year,lb/day,lbs/week,lbs/month,lbs/year,mg/day,mg/kg,ug/kg,ng/g,ulbs/day,ug/day,t/day","PFAS in Aqueous, Solid, Biosolids, and Tissue Samples by LC-MS/MS-Draft [E1633-D];Data Unavailable [DU]"]
[null,null,null,null,null,null,null,null,null,null,null,"PFHPSA","Perfluoroheptanesulfonic acid",null,null,null,null,null,null,null,null,"Perfluoroheptanoic acid","kg/L,g/L,mg/L,ppth,ug/L,ng/L,pg/L,mg/cm2,g/day,g/year,kg/day,kg/month,kg/year,lb/day,lbs/week,lbs/month,lbs/year,mg/day,mg/kg,ug/kg,ng/g,ulbs/day,ug/day,t/day","PFAS in Aqueous, Solid, Biosolids, and Tissue Samples by LC-MS/MS-Draft [E1633-D];Data Unavailable [DU]"]
[null,null,null,null,null,null,null,null,null,null,null,"PFHPA","Perfluoroheptanoic acid",null,null,null,null,null,null,null,null,"Perfluorohexadecanoic acid","kg/L,g/L,mg/L,ppth,ug/L,ng/L,pg/L,mg/cm2,g/day,g/year,kg/day,kg/month,kg/year,lb/day,lbs/week,lbs/month,lbs/year,mg/day,mg/kg,ug/kg,ng/g,ulbs/day,ug/day,t/day","PFAS in Aqueous, Solid, Biosolids, and Tissue Samples by LC-MS/MS-Draft [E1633-D];Data Unavailable [DU]"]
[null,null,null,null,null,null,null,null,null,null,null,"PFHXDA","Perfluorohexadecanoic acid",null,null,null,null,null,null,null,null,"Perfluorohexanesulfonic acid","kg/L,g/L,mg/L,ppth,ug/L,ng/L,pg/L,mg/cm2,g/day,g/year,kg/day,kg/month,kg/year,lb/day,lbs/week,lbs/month,lbs/year,mg/day,mg/kg,ug/kg,ng/g,ulbs/day,ug/day,t/day","PFAS in Aqueous, Solid, Biosolids, and Tissue Samples by LC-MS/MS-Draft [E1633-D];Data Unavailable [DU]"]
[null,null,null,null,null,null,null,null,null,null,null,"PFHXSA","Perfluorohexanesulfonic acid",null,null,null,null,null,null,null,null,"Perfluorohexanoic acid","kg/L,g/L,mg/L,ppth,ug/L,ng/L,pg/L,mg/cm2,g/day,g/year,kg/day,kg/month,kg/year,lb/day,lbs/week,lbs/month,lbs/year,mg/day,mg/kg,ug/kg,ng/g,ulbs/day,ug/day,t/day","PFAS in Aqueous, Solid, Biosolids, and Tissue Samples by LC-MS/MS-Draft [E1633-D];Data Unavailable [DU]"]
[null,null,null,null,null,null,null,null,null,null,null,"PFHA","Perfluorohexanoic acid",null,null,null,null,null,null,null,null,"Perfluorononane sulfonic acid","kg/L,g/L,mg/L,ppth,ug/L,ng/L,pg/L,mg/cm2,g/day,g/year,kg/day,kg/month,kg/year,lb/day,lbs/week,lbs/month,lbs/year,mg/day,mg/kg,ug/kg,ng/g,ulbs/day,ug/day,t/day","PFAS in Aqueous, Solid, Biosolids, and Tissue Samples by LC-MS/MS-Draft [E1633-D];Data Unavailable [DU]"]
[null,null,null,null,null,null,null,null,null,null,null,"PFNS","Perfluorononane sulfonic acid",null,null,null,null,null,null,null,null,"Perfluorononanoic acid","kg/L,g/L,mg/L,ppth,ug/L,ng/L,pg/L,mg/cm2,g/day,g/year,kg/day,kg/month,kg/year,lb/day,lbs/week,lbs/month,lbs/year,mg/day,mg/kg,ug/kg,ng/g,ulbs/day,ug/day,t/day","PFAS in Aqueous, Solid, Biosolids, and Tissue Samples by LC-MS/MS-Draft [E1633-D];Data Unavailable [DU]"]
[null,null,null,null,null,null,null,null,null,null,null,"PFNA","Perfluorononanoic acid",null,null,null,null,null,null,null,null,"Perfluorooctadecanoic acid","kg/L,g/L,mg/L,ppth,ug/L,ng/L,pg/L,mg/cm2,g/day,g/year,kg/day,kg/month,kg/year,lb/day,lbs/week,lbs/month,lbs/year,mg/day,mg/kg,ug/kg,ng/g,ulbs/day,ug/day,t/day","PFAS in Aqueous, Solid, Biosolids, and Tissue Samples by LC-MS/MS-Draft [E1633-D];Data Unavailable [DU]"]
[null,null,null,null,null,null,null,null,null,null,null,"PFODA","Perfluorooctadecanoic acid",null,null,null,null,null,null,null,null,"Perfluorooctane sulfonamide","kg/L,g/L,mg/L,ppth,ug/L,ng/L,pg/L,mg/cm2,g/day,g/year,kg/day,kg/month,kg/year,lb/day,lbs/week,lbs/month,lbs/year,mg/day,mg/kg,ug/kg,ng/g,ulbs/day,ug/day,t/day","PFAS in Aqueous, Solid, Biosolids, and Tissue Samples by LC-MS/MS-Draft [E1633-D];Data Unavailable [DU]"]
[null,null,null,null,null,null,null,null,null,null,null,"PFOSA","Perfluorooctane sulfonamide",null,null,null,null,null,null,null,null,"Perfluorooctanoic acid","kg/L,g/L,mg/L,ppth,ug/L,ng/L,pg/L,mg/cm2,g/day,g/year,kg/day,kg/month,kg/year,lb/day,lbs/week,lbs/month,lbs/year,mg/day,mg/kg,ug/kg,ng/g,ulbs/day,ug/day,t/day","PFAS in Aqueous, Solid, Biosolids, and Tissue Samples by LC-MS/MS-Draft [E1633-D];Data Unavailable [DU]"]
[null,null,null,null,null,null,null,null,null,null,null,"PFOA","Perfluorooctanoic acid",null,null,null,null,null,null,null,null,"Perfluorooctanoic sulfonate","kg/L,g/L,mg/L,ppth,ug/L,ng/L,pg/L,mg/cm2,g/day,g/year,kg/day,kg/month,kg/year,lb/day,lbs/week,lbs/month,lbs/year,mg/day,mg/kg,ug/kg,ng/g,ulbs/day,ug/day,t/day","PFAS in Aqueous, Solid, Biosolids, and Tissue Samples by LC-MS/MS-Draft [E1633-D];Data Unavailable [DU]"]
[null,null,null,null,null,null,null,null,null,null,null,"PFOS","Perfluorooctanoic sulfonate",null,null,null,null,null,null,null,null,"Perfluoropentane sulfonoic acid","kg/L,g/L,mg/L,ppth,ug/L,ng/L,pg/L,mg/cm2,g/day,g/year,kg/day,kg/month,kg/year,lb/day,lbs/week,lbs/month,lbs/year,mg/day,mg/kg,ug/kg,ng/g,ulbs/day,ug/day,t/day","PFAS in Aqueous, Solid, Biosolids, and Tissue Samples by LC-MS/MS-Draft [E1633-D];Data Unavailable [DU]"]
[null,null,null,null,null,null,null,null,null,null,null,"PFPES","Perfluoropentane sulfonoic acid",null,null,null,null,null,null,null,null,"Perfluoropentanoic acid","kg/L,g/L,mg/L,ppth,ug/L,ng/L,pg/L,mg/cm2,g/day,g/year,kg/day,kg/month,kg/year,lb/day,lbs/week,lbs/month,lbs/year,mg/day,mg/kg,ug/kg,ng/g,ulbs/day,ug/day,t/day","PFAS in Aqueous, Solid, Biosolids, and Tissue Samples by LC-MS/MS-Draft [E1633-D];Data Unavailable [DU]"]
[null,null,null,null,null,null,null,null,null,null,null,"PFPA","Perfluoropentanoic acid",null,null,null,null,null,null,null,null,"Perfluorotetradecanoic acid","kg/L,g/L,mg/L,ppth,ug/L,ng/L,pg/L,mg/cm2,g/day,g/year,kg/day,kg/month,kg/year,lb/day,lbs/week,lbs/month,lbs/year,mg/day,mg/kg,ug/kg,ng/g,ulbs/day,ug/day,t/day","PFAS in Aqueous, Solid, Biosolids, and Tissue Samples by LC-MS/MS-Draft [E1633-D];Data Unavailable [DU]"]
[null,null,null,null,null,null,null,null,null,null,null,"PFTEDA","Perfluorotetradecanoic acid",null,null,null,null,null,null,null,null,"Perfluorotridecanoic acid","kg/L,g/L,mg/L,ppth,ug/L,ng/L,pg/L,mg/cm2,g/day,g/year,kg/day,kg/month,kg/year,lb/day,lbs/week,lbs/month,lbs/year,mg/day,mg/kg,ug/kg,ng/g,ulbs/day,ug/day,t/day","PFAS in Aqueous, Solid, Biosolids, and Tissue Samples by LC-MS/MS-Draft [E1633-D];Data Unavailable [DU]"]
[null,null,null,null,null,null,null,null,null,null,null,"PFTRIDA","Perfluorotridecanoic acid",null,null,null,null,null,null,null,null,"Perfluoroundecanoic acid","kg/L,g/L,mg/L,ppth,ug/L,ng/L,pg/L,mg/cm2,g/day,g/year,kg/day,kg/month,kg/year,lb/day,lbs/week,lbs/month,lbs/year,mg/day,mg/kg,ug/kg,ng/g,ulbs/day,ug/day,t/day","PFAS in Aqueous, Solid, Biosolids, and Tissue Samples by LC-MS/MS-Draft [E1633-D];Data Unavailable [DU]"]
[null,null,null,null,null,null,null,null,null,null,null,"PFUNDCA","Perfluoroundecanoic acid",null,null,null,null,null,null,null,null,"Permethrin, Freely Dissolved","kg/L,g/L,mg/L,ppth,ug/L,ng/L,pg/L,mg/cm2,g/day,g/year,kg/day,kg/month,kg/year,lb/day,lbs/week,lbs/month,lbs/year,mg/day,mg/kg,ug/kg,ng/g,ulbs/day,ug/day,t/day","PFAS in Aqueous, Solid, Biosolids, and Tissue Samples by LC-MS/MS-Draft [E1633-D];Data Unavailable [DU]"]
[null,null,null,null,null,null,null,null,null,null,"L","PERMETHRIN","Permethrin, Freely Dissolved",null,null,null,null,null,null,null,null,"Permethrin, Total","kg/L,g/L,mg/L,ppth,ug/L,ng/L,pg/L,mg/cm2,g/day,g/year,kg/day,kg/month,kg/year,lb/day,lbs/week,lbs/month,lbs/year,mg/day,mg/kg,ug/kg,ng/g,ulbs/day,ug/day,t/day","PFAS in Aqueous, Solid, Biosolids, and Tissue Samples by LC-MS/MS-Draft [E1633-D];Data Unavailable [DU]"]
[null,null,null,null,null,null,null,null,null,null,null,"PERMETHRIN","Permethrin, Total",null,null,null,null,null,null,null,null,"Perylene","kg/L,g/L,mg/L,ppth,ug/L,ng/L,pg/L,mg/cm2,g/day,g/year,kg/day,kg/month,kg/year,lb/day,lbs/week,lbs/month,lbs/year,mg/day,mg/kg,ug/kg,ng/g,ulbs/day,ug/day,t/day","Extractable Priority Pollutants [E625];Base/Neutrals and Acids by GC/MS [E625.1];Data Unavailable [DU]"]
[null,null,null,null,null,null,null,null,null,null,null,"PERY","Perylene",null,null,null,null,null,null,null,null,"Perylene-d12","kg/L,g/L,mg/L,ppth,ug/L,ng/L,pg/L,mg/cm2,g/day,g/year,kg/day,kg/month,kg/year,lb/day,lbs/week,lbs/month,lbs/year,mg/day,mg/kg,ug/kg,ng/g,ulbs/day,ug/day,t/day","Extractable Priority Pollutants [E625];Data Unavailable [DU]"]
[null,null,null,null,null,null,null,null,null,null,null,"PERYD12","Perylene-d12",null,null,null,null,null,null,null,null,"pH","SU","pH [SW9045A];HISTORICAL: pH, Electrometric Measurement [SW9040];pH Electrometric Measurement [SW9040C];pH Paper Method [SW9041A];pH, Electrometric [E150.1];pH, Electrometric Measurement [SW9040B];Soil and Waste pH [SW9045C];Standard Method (19th) 4500-H+ B: pH by Electrometric Method [A4500HB];Standard Method (19th) 4500-H+: pH Value [A4500H];Data Unavailable [DU]"]
[null,null,null,null,null,null,null,null,null,null,null,"PH","pH",null,null,null,null,null,null,null,null,"Phenanthrene",{"$f":"$AG$8","v":"kg/L,g/L,mg/L,ppth,ug/L,ng/L,pg/L,mg/cm2,g/day,g/year,kg/day,kg/month,kg/year,lb/day,lbs/week,lbs/month,lbs/year,mg/day,mg/kg,ug/kg,ng/g,ulbs/day,ug/day,t/day"},"Extractable Priority Pollutants [E625];Extractable Priority Pollutants by GC/MS SIM [E625SIM];GC/MS SIM Method [SIM];HISTORICAL: Semivolatile Organic Compounds by GC/MS [SW8270];HISTORICAL: Semivolatile Organic Compounds by GC/MS [SW8270A];Organic Compounds in Drinking Water by LSE & CCGC/MS [E525.2];Polynuclear Aromatic Hydrocarbons [E610];Semivolatile Organic Compounds by GC/MS - Open Scan [8270COS];Semivolatile Organic Compounds by GC/MS [SW8270C];Semivolatile Organic Compounds by GC/MS SIM [8270SIM];Semivolatile Organic Compounds by Isotope Dilution GCMS [E1625C];Volatile Organic Compounds by GC/MS [SW8260B];Volatile Organic Compounds by GC/MS SIM [8260SIM];Base/Neutrals and Acids by GC/MS [E625.1];Data Unavailable [DU]"]
[null,null,null,null,null,null,null,null,null,null,null,"PHAN","Phenanthrene",null,null,null,null,null,null,null,null,"Phenanthrene-d10","kg/L,g/L,mg/L,ppth,ug/L,ng/L,pg/L,mg/cm2,g/day,g/year,kg/day,kg/month,kg/year,lb/day,lbs/week,lbs/month,lbs/year,mg/day,mg/kg,ug/kg,ng/g,ulbs/day,ug/day,t/day","Extractable Priority Pollutants [E625];Extractable Priority Pollutants by GC/MS SIM [E625SIM];GC/MS SIM Method [SIM];HISTORICAL: Semivolatile Organic Compounds by GC/MS [SW8270];HISTORICAL: Semivolatile Organic Compounds by GC/MS [SW8270A];Organic Compounds in Drinking Water by LSE & CCGC/MS [E525.2];Polynuclear Aromatic Hydrocarbons [E610];Semivolatile Organic Compounds by GC/MS - Open Scan [8270COS];Semivolatile Organic Compounds by GC/MS [SW8270C];Semivolatile Organic Compounds by GC/MS SIM [8270SIM];Semivolatile Organic Compounds by Isotope Dilution GCMS [E1625C];Volatile Organic Compounds by GC/MS [SW8260B];Volatile Organic Compounds by GC/MS SIM [8260SIM];Data Unavailable [DU]"]
[null,null,null,null,null,null,null,null,null,null,null,"PHAND10","Phenanthrene-d10",null,null,null,null,null,null,null,null,"Phenol, Single Compound","kg/L,g/L,mg/L,ppth,ug/L,ng/L,pg/L,mg/cm2,g/day,g/year,kg/day,kg/month,kg/year,lb/day,lbs/week,lbs/month,lbs/year,mg/day,mg/kg,ug/kg,ng/g,ulbs/day,ug/day,t/day","Extractable Priority Pollutants [E625];Base/Neutrals and Acids by GC/MS [E625.1];Extractable Priority Pollutants by GC/MS SIM [E625SIM];GC/MS SIM Method [SIM];HISTORICAL: Semivolatile Organic Compounds by GC/MS [SW8270];HISTORICAL: Semivolatile Organic Compounds by GC/MS [SW8270A];Phenolics (Colorimetric, Automated 4-AAP with Distillation) [E420.2];Phenolics, Total Recoverable (Spectrophotometric, Manual) [E420.1];Phenols by Gas Chromatography [SW8040A];Semivolatile Organic Compounds by GC/MS - Open Scan [8270COS];Semivolatile Organic Compounds by GC/MS [SW8270C];Semivolatile Organic Compounds by Isotope Dilution GCMS [E1625C];Volatile Organic Compounds by GC/MS [SW8260B];Volatile Organic Compounds by GC/MS SIM [8260SIM];Volatile Organic Compounds EPA Method 624 [E624];Data Unavailable [DU]"]
[null,null,null,null,null,null,null,null,null,null,null,"PHENOL","Phenol, Single Compound",null,null,null,null,null,null,null,null,"Phenol-d5","kg/L,g/L,mg/L,ppth,ug/L,ng/L,pg/L,mg/cm2,g/day,g/year,kg/day,kg/month,kg/year,lb/day,lbs/week,lbs/month,lbs/year,mg/day,mg/kg,ug/kg,ng/g,ulbs/day,ug/day,t/day","Base/Neutrals and Acids by GC/MS [E625.1];Semivolatile Organic Compounds by GC/MS [SW8270C];Data Unavailable [DU]"]
[null,null,null,null,null,null,null,null,null,null,null,"PHD5","Phenol-d5",null,null,null,null,null,null,null,null,"Phenol-d6","kg/L,g/L,mg/L,ppth,ug/L,ng/L,pg/L,mg/cm2,g/day,g/year,kg/day,kg/month,kg/year,lb/day,lbs/week,lbs/month,lbs/year,mg/day,mg/kg,ug/kg,ng/g,ulbs/day,ug/day,t/day","Base/Neutrals and Acids by GC/MS [E625.1];Semivolatile Organic Compounds by GC/MS [SW8270C];Data Unavailable [DU]"]
[null,null,null,null,null,null,null,null,null,null,null,"PHENOLD6","Phenol-d6",null,null,null,null,null,null,null,null,"Phenols, Chlorinated","kg/L,g/L,mg/L,ppth,ug/L,ng/L,pg/L,mg/cm2,g/day,g/year,kg/day,kg/month,kg/year,lb/day,lbs/week,lbs/month,lbs/year,mg/day,mg/kg,ug/kg,ng/g,ulbs/day,ug/day,t/day","Extractable Priority Pollutants [E625];Extractable Priority Pollutants by GC/MS SIM [E625SIM];Phenolics (Colorimetric, Automated 4-AAP with Distillation) [E420.2];Phenolics, Total Recoverable (Spectrophotometric, Manual) [E420.1];Semivolatile Organic Compounds by GC/MS [SW8270C];Semivolatile Organic Compounds by Isotope Dilution GCMS [E1625C];Semivolatile Organic Compounds by SPE & GC/MS [E526];Data Unavailable [DU]"]
[null,null,null,null,null,null,null,null,null,null,null,"PHENOLC","Phenols, Chlorinated",null,null,null,null,null,null,null,null,"Phenols, Non-chlorinated","kg/L,g/L,mg/L,ppth,ug/L,ng/L,pg/L,mg/cm2,g/day,g/year,kg/day,kg/month,kg/year,lb/day,lbs/week,lbs/month,lbs/year,mg/day,mg/kg,ug/kg,ng/g,ulbs/day,ug/day,t/day","Extractable Priority Pollutants [E625];Extractable Priority Pollutants by GC/MS SIM [E625SIM];Phenolics (Colorimetric, Automated 4-AAP with Distillation) [E420.2];Phenolics, Total Recoverable (Spectrophotometric, Manual) [E420.1];Semivolatile Organic Compounds by GC/MS [SW8270C];Semivolatile Organic Compounds by Isotope Dilution GCMS [E1625C];Semivolatile Organic Compounds by SPE & GC/MS [E526];Total Recoverable Phenolics by Semi-automated Colorimetry [E420.4];Data Unavailable [DU]"]
[null,null,null,null,null,null,null,null,null,null,null,"PHENOLNC","Phenols, Non-chlorinated",null,null,null,null,null,null,null,null,"Phenols, Total","kg/L,g/L,mg/L,ppth,ug/L,ng/L,pg/L,mg/cm2,g/day,g/year,kg/day,kg/month,kg/year,lb/day,lbs/week,lbs/month,lbs/year,mg/day,mg/kg,ug/kg,ng/g,ulbs/day,ug/day,t/day","Extractable Priority Pollutants [E625];HISTORICAL: Semivolatile Organic Compounds by GC/MS [SW8270];Phenolics (Colorimetric, Automated 4-AAP with Distillation) [E420.2];Phenolics, Total Recoverable (Spectrophotometric, Manual) [E420.1];Phenolics, Total Recoverable Modified [E420.1M];Phenols by Gas Chromatography [SW8040A];Semivolatile Organic Compounds by GC/MS [SW8270C];Semivolatile Organic Compounds by Isotope Dilution GCMS [E1625C];Total Recoverable Phenolics by Semi-automated Colorimetry [E420.4];Volatile Organic Compounds by GC/MS [SW8260B];Data Unavailable [DU]"]
[null,null,null,null,null,null,null,null,null,null,null,"TOTPHEN","Phenols, Total",null,null,null,null,null,null,null,null,"Pheophytin","mg/L,ug/L,mg/m3","Standard Method (19th) 10200 H: Chlorophyll [A10200H];Data Unavailable [DU]"]
[null,null,null,null,null,null,null,null,null,null,null,"PHEOPHYTIN","Pheophytin",null,null,null,null,null,null,null,null,"Phorate",{"$f":"$AG$8","v":"kg/L,g/L,mg/L,ppth,ug/L,ng/L,pg/L,mg/cm2,g/day,g/year,kg/day,kg/month,kg/year,lb/day,lbs/week,lbs/month,lbs/year,mg/day,mg/kg,ug/kg,ng/g,ulbs/day,ug/day,t/day"},"Extractable Priority Pollutants [E625];Data Unavailable [DU]"]
[null,null,null,null,null,null,null,null,null,null,null,"PHORATE","Phorate",null,null,null,null,null,null,null,null,"Phosmet","kg/L,g/L,mg/L,ppth,ug/L,ng/L,pg/L,mg/cm2,g/day,g/year,kg/day,kg/month,kg/year,lb/day,lbs/week,lbs/month,lbs/year,mg/day,mg/kg,ug/kg,ng/g,ulbs/day,ug/day,t/day","Extractable Priority Pollutants [E625];Data Unavailable [DU]"]
[null,null,null,null,null,null,null,null,null,null,null,"PHOSMET","Phosmet",null,null,null,null,null,null,null,null,"Phosphamidon","kg/L,g/L,mg/L,ppth,ug/L,ng/L,pg/L,mg/cm2,g/day,g/year,kg/day,kg/month,kg/year,lb/day,lbs/week,lbs/month,lbs/year,mg/day,mg/kg,ug/kg,ng/g,ulbs/day,ug/day,t/day","Data Unavailable [DU]"]
[null,null,null,null,null,null,null,null,null,null,null,"PHOSPHAM","Phosphamidon",null,null,null,null,null,null,null,null,"Phosphate, Total (as P)","kg/L,g/L,mg/L,ppth,ug/L,ng/L,pg/L,mg/cm2,g/day,g/year,kg/day,kg/month,kg/year,lb/day,lbs/week,lbs/month,lbs/year,mg/day,mg/kg,ug/kg,ng/g,ulbs/day,ug/day,t/day","Inorganic Anions by Ion Chromatography [E300.0];Phosphorus, All Forms (as P) [E365.2];Phosphorus, All Forms (Colorimetric, Ascorbic Acid ) [E365.3];Phosphorus, All Forms, (Colorimetric, Automated, Ascorbic Acid ) [E365.1];Phosphorus, Reactive Soluble [E365.3M];Phosphorus, Total (Colorimetric, Automated Block Digestor, AA II) [E365.4];Standard Method (20th) 4500-P E: Phosphorus Ascorbic Acid Method [A4500PE];Data Unavailable [DU]"]
[null,null,null,null,null,null,null,null,null,null,null,"PO4P","Phosphate, Total (as P)",null,null,null,null,null,null,null,null,"Phosphate, Total (as PO4)","kg/L,g/L,mg/L,ppth,ug/L,ng/L,pg/L,mg/cm2,g/day,g/year,kg/day,kg/month,kg/year,lb/day,lbs/week,lbs/month,lbs/year,mg/day,mg/kg,ug/kg,ng/g,ulbs/day,ug/day,t/day","Determination of Inorganic Anions by Ion Chromatography [SW9056];Inorganic Anions by Ion Chromatography [E300.0];Inorganic Anions by Ion Chromatography, Part A [E300A];Phosphorus, All Forms (Colorimetric, Ascorbic Acid ) [E365.3];Phosphorus, All Forms, (Colorimetric, Automated, Ascorbic Acid ) [E365.1];Data Unavailable [DU]"]
[null,null,null,null,null,null,null,null,null,null,null,"PO4TOT","Phosphate, Total (as PO4)",null,null,null,null,null,null,null,null,"Phosphorus, Dissolved (as P)","kg/L,g/L,mg/L,ppth,ug/L,ng/L,pg/L,mg/cm2,g/day,g/year,kg/day,kg/month,kg/year,lb/day,lbs/week,lbs/month,lbs/year,mg/day,mg/kg,ug/kg,ng/g,ulbs/day,ug/day,t/day","Inductively Coupled Plasma Emission [E200.7];Inductively Coupled Plasma/Mass Spectroscopy [E200.8];Inorganic Anions by Ion Chromatography [E300.0];Phosphorus, All Forms (as P) [E365.2];Phosphorus, All Forms (Colorimetric, Ascorbic Acid ) [E365.3];Phosphorus, All Forms, (Colorimetric, Automated, Ascorbic Acid ) [E365.1];Phosphorus, Total (Colorimetric, Automated Block Digestor, AA II) [E365.4];Standard Method (20th) 4500-P E: Phosphorus Ascorbic Acid Method [A4500PE];Standard Method 4500-P F: Determination of Phosphorus by Automated Ascorbic Acid Reduction Method[A4500PF];Standard Methods 4500-P G: Determination of Phosphorus by Flow Injection Analysis for Orthophosphate;Standard Methods 4500-P H: Manual Digestion and Flow Injection Analysis for Total Phosphorus;Data Unavailable [DU]"]
[null,null,null,null,null,null,null,null,null,null,"L","P","Phosphorus, Dissolved (as P)",null,null,null,null,null,null,null,null,"Phosphorus, Total (as P)","kg/L,g/L,mg/L,ppth,ug/L,ng/L,pg/L,mg/cm2,g/day,g/year,kg/day,kg/month,kg/year,lb/day,lbs/week,lbs/month,lbs/year,mg/day,mg/kg,ug/kg,ng/g,ulbs/day,ug/day,t/day","Inductively Coupled Plasma Emission [E200.7];Inductively Coupled Plasma/Mass Spectroscopy [E200.8];Inorganic Anions by Ion Chromatography [E300.0];Phosphorus, All Forms (as P) [E365.2];Phosphorus, All Forms (Colorimetric, Ascorbic Acid ) [E365.3];Phosphorus, All Forms, (Colorimetric, Automated, Ascorbic Acid ) [E365.1];Phosphorus, Total (Colorimetric, Automated Block Digestor, AA II) [E365.4];Standard Method (20th) 4500-P E: Phosphorus Ascorbic Acid Method [A4500PE];Standard Method 4500-P F: Determination of Phosphorus by Automated Ascorbic Acid Reduction Method[A4500PF];Standard Methods 4500-P G: Determination of Phosphorus by Flow Injection Analysis for Orthophosphate;Standard Methods 4500-P H: Manual Digestion and Flow Injection Analysis for Total Phosphorus;Data Unavailable [DU]"]
[null,null,null,null,null,null,null,null,null,null,null,"P","Phosphorus, Total (as P)",null,null,null,null,null,null,null,null,"Phosphorus, Total Organic (as P)","kg/L,g/L,mg/L,ppth,ug/L,ng/L,pg/L,mg/cm2,g/day,g/year,kg/day,kg/month,kg/year,lb/day,lbs/week,lbs/month,lbs/year,mg/day,mg/kg,ug/kg,ng/g,ulbs/day,ug/day,t/day","Inductively Coupled Plasma Emission [E200.7];Inductively Coupled Plasma/Mass Spectroscopy [E200.8];Inorganic Anions by Ion Chromatography [E300.0];Phosphorus, All Forms (as P) [E365.2];Phosphorus, All Forms (Colorimetric, Ascorbic Acid ) [E365.3];Phosphorus, All Forms, (Colorimetric, Automated, Ascorbic Acid ) [E365.1];Phosphorus, Total (Colorimetric, Automated Block Digestor, AA II) [E365.4];Standard Method (20th) 4500-P E: Phosphorus Ascorbic Acid Method [A4500PE];Standard Method 4500-P F: Determination of Phosphorus by Automated Ascorbic Acid Reduction Method[A4500PF];Standard Methods 4500-P G: Determination of Phosphorus by Flow Injection Analysis for Orthophosphate;Standard Methods 4500-P H: Manual Digestion and Flow Injection Analysis for Total Phosphorus;Data Unavailable [DU]"]
[null,null,null,null,null,null,null,null,null,null,null,"PORG","Phosphorus, Total Organic (as P)",null,null,null,null,null,null,null,null,"Phthalate Esters","kg/L,g/L,mg/L,ppth,ug/L,ng/L,pg/L,mg/cm2,g/day,g/year,kg/day,kg/month,kg/year,lb/day,lbs/week,lbs/month,lbs/year,mg/day,mg/kg,ug/kg,ng/g,ulbs/day,ug/day,t/day","Organic Compounds in Drinking Water by LSE & CCGC/MS [E525.2];Data Unavailable [DU]"]
[null,null,null,null,null,null,null,null,null,null,null,"UNKPHLATE","Phthalate Esters",null,null,null,null,null,null,null,null,"Picloram","kg/L,g/L,mg/L,ppth,ug/L,ng/L,pg/L,mg/cm2,g/day,g/year,kg/day,kg/month,kg/year,lb/day,lbs/week,lbs/month,lbs/year,mg/day,mg/kg,ug/kg,ng/g,ulbs/day,ug/day,t/day","Chlorinated Acids in Water by LLE [E515.3];Chlorinated Acids in Water by LLME [E515.4];Chlorinated Herbicides by GC [SW8151A];Determination of Chlorinated Acids in Water by GC/ECD [E515.1];Nitrogen- & Phosphorus-Containing Pest. in Water by GC [E507];Organochlorine Pesticides and PCBs [E608];Volatile Organic Compounds by GC/MS [SW8260B];Data Unavailable [DU]"]
[null,null,null,null,null,null,null,null,null,null,null,"PICLORAM","Picloram",null,null,null,null,null,null,null,null,"p-Isopropyltoluene","kg/L,g/L,mg/L,ppth,ug/L,ng/L,pg/L,mg/cm2,g/day,g/year,kg/day,kg/month,kg/year,lb/day,lbs/week,lbs/month,lbs/year,mg/day,mg/kg,ug/kg,ng/g,ulbs/day,ug/day,t/day","HISTORICAL: Volatile Organic Compounds by GC/MS [SW8260];Semivolatile Organic Compounds by GC/MS [SW8270C];Volatile Organic Compounds by GC/MS [SW8260B];Data Unavailable [DU]"]
[null,null,null,null,null,null,null,null,null,null,null,"CYMP","p-Isopropyltoluene",null,null,null,null,null,null,null,null,"Plastics","mg,count","Data Unavailable [DU]"]
[null,null,null,null,null,null,null,null,null,null,null,"PLASTICS","Plastics",null,null,null,null,null,null,null,null,"Plutonium-238","PCi/L","A-01-R - Isotopic Plutonium and Neptunium (Alpha Spectrometry - EML HASL-300);Data Unavailable [DU]"]
[null,null,null,null,null,null,null,null,null,null,null,"PU-238","Plutonium-238",null,null,null,null,null,null,null,null,"Plutonium-239/240","PCi/L","A-01-R - Isotopic Plutonium and Neptunium (Alpha Spectrometry - EML HASL-300);Data Unavailable [DU]"]
[null,null,null,null,null,null,null,null,null,null,null,"PU239240","Plutonium-239/240",null,null,null,null,null,null,null,null,"Polonium-210","PCi/L","A-01-R - Isotopic Polonium (Alpha Spectrometry - EML HASL-300);Data Unavailable [DU]"]
[null,null,null,null,null,null,null,null,null,null,null,"PO-210","Polonium-210",null,null,null,null,null,null,null,null,"Polychlorinated Biphenyls (PCBs), Sum",{"$f":"$AG$8","v":"kg/L,g/L,mg/L,ppth,ug/L,ng/L,pg/L,mg/cm2,g/day,g/year,kg/day,kg/month,kg/year,lb/day,lbs/week,lbs/month,lbs/year,mg/day,mg/kg,ug/kg,ng/g,ulbs/day,ug/day,t/day"},"Chlorinated Pesticides in Groundwater [E508];Extractable Priority Pollutants [E625];Organochlorine Pesticides and PCBs [E608];Organochlorine Pesticides by Gas Chromatography [SW8081A];Organohalide Pest. & Com. PCBs in Water by Microext. & GC [E505];Polychlorinated Biphenyls (PCBs) by Gas Chromatography [SW8082];Data Unavailable [DU]"]
[null,null,null,null,null,null,null,null,null,null,null,"TOTPCB","Polychlorinated Biphenyls (PCBs), Sum",null,null,null,null,null,null,null,null,"Polynuclear Aromatic Hydrocarbons (PAHs)",{"$f":"$AG$8","v":"kg/L,g/L,mg/L,ppth,ug/L,ng/L,pg/L,mg/cm2,g/day,g/year,kg/day,kg/month,kg/year,lb/day,lbs/week,lbs/month,lbs/year,mg/day,mg/kg,ug/kg,ng/g,ulbs/day,ug/day,t/day"},"Extractable Priority Pollutants [E625];Extractable Priority Pollutants by GC/MS SIM [E625SIM];Organochlorine Pesticides and PCBs [E608];Organochlorine Pesticides by Gas Chromatography [SW8081A];Polynuclear Aromatic Hydrocarbons [E610];Polynuclear Aromatic Hydrocarbons [SW8310];Semivolatile Organic Compounds by GC/MS [SW8270C];Semivolatile Organic Compounds by Isotope Dilution GCMS [E1625C];Semivolatile Organic Compounds by SPE & GC/MS [E526];Volatile Organic Compounds EPA Method 624 [E624];Data Unavailable [DU]"]
[null,null,null,null,null,null,null,null,null,null,null,"PAHTOT","Polynuclear Aromatic Hydrocarbons (PAHs)",null,null,null,null,null,null,null,null,"Potassium 40","PCi/L","Data Unavailable [DU]"]
[null,null,null,null,null,null,null,null,null,null,null,"K-40","Potassium 40",null,null,null,null,null,null,null,null,"Potassium Permanganate",{"$f":"$AG$8","v":"kg/L,g/L,mg/L,ppth,ug/L,ng/L,pg/L,mg/cm2,g/day,g/year,kg/day,kg/month,kg/year,lb/day,lbs/week,lbs/month,lbs/year,mg/day,mg/kg,ug/kg,ng/g,ulbs/day,ug/day,t/day"},"Manganese (AA, Furnace Technique) [E243.2];Standard Method (19th) 3113: Metals by Electrothermal AAS [A3113];Data Unavailable [DU]"]
[null,null,null,null,null,null,null,null,null,null,null,"PERMANG","Potassium Permanganate",null,null,null,null,null,null,null,null,"Potassium, Dissolved",{"$f":"$AG$8","v":"kg/L,g/L,mg/L,ppth,ug/L,ng/L,pg/L,mg/cm2,g/day,g/year,kg/day,kg/month,kg/year,lb/day,lbs/week,lbs/month,lbs/year,mg/day,mg/kg,ug/kg,ng/g,ulbs/day,ug/day,t/day"},"Inductively Coupled Plasma Emission - modified for CLP [CL200.7];Inductively Coupled Plasma Emission [E200.7];Inductively Coupled Plasma/Mass Spectroscopy [E200.8];Inductively Coupled Plasma-Atomic Emission Spectroscopy [SW6010B];Metals by Atomic Absorption [E200.0];Potassium (AA, Direct Aspiration) [E258.1];Standard Method (19th) 3111 B: Metals, Direct Air-Acetylene Flame [A3111B;Standard Method (19th) 3113: Metals by Electrothermal AAS [A3113];HISTORICAL: Inductively Coupled Plasma-Atomic Emission Spct. [SW6010A];Data Unavailable [DU]"]
[null,null,null,null,null,null,null,null,null,null,null,"K","Potassium, Dissolved",null,null,null,null,null,null,null,null,"Potassium, Total Recoverable",{"$f":"$AG$8","v":"kg/L,g/L,mg/L,ppth,ug/L,ng/L,pg/L,mg/cm2,g/day,g/year,kg/day,kg/month,kg/year,lb/day,lbs/week,lbs/month,lbs/year,mg/day,mg/kg,ug/kg,ng/g,ulbs/day,ug/day,t/day"},"Inductively Coupled Plasma Emission - modified for CLP [CL200.7];Inductively Coupled Plasma Emission [E200.7];Inductively Coupled Plasma/Mass Spectroscopy [E200.8];Inductively Coupled Plasma-Atomic Emission Spectroscopy [SW6010B];Metals by Atomic Absorption [E200.0];Potassium (AA, Direct Aspiration) [E258.1];Standard Method (19th) 3111 B: Metals, Direct Air-Acetylene Flame [A3111B;Standard Method (19th) 3113: Metals by Electrothermal AAS [A3113];HISTORICAL: Inductively Coupled Plasma-Atomic Emission Spct. [SW6010A];Data Unavailable [DU]"]
[null,null,null,null,null,null,null,null,null,null,"N","K","Potassium, Total Recoverable",null,null,null,null,null,null,null,null,"Propiconazole",{"$f":"$AG$8","v":"kg/L,g/L,mg/L,ppth,ug/L,ng/L,pg/L,mg/cm2,g/day,g/year,kg/day,kg/month,kg/year,lb/day,lbs/week,lbs/month,lbs/year,mg/day,mg/kg,ug/kg,ng/g,ulbs/day,ug/day,t/day"},"HISTORICAL: Organochlorine Pesticides & PCBs as Aroclors by GC [SW8081];Data Unavailable [DU]"]
[null,null,null,null,null,null,null,null,null,null,null,"PROPICON","Propiconazole",null,null,null,null,null,null,null,null,"Propionic acid","mg/L","Data Unavailable [DU]"]
[null,null,null,null,null,null,null,null,null,null,null,"PROPIONICACD","Propionic acid",null,null,null,null,null,null,null,null,"Propoxur",{"$f":"$AG$8","v":"kg/L,g/L,mg/L,ppth,ug/L,ng/L,pg/L,mg/cm2,g/day,g/year,kg/day,kg/month,kg/year,lb/day,lbs/week,lbs/month,lbs/year,mg/day,mg/kg,ug/kg,ng/g,ulbs/day,ug/day,t/day"},"Data Unavailable [DU]"]
[null,null,null,null,null,null,null,null,null,null,null,"PROPOXUR","Propoxur",null,null,null,null,null,null,null,null,"Propylene Oxide",{"$f":"$AG$8","v":"kg/L,g/L,mg/L,ppth,ug/L,ng/L,pg/L,mg/cm2,g/day,g/year,kg/day,kg/month,kg/year,lb/day,lbs/week,lbs/month,lbs/year,mg/day,mg/kg,ug/kg,ng/g,ulbs/day,ug/day,t/day"},"Data Unavailable [DU]"]
[null,null,null,null,null,null,null,null,null,null,null,"PROXIDE","Propylene Oxide",null,null,null,null,null,null,null,null,"Protactinium-231","PCi/L","Gamm-Emitting Radionuclides in Drinking Water;Data Unavailable [DU]"]
[null,null,null,null,null,null,null,null,null,null,null,"PA-231","Protactinium-231",null,null,null,null,null,null,null,null,"Pyrene",{"$f":"$AG$8","v":"kg/L,g/L,mg/L,ppth,ug/L,ng/L,pg/L,mg/cm2,g/day,g/year,kg/day,kg/month,kg/year,lb/day,lbs/week,lbs/month,lbs/year,mg/day,mg/kg,ug/kg,ng/g,ulbs/day,ug/day,t/day"},"Extractable Priority Pollutants [E625];Extractable Priority Pollutants by GC/MS SIM [E625SIM];GC/MS SIM Method [SIM];HISTORICAL: Semivolatile Organic Compounds by GC/MS [SW8270];HISTORICAL: Semivolatile Organic Compounds by GC/MS [SW8270A];Organic Compounds in Drinking Water by LSE & CCGC/MS [E525.2];Polynuclear Aromatic Hydrocarbons [E610];Semivolatile Organic Compounds by GC/MS - Open Scan [8270COS];Semivolatile Organic Compounds by GC/MS [SW8270C];Semivolatile Organic Compounds by GC/MS SIM [8270SIM];Semivolatile Organic Compounds by Isotope Dilution GCMS [E1625C];Volatile Organic Compounds by GC/MS [SW8260B];Volatile Organic Compounds by GC/MS SIM [8260SIM];Base/Neutrals and Acids by GC/MS [E625.1];Data Unavailable [DU]"]
[null,null,null,null,null,null,null,null,null,null,null,"PYR","Pyrene",null,null,null,null,null,null,null,null,"Pyridine",{"$f":"$AG$8","v":"kg/L,g/L,mg/L,ppth,ug/L,ng/L,pg/L,mg/cm2,g/day,g/year,kg/day,kg/month,kg/year,lb/day,lbs/week,lbs/month,lbs/year,mg/day,mg/kg,ug/kg,ng/g,ulbs/day,ug/day,t/day"},"Extractable Priority Pollutants [E625];Base/Neutrals and Acids by GC/MS [E625.1];Data Unavailable [DU]"]
[null,null,null,null,null,null,null,null,null,null,null,"PYRDN","Pyridine",null,null,null,null,null,null,null,null,"Pyruvic Acid","mg/L","Data Unavailable [DU]"]
[null,null,null,null,null,null,null,null,null,null,null,"PYRUVICACID","Pyruvic Acid",null,null,null,null,null,null,null,null,"Radiation, Gross Alpha","PCi/L","Gross Alpha and Beta Radiation [E900];Standard Method (19th) 7110 B: Evap. Method for Gross Alpha-Beta [A7110B];Standard Method (19th) 7110 C: Gross Alpha Radioactivity in DW by Coprecipitation [A7110C];Data Unavailable [DU]"]
[null,null,null,null,null,null,null,null,null,null,null,"ALPHA","Radiation, Gross Alpha",null,null,null,null,null,null,null,null,"Radiation, Gross Beta","PCi/L","Gross Alpha and Beta Radiation [E900];Standard Method (19th) 7110 B: Evap. Method for Gross Alpha-Beta [A7110B];Data Unavailable [DU]"]
[null,null,null,null,null,null,null,null,null,null,null,"BETA","Radiation, Gross Beta",null,null,null,null,null,null,null,null,"Radioactivity","PCi/L","Gross Alpha and Beta Radiation [E900];Radioactive Strontium in Water [E905.0];Radium [E903.1];Standard Method (19th) 7110 B: Evap. Method for Gross Alpha-Beta [A7110B];Data Unavailable [DU]"]
[null,null,null,null,null,null,null,null,null,null,null,"RADIOACT","Radioactivity",null,null,null,null,null,null,null,null,"Radium-223","PCi/L","Gamm-Emitting Radionuclides in Drinking Water;Data Unavailable [DU]"]
[null,null,null,null,null,null,null,null,null,null,null,"RA-223","Radium-223",null,null,null,null,null,null,null,null,"Radium-224","PCi/L","Gamm-Emitting Radionuclides in Drinking Water;Data Unavailable [DU]"]
[null,null,null,null,null,null,null,null,null,null,null,"RA-224","Radium-224",null,null,null,null,null,null,null,null,"Radium-226","PCi/L","Radium [E903.1];Data Unavailable [DU]"]
[null,null,null,null,null,null,null,null,null,null,null,"RA-226","Radium-226",null,null,null,null,null,null,null,null,"Radium-226 + Radium-228","PCi/L","Alpha-Emitting Radium Isotopes in Drinking Water [E903.0];Determ. of Radium -226, 228 [E904.0];Radium [E903.1];Data Unavailable [DU]"]
[null,null,null,null,null,null,null,null,null,null,null,"RA226228","Radium-226 + Radium-228",null,null,null,null,null,null,null,null,"Radium-228","PCi/L","Radium-228 [SW9320];Data Unavailable [DU]"]
[null,null,null,null,null,null,null,null,null,null,null,"RA-228","Radium-228",null,null,null,null,null,null,null,null,"Rainfall","inches","Data Unavailable [DU]"]
[null,null,null,null,null,null,null,null,null,null,null,"RAINFALL","Rainfall",null,null,null,null,null,null,null,null,"Receiving Water to Effluent Flow Ratio","%","Data Unavailable [DU]"]
[null,null,null,null,null,null,null,null,null,null,null,"RECEFFRAT","Receiving Water to Effluent Flow Ratio",null,null,null,null,null,null,null,null,"River Direction (Upstream = 1; Downstream = -1) ","Up/Down (Up = 1; Down = -1)","Data Unavailable [DU]"]
[null,null,null,null,null,null,null,null,null,null,null,"RIVDIRECT","River Direction (Upstream = 1; Downstream = -1) ",null,null,null,null,null,null,null,null,"Ronnel",{"$f":"$AG$8","v":"kg/L,g/L,mg/L,ppth,ug/L,ng/L,pg/L,mg/cm2,g/day,g/year,kg/day,kg/month,kg/year,lb/day,lbs/week,lbs/month,lbs/year,mg/day,mg/kg,ug/kg,ng/g,ulbs/day,ug/day,t/day"},"Extractable Priority Pollutants [E625];Data Unavailable [DU]"]
[null,null,null,null,null,null,null,null,null,null,null,"RONNEL","Ronnel",null,null,null,null,null,null,null,null,"Rotenone","kg/L,g/L,mg/L,ppth,ug/L,ng/L,pg/L,mg/cm2,g/day,g/year,kg/day,kg/month,kg/year,lb/day,lbs/week,lbs/month,lbs/year,mg/day,mg/kg,ug/kg,ng/g,ulbs/day,ug/day,t/day","Data Unavailable [DU]"]
[null,null,null,null,null,null,null,null,null,null,null,"ROTENONE","Rotenone",null,null,null,null,null,null,null,null,"Salinity","kg/L,g/L,mg/L,ppth,ug/L,ng/L,pg/L,mg/cm2,g/day,g/year,kg/day,kg/month,kg/year,lb/day,lbs/week,lbs/month,lbs/year,mg/day,mg/kg,ug/kg,ng/g,ulbs/day,ug/day,t/day","Standard Method 2520 B: Salinity [A2520B];Data Unavailable [DU]"]
[null,null,null,null,null,null,null,null,null,null,null,"SALINITY","Salinity",null,null,null,null,null,null,null,null,"sec-Butylbenzene","kg/L,g/L,mg/L,ppth,ug/L,ng/L,pg/L,mg/cm2,g/day,g/year,kg/day,kg/month,kg/year,lb/day,lbs/week,lbs/month,lbs/year,mg/day,mg/kg,ug/kg,ng/g,ulbs/day,ug/day,t/day","GC/MS SIM Method [SIM];HISTORICAL: Volatile Organic Compounds by GC/MS [SW8260];Semivolatile Organic Compounds by GC/MS [SW8270C];Volatile Organic Compounds by GC/MS [SW8260B];Data Unavailable [DU]"]
[null,null,null,null,null,null,null,null,null,null,null,"BTBZS","sec-Butylbenzene",null,null,null,null,null,null,null,null,"Selenium, Dissolved","kg/L,g/L,mg/L,ppth,ug/L,ng/L,pg/L,mg/cm2,g/day,g/year,kg/day,kg/month,kg/year,lb/day,lbs/week,lbs/month,lbs/year,mg/day,mg/kg,ug/kg,ng/g,ulbs/day,ug/day,t/day","Trace Elements in Water by Preconcentration and ICP-MS [E1640];Trace Elements in Ambient Waters by ICP-MS [E1638];Atomic Absorption, Platform [E200.9];Inductively Coupled Plasma Emission - modified for CLP [CL200.7];Inductively Coupled Plasma Emission [E200.7];Inductively Coupled Plasma/Mass Spectroscopy [E200.8];Inductively Coupled Plasma-Atomic Emission Spectroscopy [SW6010B];Inductively Coupled Plasma-Mass Spectrometry [SW6020];Metals by Atomic Absorption [E200.0];Selenium (AA, Direct Aspiration) [E270.1];Selenium (AA, Furnace Technique) [SW7740];Selenium (AA, Furnace) - modified for CLP [CL270.2];Selenium (AA, Furnace) [E270.2];Selenium (AA, Hydride) [E270.3];Standard Method (19th) 3113: Metals by Furnace AAS [A3113B];Standard Methods (19th) 3114 B: Metals by Gaseuous Hydride AAS [A3114B];HISTORICAL: Inductively Coupled Plasma-Emission [SW6010];Data Unavailable [DU]"]
[null,null,null,null,null,null,null,null,null,null,"L","SE","Selenium, Dissolved",null,null,null,null,null,null,null,null,"Selenium, Total","kg/L,g/L,mg/L,ppth,ug/L,ng/L,pg/L,mg/cm2,g/day,g/year,kg/day,kg/month,kg/year,lb/day,lbs/week,lbs/month,lbs/year,mg/day,mg/kg,ug/kg,ng/g,ulbs/day,ug/day,t/day","Trace Elements in Water by Preconcentration and ICP-MS [E1640];Trace Elements in Ambient Waters by ICP-MS [E1638];Atomic Absorption, Platform [E200.9];Inductively Coupled Plasma Emission - modified for CLP [CL200.7];Inductively Coupled Plasma Emission [E200.7];Inductively Coupled Plasma/Mass Spectroscopy [E200.8];Inductively Coupled Plasma-Atomic Emission Spectroscopy [SW6010B];Inductively Coupled Plasma-Mass Spectrometry [SW6020];Metals by Atomic Absorption [E200.0];Selenium (AA, Direct Aspiration) [E270.1];Selenium (AA, Furnace Technique) [SW7740];Selenium (AA, Furnace) - modified for CLP [CL270.2];Selenium (AA, Furnace) [E270.2];Selenium (AA, Hydride) [E270.3];Standard Method (19th) 3113: Metals by Furnace AAS [A3113B];Standard Methods (19th) 3114 B: Metals by Gaseuous Hydride AAS [A3114B];HISTORICAL: Inductively Coupled Plasma-Emission [SW6010];Data Unavailable [DU]"]
[null,null,null,null,null,null,null,null,null,null,null,"SE","Selenium, Total",null,null,null,null,null,null,null,null,"Selenium, Total Recoverable","kg/L,g/L,mg/L,ppth,ug/L,ng/L,pg/L,mg/cm2,g/day,g/year,kg/day,kg/month,kg/year,lb/day,lbs/week,lbs/month,lbs/year,mg/day,mg/kg,ug/kg,ng/g,ulbs/day,ug/day,t/day","Trace Elements in Water by Preconcentration and ICP-MS [E1640];Trace Elements in Ambient Waters by ICP-MS [E1638];Atomic Absorption, Platform [E200.9];Inductively Coupled Plasma Emission - modified for CLP [CL200.7];Inductively Coupled Plasma Emission [E200.7];Inductively Coupled Plasma/Mass Spectroscopy [E200.8];Inductively Coupled Plasma-Atomic Emission Spectroscopy [SW6010B];Inductively Coupled Plasma-Mass Spectrometry [SW6020];Metals by Atomic Absorption [E200.0];Selenium (AA, Direct Aspiration) [E270.1];Selenium (AA, Furnace Technique) [SW7740];Selenium (AA, Furnace) - modified for CLP [CL270.2];Selenium (AA, Furnace) [E270.2];Selenium (AA, Hydride) [E270.3];Standard Method (19th) 3113: Metals by Furnace AAS [A3113B];Standard Methods (19th) 3114 B: Metals by Gaseuous Hydride AAS [A3114B];HISTORICAL: Inductively Coupled Plasma-Emission [SW6010];Data Unavailable [DU]"]
[null,null,null,null,null,null,null,null,null,null,"N","SE","Selenium, Total Recoverable",null,null,null,null,null,null,null,null,"Settleable Matter Depth","Feet,inches","Data Unavailable [DU]"]
[null,null,null,null,null,null,null,null,null,null,null,"SETMATDEP","Settleable Matter Depth",null,null,null,null,null,null,null,null,"Settleable Solids","ml/L,ml/L/hr","Settleable Matter [E160.5];Standard Method (19th) 2540 F: Settleable Solids [A2540F];Data Unavailable [DU]"]
[null,null,null,null,null,null,null,null,null,null,null,"SETMAT","Settleable Solids",null,null,null,null,null,null,null,null,"Settleable Solids, Net Value","ml/L,ml/L/hr","Settleable Matter [E160.5];Standard Method (19th) 2540 F: Settleable Solids [A2540F];Data Unavailable [DU]"]
[null,null,null,null,null,null,null,null,null,null,null,"SSNV","Settleable Solids, Net Value",null,null,null,null,null,null,null,null,"Siduron",{"$f":"$AG$8","v":"kg/L,g/L,mg/L,ppth,ug/L,ng/L,pg/L,mg/cm2,g/day,g/year,kg/day,kg/month,kg/year,lb/day,lbs/week,lbs/month,lbs/year,mg/day,mg/kg,ug/kg,ng/g,ulbs/day,ug/day,t/day"},"Data Unavailable [DU]"]
[null,null,null,null,null,null,null,null,null,null,null,"SIDURON","Siduron",null,null,null,null,null,null,null,null,"Silica, Dissolved (as SiO2)","kg/L,g/L,mg/L,ppth,ug/L,ng/L,pg/L,mg/cm2,g/day,g/year,kg/day,kg/month,kg/year,lb/day,lbs/week,lbs/month,lbs/year,mg/day,mg/kg,ug/kg,ng/g,ulbs/day,ug/day,t/day","Inductively Coupled Plasma Emission [E200.7];Inductively Coupled Plasma/Mass Spectroscopy [E200.8];Inductively Coupled Plasma-Atomic Emission Spectroscopy [SW6010B];Silica [E370.1];Data Unavailable [DU]"]
[null,null,null,null,null,null,null,null,null,null,"L","SIL","Silica, Dissolved (as SiO2)",null,null,null,null,null,null,null,null,"Silver, Dissolved","kg/L,g/L,mg/L,ppth,ug/L,ng/L,pg/L,mg/cm2,g/day,g/year,kg/day,kg/month,kg/year,lb/day,lbs/week,lbs/month,lbs/year,mg/day,mg/kg,ug/kg,ng/g,ulbs/day,ug/day,t/day","Trace Elements in Ambient Waters by ICP-MS [E1638];Trace Elements in Water by Preconcentration and ICP-MS [E1640];Atomic Absorption, Platform [E200.9];Inductively Coupled Plasma Emission - modified for CLP [CL200.7];Inductively Coupled Plasma Emission [E200.7];Inductively Coupled Plasma/Mass Spectroscopy [E200.8];Inductively Coupled Plasma-Atomic Emission Spectroscopy [SW6010B];Inductively Coupled Plasma-Mass Spectrometry [SW6020];Metals by Atomic Absorption [E200.0];Silver (AA, Direct Aspiration) [E272.1];Silver (AA, Furnace Technique) [SW7761];Silver (AA, Furnace) [E272.2];Standard Method (19th) 3111 B: Metals, Direct Air-Acetylene Flame [A3111B];Standard Method (19th) 3113: Metals by Electrothermal AAS [A3113];Standard Method (19th) 3113: Metals by Furnace AAS [A3113B];HISTORICAL: Inductively Coupled Plasma-Emission [SW6010];Data Unavailable [DU]"]
[null,null,null,null,null,null,null,null,null,null,"L","AG","Silver, Dissolved",null,null,null,null,null,null,null,null,"Silver, Total","kg/L,g/L,mg/L,ppth,ug/L,ng/L,pg/L,mg/cm2,g/day,g/year,kg/day,kg/month,kg/year,lb/day,lbs/week,lbs/month,lbs/year,mg/day,mg/kg,ug/kg,ng/g,ulbs/day,ug/day,t/day","Trace Elements in Ambient Waters by ICP-MS [E1638];Trace Elements in Water by Preconcentration and ICP-MS [E1640];Atomic Absorption, Platform [E200.9];Inductively Coupled Plasma Emission - modified for CLP [CL200.7];Inductively Coupled Plasma Emission [E200.7];Inductively Coupled Plasma/Mass Spectroscopy [E200.8];Inductively Coupled Plasma-Atomic Emission Spectroscopy [SW6010B];Inductively Coupled Plasma-Mass Spectrometry [SW6020];Metals by Atomic Absorption [E200.0];Silver (AA, Direct Aspiration) [E272.1];Silver (AA, Furnace Technique) [SW7761];Silver (AA, Furnace) [E272.2];Standard Method (19th) 3111 B: Metals, Direct Air-Acetylene Flame [A3111B];Standard Method (19th) 3113: Metals by Electrothermal AAS [A3113];Standard Method (19th) 3113: Metals by Furnace AAS [A3113B];HISTORICAL: Inductively Coupled Plasma-Emission [SW6010];Data Unavailable [DU]"]
[null,null,null,null,null,null,null,null,null,null,null,"AG","Silver, Total",null,null,null,null,null,null,null,null,"Silver, Total Recoverable","kg/L,g/L,mg/L,ppth,ug/L,ng/L,pg/L,mg/cm2,g/day,g/year,kg/day,kg/month,kg/year,lb/day,lbs/week,lbs/month,lbs/year,mg/day,mg/kg,ug/kg,ng/g,ulbs/day,ug/day,t/day","Trace Elements in Ambient Waters by ICP-MS [E1638];Trace Elements in Water by Preconcentration and ICP-MS [E1640];Atomic Absorption, Platform [E200.9];Inductively Coupled Plasma Emission - modified for CLP [CL200.7];Inductively Coupled Plasma Emission [E200.7];Inductively Coupled Plasma/Mass Spectroscopy [E200.8];Inductively Coupled Plasma-Atomic Emission Spectroscopy [SW6010B];Inductively Coupled Plasma-Mass Spectrometry [SW6020];Metals by Atomic Absorption [E200.0];Silver (AA, Direct Aspiration) [E272.1];Silver (AA, Furnace Technique) [SW7761];Silver (AA, Furnace) [E272.2];Standard Method (19th) 3111 B: Metals, Direct Air-Acetylene Flame [A3111B];Standard Method (19th) 3113: Metals by Electrothermal AAS [A3113];Standard Method (19th) 3113: Metals by Furnace AAS [A3113B];HISTORICAL: Inductively Coupled Plasma-Emission [SW6010];Data Unavailable [DU]"]
[null,null,null,null,null,null,null,null,null,null,"N","AG","Silver, Total Recoverable",null,null,null,null,null,null,null,null,"Simazine","kg/L,g/L,mg/L,ppth,ug/L,ng/L,pg/L,mg/cm2,g/day,g/year,kg/day,kg/month,kg/year,lb/day,lbs/week,lbs/month,lbs/year,mg/day,mg/kg,ug/kg,ng/g,ulbs/day,ug/day,t/day","Determination of Asbestos Structures (>10um) in Drinking Water [E100.2];Nitrogen- & Phosphorus-Containing Pest. in Water by GC [E507];Organic Compounds in Drinking Water by LSE & CCGC/MS [E525.2];Data Unavailable [DU]"]
[null,null,null,null,null,null,null,null,null,null,null,"SIMAZINE","Simazine",null,null,null,null,null,null,null,null,"Sodium Bisulfite","kg/L,g/L,mg/L,ppth,ug/L,ng/L,pg/L,mg/cm2,g/day,g/year,kg/day,kg/month,kg/year,lb/day,lbs/week,lbs/month,lbs/year,mg/day,mg/kg,ug/kg,ng/g,ulbs/day,ug/day,t/day","Sulfite [E377.1];Data Unavailable [DU]"]
[null,null,null,null,null,null,null,null,null,null,null,"NAHSO3","Sodium Bisulfite",null,null,null,null,null,null,null,null,"Sodium, %","%","Data Unavailable [DU]"]
[null,null,null,null,null,null,null,null,null,null,"U","NA","Sodium, %",null,null,null,null,null,null,null,null,"Sodium, Dissolved",{"$f":"$AG$8","v":"kg/L,g/L,mg/L,ppth,ug/L,ng/L,pg/L,mg/cm2,g/day,g/year,kg/day,kg/month,kg/year,lb/day,lbs/week,lbs/month,lbs/year,mg/day,mg/kg,ug/kg,ng/g,ulbs/day,ug/day,t/day"},"Inductively Coupled Plasma Emission - modified for CLP [CL200.7];Inductively Coupled Plasma Emission [E200.7];Inductively Coupled Plasma/Mass Spectroscopy [E200.8];Inductively Coupled Plasma-Atomic Emission Spectroscopy [SW6010B];Metals by Atomic Absorption [E200.0];Sodium (AA, Direct Aspiration) - modified for CLP [CL273.1];Sodium (AA, Direct Aspiration) [E273.1];Sodium (AA, Direct Aspiration) [SW7770];Sodium (AA, Furnace Technique) [E273.2];Standard Method (19th) 3111 B: Metals, Direct Air-Acetylene Flame [A3111B];Data Unavailable [DU]"]
[null,null,null,null,null,null,null,null,null,null,"L","NA","Sodium, Dissolved",null,null,null,null,null,null,null,null,"Sodium, Total","kg/L,g/L,mg/L,ppth,ug/L,ng/L,pg/L,mg/cm2,g/day,g/year,kg/day,kg/month,kg/year,lb/day,lbs/week,lbs/month,lbs/year,mg/day,mg/kg,ug/kg,ng/g,ulbs/day,ug/day,t/day","Inductively Coupled Plasma Emission - modified for CLP [CL200.7];Inductively Coupled Plasma Emission [E200.7];Inductively Coupled Plasma/Mass Spectroscopy [E200.8];Inductively Coupled Plasma-Atomic Emission Spectroscopy [SW6010B];Metals by Atomic Absorption [E200.0];Sodium (AA, Direct Aspiration) - modified for CLP [CL273.1];Sodium (AA, Direct Aspiration) [E273.1];Sodium (AA, Direct Aspiration) [SW7770];Sodium (AA, Furnace Technique) [E273.2];Standard Method (19th) 3111 B: Metals, Direct Air-Acetylene Flame [A3111B];Data Unavailable [DU]"]
[null,null,null,null,null,null,null,null,null,null,null,"NA","Sodium, Total",null,null,null,null,null,null,null,null,"Sodium, Total Recoverable","kg/L,g/L,mg/L,ppth,ug/L,ng/L,pg/L,mg/cm2,g/day,g/year,kg/day,kg/month,kg/year,lb/day,lbs/week,lbs/month,lbs/year,mg/day,mg/kg,ug/kg,ng/g,ulbs/day,ug/day,t/day","Inductively Coupled Plasma Emission - modified for CLP [CL200.7];Inductively Coupled Plasma Emission [E200.7];Inductively Coupled Plasma/Mass Spectroscopy [E200.8];Inductively Coupled Plasma-Atomic Emission Spectroscopy [SW6010B];Metals by Atomic Absorption [E200.0];Sodium (AA, Direct Aspiration) - modified for CLP [CL273.1];Sodium (AA, Direct Aspiration) [E273.1];Sodium (AA, Direct Aspiration) [SW7770];Sodium (AA, Furnace Technique) [E273.2];Standard Method (19th) 3111 B: Metals, Direct Air-Acetylene Flame [A3111B];Data Unavailable [DU]"]
[null,null,null,null,null,null,null,null,null,null,"N","NA","Sodium, Total Recoverable",null,null,null,null,null,null,null,null,"Soluble Biochemical Oxygen Demand (5-day @ 20 Deg. C)","kg/L,g/L,mg/L,ppth,ug/L,ng/L,pg/L,mg/cm2,g/day,g/year,kg/day,kg/month,kg/year,lb/day,lbs/week,lbs/month,lbs/year,mg/day,mg/kg,ug/kg,ng/g,ulbs/day,ug/day,t/day","Standard Method (18th & 19th) 5210 B: 5-Day BOD Test [A5210B];Data Unavailable [DU]"]
[null,null,null,null,null,null,null,null,null,null,null,"SBOD","Soluble Biochemical Oxygen Demand (5-day @ 20 Deg. C)",null,null,null,null,null,null,null,null,"Soluble Chemical Oxygen Demand","kg/L,g/L,mg/L,ppth,ug/L,ng/L,pg/L,mg/cm2,g/day,g/year,kg/day,kg/month,kg/year,lb/day,lbs/week,lbs/month,lbs/year,mg/day,mg/kg,ug/kg,ng/g,ulbs/day,ug/day,t/day","Standard Method (19th) 5220 D: COD Closed Reflux, Colorimetric [A5220D];Data Unavailable [DU]"]
[null,null,null,null,null,null,null,null,null,null,null,"SCOD","Soluble Chemical Oxygen Demand",null,null,null,null,null,null,null,null,"Stirophos","kg/L,g/L,mg/L,ppth,ug/L,ng/L,pg/L,mg/cm2,g/day,g/year,kg/day,kg/month,kg/year,lb/day,lbs/week,lbs/month,lbs/year,mg/day,mg/kg,ug/kg,ng/g,ulbs/day,ug/day,t/day","Determination of Organophosphorus Pesticides [E614];Extractable Priority Pollutants [E625];Organochlorine Pesticides and PCBs [E608];Data Unavailable [DU]"]
[null,null,null,null,null,null,null,null,null,null,null,"STIROFOS","Stirophos",null,null,null,null,null,null,null,null,"Strontium, Dissolved","mg/L","Inductively Coupled Plasma Emission [E200.7];Data Unavailable [DU]"]
[null,null,null,null,null,null,null,null,null,null,"L","SR","Strontium, Dissolved",null,null,null,null,null,null,null,null,"Strontium, Total","mg/L","Inductively Coupled Plasma Emission [E200.7];Data Unavailable [DU]"]
[null,null,null,null,null,null,null,null,null,null,null,"SRTOT","Strontium, Total",null,null,null,null,null,null,null,null,"Strontium-90","PCi/L","Radioactive Strontium in Water [E905.0];Strontium (AA, Direct Aspiration) [SW7780];Data Unavailable [DU]"]
[null,null,null,null,null,null,null,null,null,null,null,"SR-90","Strontium-90",null,null,null,null,null,null,null,null,"Styrene",{"$f":"$AG$8","v":"kg/L,g/L,mg/L,ppth,ug/L,ng/L,pg/L,mg/cm2,g/day,g/year,kg/day,kg/month,kg/year,lb/day,lbs/week,lbs/month,lbs/year,mg/day,mg/kg,ug/kg,ng/g,ulbs/day,ug/day,t/day"},"GC/MS SIM Method [SIM];HISTORICAL: Volatile Organic Compounds by GC/MS [SW8260];Semivolatile Organic Compounds by GC/MS [SW8270C];Sulfate [E375.4];Volatile Organic Compounds by GC/MS [SW8260B];Volatile Organic Compounds by Purge and Trap [E524.2];Volatile Organic Compounds EPA Method 624 [E624];Purgeables by GC/MS [E624.1];Data Unavailable [DU]"]
[null,null,null,null,null,null,null,null,null,null,null,"STY","Styrene",null,null,null,null,null,null,null,null,"Sulfate, Total (as S)","kg/L,g/L,mg/L,ppth,ug/L,ng/L,pg/L,mg/cm2,g/day,g/year,kg/day,kg/month,kg/year,lb/day,lbs/week,lbs/month,lbs/year,mg/day,mg/kg,ug/kg,ng/g,ulbs/day,ug/day,t/day","Determination of Inorganic Anions by Ion Chromatography [SW9056];Inorganic Anions by Ion Chromatography [E300.0];Inorganic Anions by Ion Chromatography [E300.1];Inorganic Anions by Ion Chromatography, Part A [E300A];Sulfate (Turbidimetric) [SW9038];Sulfate [E375.1];Sulfate [E375.2];Sulfate [E375.3];Sulfate [E375.4];Data Unavailable [DU]"]
[null,null,null,null,null,null,null,null,null,null,null,"SO4S","Sulfate, Total (as S)",null,null,null,null,null,null,null,null,"Sulfate, Total (as SO4)","kg/L,g/L,mg/L,ppth,ug/L,ng/L,pg/L,mg/cm2,g/day,g/year,kg/day,kg/month,kg/year,lb/day,lbs/week,lbs/month,lbs/year,mg/day,mg/kg,ug/kg,ng/g,ulbs/day,ug/day,t/day","Determination of Inorganic Anions by Ion Chromatography [SW9056];Inorganic Anions by Ion Chromatography [E300.0];Inorganic Anions by Ion Chromatography [E300.1];Inorganic Anions by Ion Chromatography, Part A [E300A];Sulfate (Turbidimetric) [SW9038];Sulfate [E375.1];Sulfate [E375.2];Sulfate [E375.3];Sulfate [E375.4];Data Unavailable [DU]"]
[null,null,null,null,null,null,null,null,null,null,null,"SO4","Sulfate, Total (as SO4)",null,null,null,null,null,null,null,null,"Sulfide, Dissolved (as S)","kg/L,g/L,mg/L,ppth,ug/L,ng/L,pg/L,mg/cm2,g/day,g/year,kg/day,kg/month,kg/year,lb/day,lbs/week,lbs/month,lbs/year,mg/day,mg/kg,ug/kg,ng/g,ulbs/day,ug/day,t/day","Acid-Soluble and Acid-Insoluble Sulfides: Distillation [SW9030B];Standard Method (18th) 4500-S E: Sulfide by Gas Dialysis [A4500SE];Standard Method (19th) 4500-S B: Sep. of Sol./Insol. Sulfides [A4500SB];Standard Method (19th) 4500-S D: Methylene Blue Method [A4500SD];Standard Method (19th) 4500-S F: Sulfide by Iodometric Method [A4500SF];Sulfide [E376.1];Sulfide [E376.2];SW-846, Chapter 7.3: Cyanide/Sulfide Reactivity [SW7.3];Titrimetric Proc. for Acid-Soluble/Insoluble Sulfides [SW9034];Data Unavailable [DU]"]
[null,null,null,null,null,null,null,null,null,null,null,"DS","Sulfide, Dissolved (as S)",null,null,null,null,null,null,null,null,"Sulfide, Total (as S)","kg/L,g/L,mg/L,ppth,ug/L,ng/L,pg/L,mg/cm2,g/day,g/year,kg/day,kg/month,kg/year,lb/day,lbs/week,lbs/month,lbs/year,mg/day,mg/kg,ug/kg,ng/g,ulbs/day,ug/day,t/day","Acid-Soluble and Acid-Insoluble Sulfides: Distillation [SW9030B];Standard Method (18th) 4500-S E: Sulfide by Gas Dialysis [A4500SE];Standard Method (19th) 4500-S B: Sep. of Sol./Insol. Sulfides [A4500SB];Standard Method (19th) 4500-S D: Methylene Blue Method [A4500SD];Standard Method (19th) 4500-S F: Sulfide by Iodometric Method [A4500SF];Sulfide [E376.1];Sulfide [E376.2];SW-846, Chapter 7.3: Cyanide/Sulfide Reactivity [SW7.3];Titrimetric Proc. for Acid-Soluble/Insoluble Sulfides [SW9034];Data Unavailable [DU]"]
[null,null,null,null,null,null,null,null,null,null,null,"S","Sulfide, Total (as S)",null,null,null,null,null,null,null,null,"Sulfite (as SO3)","kg/L,g/L,mg/L,ppth,ug/L,ng/L,pg/L,mg/cm2,g/day,g/year,kg/day,kg/month,kg/year,lb/day,lbs/week,lbs/month,lbs/year,mg/day,mg/kg,ug/kg,ng/g,ulbs/day,ug/day,t/day","Sulfite [E377.1];Data Unavailable [DU]"]
[null,null,null,null,null,null,null,null,null,null,null,"SO3","Sulfite (as SO3)",null,null,null,null,null,null,null,null,"Sulfotepp","kg/L,g/L,mg/L,ppth,ug/L,ng/L,pg/L,mg/cm2,g/day,g/year,kg/day,kg/month,kg/year,lb/day,lbs/week,lbs/month,lbs/year,mg/day,mg/kg,ug/kg,ng/g,ulbs/day,ug/day,t/day","Data Unavailable [DU]"]
[null,null,null,null,null,null,null,null,null,null,null,"SULFOTEP","Sulfotepp",null,null,null,null,null,null,null,null,"Sulfur Dioxide","kg/L,g/L,mg/L,ppth,ug/L,ng/L,pg/L,mg/cm2,g/day,g/year,kg/day,kg/month,kg/year,lb/day,lbs/week,lbs/month,lbs/year,mg/day,mg/kg,ug/kg,ng/g,ulbs/day,ug/day,t/day","Standard Method 5540 C: Determ. of Methylene Blue Active Subst. [A5540C];Data Unavailable [DU]"]
[null,null,null,null,null,null,null,null,null,null,null,"SO2","Sulfur Dioxide",null,null,null,null,null,null,null,null,"Sum of 41 Congeners","kg/L,g/L,mg/L,ppth,ug/L,ng/L,pg/L,mg/cm2,g/day,g/year,kg/day,kg/month,kg/year,lb/day,lbs/week,lbs/month,lbs/year,mg/day,mg/kg,ug/kg,ng/g,ulbs/day,ug/day,t/day","Chlorinated Biphenyl Congeners in Multiple Matrices by HRGC/HRMS (2010) [E1668C];Data Unavailable [DU]"]
[null,null,null,null,null,null,null,null,null,null,null,"PCBSUM41REG4","Sum of 41 Congeners",null,null,null,null,null,null,null,null,"Surface Loading Rate","gpm/sqft","Data Unavailable [DU]"]
[null,null,null,null,null,null,null,null,null,null,null,"SLR","Surface Loading Rate",null,null,null,null,null,null,null,null,"Swep",{"$f":"$AG$8","v":"kg/L,g/L,mg/L,ppth,ug/L,ng/L,pg/L,mg/cm2,g/day,g/year,kg/day,kg/month,kg/year,lb/day,lbs/week,lbs/month,lbs/year,mg/day,mg/kg,ug/kg,ng/g,ulbs/day,ug/day,t/day"},"Data Unavailable [DU]"]
[null,null,null,null,null,null,null,null,null,null,null,"SWEP","Swep",null,null,null,null,null,null,null,null,"Tannin and Lignin",{"$f":"$AG$8","v":"kg/L,g/L,mg/L,ppth,ug/L,ng/L,pg/L,mg/cm2,g/day,g/year,kg/day,kg/month,kg/year,lb/day,lbs/week,lbs/month,lbs/year,mg/day,mg/kg,ug/kg,ng/g,ulbs/day,ug/day,t/day"},"Halogenated Volatile Organics by Headspace [3810HVO];Standard Method 5550 B: Tannin and Lignin [A5550B];Data Unavailable [DU]"]
[null,null,null,null,null,null,null,null,null,null,null,"TAL","Tannin and Lignin",null,null,null,null,null,null,null,null,"TCDD Equivalents",{"$f":"$AG$8","v":"kg/L,g/L,mg/L,ppth,ug/L,ng/L,pg/L,mg/cm2,g/day,g/year,kg/day,kg/month,kg/year,lb/day,lbs/week,lbs/month,lbs/year,mg/day,mg/kg,ug/kg,ng/g,ulbs/day,ug/day,t/day"},"Extractable Priority Pollutants [E625];HIST:Polychlorinated Dibenzodioxins/Polychlorinated Dibenzofurans [SW8280];Organochlorine Pesticides and PCBs [E608];Organochlorine Pesticides by Gas Chromatography [SW8081A];Polychlorinated Dibenzodioxins/Polychlorinated Dibenzofurans [SW8280A];Polychlorinated Dibenzodioxins/Polychlorinated Dibenzofurans [SW8290];Tetra thru Octa-Chlorinated Dioxins and Furans by Isotope Dilutin [E1613A];Tetra-through Octa-Chlorinated Dioxins and Furans by HRGC/HRMS [E1613B];Data Unavailable [DU]"]
[null,null,null,null,null,null,null,null,null,null,null,"TCDDEQUIVS","TCDD Equivalents",null,null,null,null,null,null,null,null,"Temp Diff b/n Intake and Discharge","Degrees C,Degrees F","Standard Method (19th) 2550 B: Temperature, Lab and Field Methods [A2550B];Temperature [E170.1];Data Unavailable [DU]"]
[null,null,null,null,null,null,null,null,null,null,null,"TEMPDIFFID","Temp Diff b/n Intake and Discharge",null,null,null,null,null,null,null,null,"Temperature","Degrees C,Degrees F","Standard Method (19th) 2550 B: Temperature, Lab and Field Methods [A2550B];Temperature [E170.1];Data Unavailable [DU]"]
[null,null,null,null,null,null,null,null,null,null,null,"TEMP","Temperature",null,null,null,null,null,null,null,null,"TEPP",{"$f":"$AG$8","v":"kg/L,g/L,mg/L,ppth,ug/L,ng/L,pg/L,mg/cm2,g/day,g/year,kg/day,kg/month,kg/year,lb/day,lbs/week,lbs/month,lbs/year,mg/day,mg/kg,ug/kg,ng/g,ulbs/day,ug/day,t/day"},"Data Unavailable [DU]"]
[null,null,null,null,null,null,null,null,null,null,null,"TEPP","TEPP",null,null,null,null,null,null,null,null,"Terbium","kg/L,g/L,mg/L,ppth,ug/L,ng/L,pg/L,mg/cm2,g/day,g/year,kg/day,kg/month,kg/year,lb/day,lbs/week,lbs/month,lbs/year,mg/day,mg/kg,ug/kg,ng/g,ulbs/day,ug/day,t/day","Inductively Coupled Plasma Emission - modified for CLP [CL200.7];Inductively Coupled Plasma Emission [E200.7];Inductively Coupled Plasma/Mass Spectroscopy [E200.8];Inductively Coupled Plasma-Atomic Emission Spectroscopy [SW6010B];Iron (AA, Direct Aspiration) [E236.1];Iron (AA, Direct Aspiration) [SW7380];Iron (AA, Furnace Technique) [E236.2];Lovely/Phillips (1987) Rapid Assay for Microbially Reducible Fe3+ [LPFE3];Metals by Atomic Absorption [E200.0];Standard Method (19th) 3111 B: Metals, Direct Air-Acetylene Flame [A3111B];Standard Method (19th) 3113: Metals by Furnace AAS [A3113B];Standard Method (19th) 3500-Fe D: Penanthroline Method [A3500FE];Data Unavailable [DU]"]
[null,null,null,null,null,null,null,null,null,null,null,"TB","Terbium",null,null,null,null,null,null,null,null,"Terbufos","kg/L,g/L,mg/L,ppth,ug/L,ng/L,pg/L,mg/cm2,g/day,g/year,kg/day,kg/month,kg/year,lb/day,lbs/week,lbs/month,lbs/year,mg/day,mg/kg,ug/kg,ng/g,ulbs/day,ug/day,t/day","Semivolatile Organic Compounds by GC/MS [SW8270C];Data Unavailable [DU]"]
[null,null,null,null,null,null,null,null,null,null,null,"TERBUFOS","Terbufos",null,null,null,null,null,null,null,null,"Terphenyl-d14","kg/L,g/L,mg/L,ppth,ug/L,ng/L,pg/L,mg/cm2,g/day,g/year,kg/day,kg/month,kg/year,lb/day,lbs/week,lbs/month,lbs/year,mg/day,mg/kg,ug/kg,ng/g,ulbs/day,ug/day,t/day","Extractable Priority Pollutants [E625];Base/Neutrals and Acids by GC/MS [E625.1];Semivolatile Organic Compounds by GC/MS [SW8270C];Data Unavailable [DU]"]
[null,null,null,null,null,null,null,null,null,null,null,"PHEND14","Terphenyl-d14",null,null,null,null,null,null,null,null,"Tert-Amyl Methyl Ether (TAME)","kg/L,g/L,mg/L,ppth,ug/L,ng/L,pg/L,mg/cm2,g/day,g/year,kg/day,kg/month,kg/year,lb/day,lbs/week,lbs/month,lbs/year,mg/day,mg/kg,ug/kg,ng/g,ulbs/day,ug/day,t/day","GC/MS SIM Method [SIM];Semivolatile Organic Compounds by GC/MS [SW8270C];Volatile Organic Compounds by GC/MS [SW8260B];Data Unavailable [DU]"]
[null,null,null,null,null,null,null,null,null,null,null,"TAME","Tert-Amyl Methyl Ether (TAME)",null,null,null,null,null,null,null,null,"Tert-Butyl Alcohol (TBA)","kg/L,g/L,mg/L,ppth,ug/L,ng/L,pg/L,mg/cm2,g/day,g/year,kg/day,kg/month,kg/year,lb/day,lbs/week,lbs/month,lbs/year,mg/day,mg/kg,ug/kg,ng/g,ulbs/day,ug/day,t/day","GC/MS SIM Method [SIM];Semivolatile Organic Compounds by GC/MS [SW8270C];Volatile Organic Compounds by GC/MS [SW8260B];Volatile Organic Compounds by Purge and Trap [E524.2];Volatile Organic Compounds EPA Method 624 [E624];Data Unavailable [DU]"]
[null,null,null,null,null,null,null,null,null,null,null,"TBA","Tert-Butyl Alcohol (TBA)",null,null,null,null,null,null,null,null,"tert-Butylbenzene","kg/L,g/L,mg/L,ppth,ug/L,ng/L,pg/L,mg/cm2,g/day,g/year,kg/day,kg/month,kg/year,lb/day,lbs/week,lbs/month,lbs/year,mg/day,mg/kg,ug/kg,ng/g,ulbs/day,ug/day,t/day","GC/MS SIM Method [SIM];HISTORICAL: Volatile Organic Compounds by GC/MS [SW8260];Semivolatile Organic Compounds by GC/MS [SW8270C];Volatile Organic Compounds by GC/MS [SW8260B];Volatile Organic Compounds EPA Method 624 [E624];Data Unavailable [DU]"]
[null,null,null,null,null,null,null,null,null,null,null,"BTBZT","tert-Butylbenzene",null,null,null,null,null,null,null,null,"Tetrachloroethene","kg/L,g/L,mg/L,ppth,ug/L,ng/L,pg/L,mg/cm2,g/day,g/year,kg/day,kg/month,kg/year,lb/day,lbs/week,lbs/month,lbs/year,mg/day,mg/kg,ug/kg,ng/g,ulbs/day,ug/day,t/day","Extractable Priority Pollutants [E625];Extractable Priority Pollutants by GC/MS SIM [E625SIM];GC/MS SIM Method [SIM];HISTORICAL: Volatile Organic Compounds by GC/MS [SW8260];Organochlorine Pesticides and PCBs [E608];Organochlorine Pesticides by Gas Chromatography [SW8081A];Polychlorinated Biphenyls (PCBs) by Gas Chromatography [SW8082];Semivolatile Organic Compounds by GC/MS [SW8270C];VOCs by GC/MS Fuel Additives Plus BTEX [8260FAB];Volatile Organic Compounds by GC/MS - Open Scan [8260BOS];Volatile Organic Compounds by GC/MS [SW8260B];Volatile Organic Compounds by GC/MS SIM [8260SIM];Volatile Organic Compounds by Purge and Trap [E524.2];Volatile Organic Compounds EPA Method 624 [E624];Purgeables by GC/MS [E624.1];Data Unavailable [DU]"]
[null,null,null,null,null,null,null,null,null,null,null,"PCE","Tetrachloroethene",null,null,null,null,null,null,null,null,"Tetrachloro-m-xylene","kg/L,g/L,mg/L,ppth,ug/L,ng/L,pg/L,mg/cm2,g/day,g/year,kg/day,kg/month,kg/year,lb/day,lbs/week,lbs/month,lbs/year,mg/day,mg/kg,ug/kg,ng/g,ulbs/day,ug/day,t/day","Organochlorine Pesticides and PCBs [E608];Organochlorine Pesticides and PCBs by GC/HSD [E608.3];Organochlorine Pesticides by Gas Chromatography [SW8081A];Polychlorinated Biphenyls (PCBs) by Gas Chromatography [SW8082];Data Unavailable [DU]"]
[null,null,null,null,null,null,null,null,null,null,null,"TECMXYL","Tetrachloro-m-xylene",null,null,null,null,null,null,null,null,"Tetryl","ug/L","Nitroaromatics, Nitramines, and Nitrate Esters by HPLC [SW8330B];Data Unavailable [DU]"]
[null,null,null,null,null,null,null,null,null,null,null,"TETRYL","Tetryl",null,null,null,null,null,null,null,null,"Thallium, Dissolved",{"$f":"$AG$8","v":"kg/L,g/L,mg/L,ppth,ug/L,ng/L,pg/L,mg/cm2,g/day,g/year,kg/day,kg/month,kg/year,lb/day,lbs/week,lbs/month,lbs/year,mg/day,mg/kg,ug/kg,ng/g,ulbs/day,ug/day,t/day"},"Trace Elements in Water by Preconcentration and ICP-MS [E1640];Trace Elements in Ambient Waters by ICP-MS [E1638];Atomic Absorption, Platform [E200.9];Inductively Coupled Plasma Emission - modified for CLP [CL200.7];Inductively Coupled Plasma Emission [E200.7];Inductively Coupled Plasma/Mass Spectroscopy [E200.8];Inductively Coupled Plasma-Atomic Emission Spectroscopy [SW6010B];Inductively Coupled Plasma-Mass Spectrometry [SW6020];Metals by Atomic Absorption [E200.0];Standard Method (19th) 3111 B: Metals, Direct Air-Acetylene Flame [A3111B];Standard Method (19th) 3113: Metals by Electrothermal AAS [A3113];Thallium (AA, Direct Aspiration) [SW7840];Thallium (AA, Furnace) [E279.2];Thallium (AA, Furnace) - modified for CLP [CL279.2];HISTORICAL: Inductively Coupled Plasma-Emission [SW6010];Data Unavailable [DU]"]
[null,null,null,null,null,null,null,null,null,null,"L","TL","Thallium, Dissolved",null,null,null,null,null,null,null,null,"Thallium, Total",{"$f":"$AG$8","v":"kg/L,g/L,mg/L,ppth,ug/L,ng/L,pg/L,mg/cm2,g/day,g/year,kg/day,kg/month,kg/year,lb/day,lbs/week,lbs/month,lbs/year,mg/day,mg/kg,ug/kg,ng/g,ulbs/day,ug/day,t/day"},"Trace Elements in Water by Preconcentration and ICP-MS [E1640];Trace Elements in Ambient Waters by ICP-MS [E1638];Atomic Absorption, Platform [E200.9];Inductively Coupled Plasma Emission - modified for CLP [CL200.7];Inductively Coupled Plasma Emission [E200.7];Inductively Coupled Plasma/Mass Spectroscopy [E200.8];Inductively Coupled Plasma-Atomic Emission Spectroscopy [SW6010B];Inductively Coupled Plasma-Mass Spectrometry [SW6020];Metals by Atomic Absorption [E200.0];Standard Method (19th) 3111 B: Metals, Direct Air-Acetylene Flame [A3111B];Standard Method (19th) 3113: Metals by Electrothermal AAS [A3113];Thallium (AA, Direct Aspiration) [SW7840];Thallium (AA, Furnace) [E279.2];Thallium (AA, Furnace) - modified for CLP [CL279.2];HISTORICAL: Inductively Coupled Plasma-Emission [SW6010];Data Unavailable [DU]"]
[null,null,null,null,null,null,null,null,null,null,null,"TL","Thallium, Total",null,null,null,null,null,null,null,null,"Thallium, Total Recoverable",{"$f":"$AG$8","v":"kg/L,g/L,mg/L,ppth,ug/L,ng/L,pg/L,mg/cm2,g/day,g/year,kg/day,kg/month,kg/year,lb/day,lbs/week,lbs/month,lbs/year,mg/day,mg/kg,ug/kg,ng/g,ulbs/day,ug/day,t/day"},"Trace Elements in Water by Preconcentration and ICP-MS [E1640];Trace Elements in Ambient Waters by ICP-MS [E1638];Atomic Absorption, Platform [E200.9];Inductively Coupled Plasma Emission - modified for CLP [CL200.7];Inductively Coupled Plasma Emission [E200.7];Inductively Coupled Plasma/Mass Spectroscopy [E200.8];Inductively Coupled Plasma-Atomic Emission Spectroscopy [SW6010B];Inductively Coupled Plasma-Mass Spectrometry [SW6020];Metals by Atomic Absorption [E200.0];Standard Method (19th) 3111 B: Metals, Direct Air-Acetylene Flame [A3111B];Standard Method (19th) 3113: Metals by Electrothermal AAS [A3113];Thallium (AA, Direct Aspiration) [SW7840];Thallium (AA, Furnace) [E279.2];Thallium (AA, Furnace) - modified for CLP [CL279.2];HISTORICAL: Inductively Coupled Plasma-Emission [SW6010];Data Unavailable [DU]"]
[null,null,null,null,null,null,null,null,null,null,"N","TL","Thallium, Total Recoverable",null,null,null,null,null,null,null,null,"Thiobencarb",{"$f":"$AG$8","v":"kg/L,g/L,mg/L,ppth,ug/L,ng/L,pg/L,mg/cm2,g/day,g/year,kg/day,kg/month,kg/year,lb/day,lbs/week,lbs/month,lbs/year,mg/day,mg/kg,ug/kg,ng/g,ulbs/day,ug/day,t/day"},"Determination of Organophosphorus Pesticides [E614];Nitrogen- & Phosphorus-Containing Pest. in Water by GC [E507];Organic Compounds in Drinking Water by LSE & CCGC/MS [E525.2];Data Unavailable [DU]"]
[null,null,null,null,null,null,null,null,null,null,null,"THIOBENCARB","Thiobencarb",null,null,null,null,null,null,null,null,"Thionazin",{"$f":"$AG$8","v":"kg/L,g/L,mg/L,ppth,ug/L,ng/L,pg/L,mg/cm2,g/day,g/year,kg/day,kg/month,kg/year,lb/day,lbs/week,lbs/month,lbs/year,mg/day,mg/kg,ug/kg,ng/g,ulbs/day,ug/day,t/day"},"Data Unavailable [DU]"]
[null,null,null,null,null,null,null,null,null,null,null,"ZINOPHOS","Thionazin",null,null,null,null,null,null,null,null,"Thorium-227","PCi/L","Gamm-Emitting Radionuclides in Drinking Water;Data Unavailable [DU]"]
[null,null,null,null,null,null,null,null,null,null,null,"TH-227","Thorium-227",null,null,null,null,null,null,null,null,"Thorium-228","PCi/L","Isotopic Thorium by Alpha Spectroscopy;Data Unavailable [DU]"]
[null,null,null,null,null,null,null,null,null,null,null,"TH-228","Thorium-228",null,null,null,null,null,null,null,null,"Thorium-230","PCi/L","Isotopic Thorium by Alpha Spectroscopy;Data Unavailable [DU]"]
[null,null,null,null,null,null,null,null,null,null,null,"TH-230","Thorium-230",null,null,null,null,null,null,null,null,"Thorium-232","PCi/L","Isotopic Thorium by Alpha Spectroscopy;Data Unavailable [DU]"]
[null,null,null,null,null,null,null,null,null,null,null,"TH-232","Thorium-232",null,null,null,null,null,null,null,null,"Tin, Dissolved",{"$f":"$AG$8","v":"kg/L,g/L,mg/L,ppth,ug/L,ng/L,pg/L,mg/cm2,g/day,g/year,kg/day,kg/month,kg/year,lb/day,lbs/week,lbs/month,lbs/year,mg/day,mg/kg,ug/kg,ng/g,ulbs/day,ug/day,t/day"},"Tin (AA, Direct Aspiration) [E282.1];Atomic Absorption, Furnace [E282.2];Inductively Coupled Plasma Emission [E200.7];Inductively Coupled Plasma/Mass Spectroscopy [E200.8];Standard Method (19th) 3111 B: Metals, Direct Air-Acetylene Flame [A3111B];Standard Method (19th) 3113: Metals by Electrothermal AAS [A3113];Standard Method (19th) 3113: Metals by Furnace AAS [A3113B];HISTORICAL: Inductively Coupled Plasma-Emission [SW6010];Data Unavailable [DU]"]
[null,null,null,null,null,null,null,null,null,null,"L","SN","Tin, Dissolved",null,null,null,null,null,null,null,null,"Tin, Total","kg/L,g/L,mg/L,ppth,ug/L,ng/L,pg/L,mg/cm2,g/day,g/year,kg/day,kg/month,kg/year,lb/day,lbs/week,lbs/month,lbs/year,mg/day,mg/kg,ug/kg,ng/g,ulbs/day,ug/day,t/day","Tin (AA, Direct Aspiration) [E282.1];Atomic Absorption, Furnace [E282.2];Inductively Coupled Plasma Emission [E200.7];Inductively Coupled Plasma/Mass Spectroscopy [E200.8];Standard Method (19th) 3111 B: Metals, Direct Air-Acetylene Flame [A3111B];Standard Method (19th) 3113: Metals by Electrothermal AAS [A3113];Standard Method (19th) 3113: Metals by Furnace AAS [A3113B];HISTORICAL: Inductively Coupled Plasma-Emission [SW6010];Data Unavailable [DU]"]
[null,null,null,null,null,null,null,null,null,null,null,"SN","Tin, Total",null,null,null,null,null,null,null,null,"Tin, Total Recoverable","kg/L,g/L,mg/L,ppth,ug/L,ng/L,pg/L,mg/cm2,g/day,g/year,kg/day,kg/month,kg/year,lb/day,lbs/week,lbs/month,lbs/year,mg/day,mg/kg,ug/kg,ng/g,ulbs/day,ug/day,t/day","Tin (AA, Direct Aspiration) [E282.1];Atomic Absorption, Furnace [E282.2];Inductively Coupled Plasma Emission [E200.7];Inductively Coupled Plasma/Mass Spectroscopy [E200.8];Standard Method (19th) 3111 B: Metals, Direct Air-Acetylene Flame [A3111B];Standard Method (19th) 3113: Metals by Electrothermal AAS [A3113];Standard Method (19th) 3113: Metals by Furnace AAS [A3113B];HISTORICAL: Inductively Coupled Plasma-Emission [SW6010];Data Unavailable [DU]"]
[null,null,null,null,null,null,null,null,null,null,"N","SN","Tin, Total Recoverable",null,null,null,null,null,null,null,null,"Titanium, Dissolved","kg/L,g/L,mg/L,ppth,ug/L,ng/L,pg/L,mg/cm2,g/day,g/year,kg/day,kg/month,kg/year,lb/day,lbs/week,lbs/month,lbs/year,mg/day,mg/kg,ug/kg,ng/g,ulbs/day,ug/day,t/day","Titanium (AA, Direct Aspiration) [E283.1];Titanium (AA, Furnace Technique) [E283.2];Inductively Coupled Plasma/Mass Spectroscopy [E200.8];Inductively Coupled Plasma-Atomic Emission Spectroscopy [SW6010B];Data Unavailable [DU]"]
[null,null,null,null,null,null,null,null,null,null,"L","TI","Titanium, Dissolved",null,null,null,null,null,null,null,null,"Titanium, Total","kg/L,g/L,mg/L,ppth,ug/L,ng/L,pg/L,mg/cm2,g/day,g/year,kg/day,kg/month,kg/year,lb/day,lbs/week,lbs/month,lbs/year,mg/day,mg/kg,ug/kg,ng/g,ulbs/day,ug/day,t/day","Titanium (AA, Direct Aspiration) [E283.1];Titanium (AA, Furnace Technique) [E283.2];Inductively Coupled Plasma/Mass Spectroscopy [E200.8];Inductively Coupled Plasma-Atomic Emission Spectroscopy [SW6010B];Data Unavailable [DU]"]
[null,null,null,null,null,null,null,null,null,null,null,"TI","Titanium, Total",null,null,null,null,null,null,null,null,"Titanium, Total Recoverable","kg/L,g/L,mg/L,ppth,ug/L,ng/L,pg/L,mg/cm2,g/day,g/year,kg/day,kg/month,kg/year,lb/day,lbs/week,lbs/month,lbs/year,mg/day,mg/kg,ug/kg,ng/g,ulbs/day,ug/day,t/day","Titanium (AA, Direct Aspiration) [E283.1];Titanium (AA, Furnace Technique) [E283.2];Inductively Coupled Plasma/Mass Spectroscopy [E200.8];Inductively Coupled Plasma-Atomic Emission Spectroscopy [SW6010B];Data Unavailable [DU]"]
[null,null,null,null,null,null,null,null,null,null,"N","TI","Titanium, Total Recoverable",null,null,null,null,null,null,null,null,"Tokuthion","kg/L,g/L,mg/L,ppth,ug/L,ng/L,pg/L,mg/cm2,g/day,g/year,kg/day,kg/month,kg/year,lb/day,lbs/week,lbs/month,lbs/year,mg/day,mg/kg,ug/kg,ng/g,ulbs/day,ug/day,t/day","Extractable Priority Pollutants [E625];Data Unavailable [DU]"]
[null,null,null,null,null,null,null,null,null,null,null,"TOKUTHION","Tokuthion",null,null,null,null,null,null,null,null,"Toluene","kg/L,g/L,mg/L,ppth,ug/L,ng/L,pg/L,mg/cm2,g/day,g/year,kg/day,kg/month,kg/year,lb/day,lbs/week,lbs/month,lbs/year,mg/day,mg/kg,ug/kg,ng/g,ulbs/day,ug/day,t/day","Chlorine, Total Residual (Titrimetric, Iodometric) [E330.3];Extractable Priority Pollutants [E625];Extractable Priority Pollutants by GC/MS SIM [E625SIM];GC/MS SIM Method [SIM];HISTORICAL: Semivolatile Organic Compounds by GC/MS [SW8270];HISTORICAL: Volatile Organic Compounds by GC/MS [SW8260];Organochlorine Pesticides and PCBs [E608];Semivolatile Organic Compounds by GC/MS [SW8270C];VOCs by GC/MS Fuel Additives Plus BTEX [8260FAB];Volatile Organic Compounds by GC/MS - Open Scan [8260BOS];Volatile Organic Compounds by GC/MS [SW8260B];Volatile Organic Compounds by GC/MS plus Oxygenates [8260+OX];Volatile Organic Compounds by GC/MS SIM [8260SIM];Volatile Organic Compounds by Purge and Trap [E524.2];Volatile Organic Compounds EPA Method 624 [E624];Purgeables by GC/MS [E624.1];Data Unavailable [DU]"]
[null,null,null,null,null,null,null,null,null,null,null,"BZME","Toluene",null,null,null,null,null,null,null,null,"Toluene-d8","kg/L,g/L,mg/L,ppth,ug/L,ng/L,pg/L,mg/cm2,g/day,g/year,kg/day,kg/month,kg/year,lb/day,lbs/week,lbs/month,lbs/year,mg/day,mg/kg,ug/kg,ng/g,ulbs/day,ug/day,t/day","Volatile Organic Compounds by GC/MS [SW8260B];Volatile Organic Compounds EPA Method 624 [E624];Purgeables by GC/MS [E624.1];Data Unavailable [DU]"]
[null,null,null,null,null,null,null,null,null,null,null,"BZMED8","Toluene-d8",null,null,null,null,null,null,null,null,"Total Coliform","CFU/100 mL,MPN/100 mL,PFU/100 mL","Standard Method (19th) 9223 B: Chromogenic Substrate Coliform [A9223B];Standard Method (19th) 9230 B: Fecal Strep Multiple Tube Tech. [A9230B];Standard Method 9230 D: Fluorogenic Substrate Enterococcus Test [A9230D];Standard Method 9221 B&E: Total & Fecal Coliform [A9221BE];Standard Method 9221 B: Total Coliform Fermentation Technique [A9221B];Standard Method 9221 E: Fecal Coliform [A9221E];Standard Method 9222 B: Total Coliform Membrane Filter Procedure [A9222B];Standard Method 9222 D: Fecal Coliform [A9222D];Total Coliform: Membrane-Filter Technique [SW9132];Total Coliform: Multiple Tube Fermentation Technique [SW9131];Data Unavailable [DU]"]
[null,null,null,null,null,null,null,null,null,null,null,"COLIFORM","Total Coliform",null,null,null,null,null,null,null,null,"Total Dissolved Solids (TDS)",{"$f":"$AG$8","v":"kg/L,g/L,mg/L,ppth,ug/L,ng/L,pg/L,mg/cm2,g/day,g/year,kg/day,kg/month,kg/year,lb/day,lbs/week,lbs/month,lbs/year,mg/day,mg/kg,ug/kg,ng/g,ulbs/day,ug/day,t/day"},"Residue, Filterable (TDS) [E160.1];Standard Method (19th) 2540 C: Total Diss. Solids at 180 deg. [A2540C];Data Unavailable [DU]"]
[null,null,null,null,null,null,null,null,null,null,null,"TDS","Total Dissolved Solids (TDS)",null,null,null,null,null,null,null,null,"Total Kjeldahl Nitrogen (TKN) (as N)",{"$f":"$AG$8","v":"kg/L,g/L,mg/L,ppth,ug/L,ng/L,pg/L,mg/cm2,g/day,g/year,kg/day,kg/month,kg/year,lb/day,lbs/week,lbs/month,lbs/year,mg/day,mg/kg,ug/kg,ng/g,ulbs/day,ug/day,t/day"},"Nitrogen, Kjeldahl, Total [E351.1];Nitrogen, Kjeldahl, Total [E351.2];Nitrogen, Kjeldahl, Total [E351.3];Nitrogen, Kjeldahl, Total [E351.4];Standard Method (19th) 4500-N(org) A: Calc. for Org. N (TKN-NH3) [A4500NA];Standard Method (19th) 4500-N(org) B: Macro-Kjeldahl Method [A4500NB];Standard Method (19th) 4500-NH: Nitrogen (Ammonia) [A4500NH];Standard Method (19th) 4500-N(org) C: Semi-Micro-Kjeldahl [A4500NC];Standard Method 4500-NH3 C: N (Ammonia) Titrimetric [A45001C];Data Unavailable [DU]"]
[null,null,null,null,null,null,null,null,null,null,null,"KN","Total Kjeldahl Nitrogen (TKN) (as N)",null,null,null,null,null,null,null,null,"Total Organic Carbon (TOC)",{"$f":"$AG$8","v":"kg/L,g/L,mg/L,ppth,ug/L,ng/L,pg/L,mg/cm2,g/day,g/year,kg/day,kg/month,kg/year,lb/day,lbs/week,lbs/month,lbs/year,mg/day,mg/kg,ug/kg,ng/g,ulbs/day,ug/day,t/day"},"Standard Method (19th) 5310 B: TOC by Combustion-Infrared [A5310B];Standard Method (19th) 5310 C: TOC by Persulfate-UV Oxidation [A5310C];Standard Methods 5310D: Wet-Oxidation Method [A5310D];Total Organic Carbon (Combustion or Oxidation) [E415.1];Total Organic Carbon (TOC) [SW9060];Total Organic Carbon (UV Absorbance) [E415.3];Data Unavailable [DU]"]
[null,null,null,null,null,null,null,null,null,null,null,"TOC","Total Organic Carbon (TOC)",null,null,null,null,null,null,null,null,"Total Organic Carbon (TOC), Percent Removal","%","Data Unavailable [DU]"]
[null,null,null,null,null,null,null,null,null,null,"U","TOC","Total Organic Carbon (TOC), Percent Removal",null,null,null,null,null,null,null,null,"Total Organic Halides",{"$f":"$AG$8","v":"kg/L,g/L,mg/L,ppth,ug/L,ng/L,pg/L,mg/cm2,g/day,g/year,kg/day,kg/month,kg/year,lb/day,lbs/week,lbs/month,lbs/year,mg/day,mg/kg,ug/kg,ng/g,ulbs/day,ug/day,t/day"},"Tetra thru Octa-Chlorinated Dioxins and Furans by Isotope Dilutin [E1613A];Data Unavailable [DU]"]
[null,null,null,null,null,null,null,null,null,null,null,"TOX","Total Organic Halides",null,null,null,null,null,null,null,null,"Total Petroleum Hydrocarbons as Kerosene",{"$f":"$AG$8","v":"kg/L,g/L,mg/L,ppth,ug/L,ng/L,pg/L,mg/cm2,g/day,g/year,kg/day,kg/month,kg/year,lb/day,lbs/week,lbs/month,lbs/year,mg/day,mg/kg,ug/kg,ng/g,ulbs/day,ug/day,t/day"},"Non-Halogenated Organics Using GC/FID [SW8015B];Data Unavailable [DU]"]
[null,null,null,null,null,null,null,null,null,null,null,"PHCK","Total Petroleum Hydrocarbons as Kerosene",null,null,null,null,null,null,null,null,"Total PFOA and PFOS",{"$f":"$AG$8","v":"kg/L,g/L,mg/L,ppth,ug/L,ng/L,pg/L,mg/cm2,g/day,g/year,kg/day,kg/month,kg/year,lb/day,lbs/week,lbs/month,lbs/year,mg/day,mg/kg,ug/kg,ng/g,ulbs/day,ug/day,t/day"},"PFAS in Aqueous, Solid, Biosolids, and Tissue Samples by LC-MS/MS-Draft [E1633-D];Data Unavailable [DU]"]
[null,null,null,null,null,null,null,null,null,null,null,"TOTPFOAPFOS","Total PFOA and PFOS",null,null,null,null,null,null,null,null,"Total Residual Halogen",{"$f":"$AG$8","v":"kg/L,g/L,mg/L,ppth,ug/L,ng/L,pg/L,mg/cm2,g/day,g/year,kg/day,kg/month,kg/year,lb/day,lbs/week,lbs/month,lbs/year,mg/day,mg/kg,ug/kg,ng/g,ulbs/day,ug/day,t/day"},"Data Unavailable [DU]"]
[null,null,null,null,null,null,null,null,null,null,null,"TOTRESX ","Total Residual Halogen",null,null,null,null,null,null,null,null,"Total Solids (TS)",{"$f":"CONCATENATE($AG$8,\",%\")","v":"kg/L,g/L,mg/L,ppth,ug/L,ng/L,pg/L,mg/cm2,g/day,g/year,kg/day,kg/month,kg/year,lb/day,lbs/week,lbs/month,lbs/year,mg/day,mg/kg,ug/kg,ng/g,ulbs/day,ug/day,t/day,%"},"Residue, Total (Gravimetric, Dried at 103-105 Degrees) [E160.3];Standard Method (19th) 2540 B: Total Solids Dried at 103-105C [A2540B];Data Unavailable [DU]"]
[null,null,null,null,null,null,null,null,null,null,null,"TSO","Total Solids (TS)",null,null,null,null,null,null,null,null,"Total Suspended Solids (TSS)",{"$f":"$AG$8","v":"kg/L,g/L,mg/L,ppth,ug/L,ng/L,pg/L,mg/cm2,g/day,g/year,kg/day,kg/month,kg/year,lb/day,lbs/week,lbs/month,lbs/year,mg/day,mg/kg,ug/kg,ng/g,ulbs/day,ug/day,t/day"},"Residue, Non-Filterable [E160.2];Standard Method (19th) 2540 D: Tot. Sus. Solids Dried 103-105C [A2540D];Calculated Value [CALCVAL];Data Unavailable [DU]"]
[null,null,null,null,null,null,null,null,null,null,null,"TSS","Total Suspended Solids (TSS)",null,null,null,null,null,null,null,null,"Total Suspended Solids (TSS), Net Value",{"$f":"$AG$8","v":"kg/L,g/L,mg/L,ppth,ug/L,ng/L,pg/L,mg/cm2,g/day,g/year,kg/day,kg/month,kg/year,lb/day,lbs/week,lbs/month,lbs/year,mg/day,mg/kg,ug/kg,ng/g,ulbs/day,ug/day,t/day"},"Residue, Non-Filterable [E160.2];Standard Method (19th) 2540 D: Tot. Sus. Solids Dried 103-105C [A2540D];Data Unavailable [DU]"]
[null,null,null,null,null,null,null,null,null,null,null,"SS","Total Suspended Solids (TSS), Net Value",null,null,null,null,null,null,null,null,"Total Suspended Solids (TSS), Percent Removal","%","Data Unavailable [DU]"]
[null,null,null,null,null,null,null,null,null,null,"U","TSS","Total Suspended Solids (TSS), Percent Removal",null,null,null,null,null,null,null,null,"Total Trihalomethanes (TTHM)",{"$f":"$AG$8","v":"kg/L,g/L,mg/L,ppth,ug/L,ng/L,pg/L,mg/cm2,g/day,g/year,kg/day,kg/month,kg/year,lb/day,lbs/week,lbs/month,lbs/year,mg/day,mg/kg,ug/kg,ng/g,ulbs/day,ug/day,t/day"},"Purgeable Halocarbons [E601];Volatile Organic Compounds EPA Method 624 [E624];Volatile Organic Compounds by Purge and Trap [E524.2];Data Unavailable [DU]"]
[null,null,null,null,null,null,null,null,null,null,null,"TTHM ","Total Trihalomethanes (TTHM)",null,null,null,null,null,null,null,null,"Total Volatile Solids","kg/L,g/L,mg/L,ppth,ug/L,ng/L,pg/L,mg/cm2,g/day,g/year,kg/day,kg/month,kg/year,lb/day,lbs/week,lbs/month,lbs/year,mg/day,mg/kg,ug/kg,ng/g,ulbs/day,ug/day,t/day","Residue, Volatile (Gravimetric, Ignition at 550 Degrees) [E160.4];Residue, Volatile (Gravimetric, Ignition) Modified [E160.4M];Standard Method (19th) 2540 G: Total, Fixed and Vol. Solids [A2540G];Data Unavailable [DU]"]
[null,null,null,null,null,null,null,null,null,null,null,"TVS","Total Volatile Solids",null,null,null,null,null,null,null,null,"Toxaphene","kg/L,g/L,mg/L,ppth,ug/L,ng/L,pg/L,mg/cm2,g/day,g/year,kg/day,kg/month,kg/year,lb/day,lbs/week,lbs/month,lbs/year,mg/day,mg/kg,ug/kg,ng/g,ulbs/day,ug/day,t/day","Chlorinated Pesticides in Groundwater [E508];Extractable Priority Pollutants [E625];Extractable Priority Pollutants by GC/MS SIM [E625SIM];GC/MS SIM Method [SIM];HISTORICAL: Organochlorine Pesticides & PCBs as Aroclors by GC [SW8081];HISTORICAL: Organochlorine Pesticides and PCBs [SW8080];Organochlorine Pesticides and PCBs [E608];Organochlorine Pesticides by Gas Chromatography [SW8081A];Organohalide Pest. & Com. PCBs in Water by Microext. & GC [E505];Polychlorinated Biphenyls (PCBs) by Gas Chromatography [SW8082];Semivolatile Organic Compounds by GC/MS [SW8270C];Semivolatile Organic Compounds by Isotope Dilution GCMS [E1625C];Volatile Organic Compounds by GC/MS [SW8260B];Volatile Organic Compounds by GC/MS SIM [8260SIM];Volatile Organic Compounds EPA Method 624 [E624];Organochlorine Pesticides and PCBs by GC/HSD [E608.3];Data Unavailable [DU]"]
[null,null,null,null,null,null,null,null,null,null,null,"TOXAP","Toxaphene",null,null,null,null,null,null,null,null,"TPH as Motor Oil","kg/L,g/L,mg/L,ppth,ug/L,ng/L,pg/L,mg/cm2,g/day,g/year,kg/day,kg/month,kg/year,lb/day,lbs/week,lbs/month,lbs/year,mg/day,mg/kg,ug/kg,ng/g,ulbs/day,ug/day,t/day","Non-Halogenated Organics Using GC/FID [SW8015B];Data Unavailable [DU]"]
[null,null,null,null,null,null,null,null,null,null,null,"TPHMOTOROIL","TPH as Motor Oil",null,null,null,null,null,null,null,null,"TPH C13-C22","kg/L,g/L,mg/L,ppth,ug/L,ng/L,pg/L,mg/cm2,g/day,g/year,kg/day,kg/month,kg/year,lb/day,lbs/week,lbs/month,lbs/year,mg/day,mg/kg,ug/kg,ng/g,ulbs/day,ug/day,t/day","Non-Halogenated Organics Using GC/FID [SW8015B];Data Unavailable [DU]"]
[null,null,null,null,null,null,null,null,null,null,null,"TPHC13C22","TPH C13-C22",null,null,null,null,null,null,null,null,"TPH C23+","kg/L,g/L,mg/L,ppth,ug/L,ng/L,pg/L,mg/cm2,g/day,g/year,kg/day,kg/month,kg/year,lb/day,lbs/week,lbs/month,lbs/year,mg/day,mg/kg,ug/kg,ng/g,ulbs/day,ug/day,t/day","Non-Halogenated Organics Using GC/FID [SW8015B];Data Unavailable [DU]"]
[null,null,null,null,null,null,null,null,null,null,null,"TPHC23+","TPH C23+",null,null,null,null,null,null,null,null,"trans-1,2-Dichloroethene","kg/L,g/L,mg/L,ppth,ug/L,ng/L,pg/L,mg/cm2,g/day,g/year,kg/day,kg/month,kg/year,lb/day,lbs/week,lbs/month,lbs/year,mg/day,mg/kg,ug/kg,ng/g,ulbs/day,ug/day,t/day","Extractable Priority Pollutants [E625];Extractable Priority Pollutants by GC/MS SIM [E625SIM];GC/MS SIM Method [SIM];HISTORICAL: Volatile Organic Compounds by GC/MS [SW8260];Semivolatile Organic Compounds by GC/MS [SW8270C];VOCs by GC/MS Fuel Additives Plus BTEX [8260FAB];Volatile Organic Compounds by GC/MS - Open Scan [8260BOS];Volatile Organic Compounds by GC/MS [SW8260B];Volatile Organic Compounds by GC/MS SIM [8260SIM];Volatile Organic Compounds by Purge and Trap [E524.2];Volatile Organic Compounds EPA Method 624 [E624];Purgeables by GC/MS [E624.1];Data Unavailable [DU]"]
[null,null,null,null,null,null,null,null,null,null,null,"DCE12T","trans-1,2-Dichloroethene",null,null,null,null,null,null,null,null,"trans-1,3-Dichloropropene","kg/L,g/L,mg/L,ppth,ug/L,ng/L,pg/L,mg/cm2,g/day,g/year,kg/day,kg/month,kg/year,lb/day,lbs/week,lbs/month,lbs/year,mg/day,mg/kg,ug/kg,ng/g,ulbs/day,ug/day,t/day","Extractable Priority Pollutants [E625];GC/MS SIM Method [SIM];HISTORICAL: Volatile Organic Compounds by GC/MS [SW8260];Semivolatile Organic Compounds by GC/MS [SW8270C];VOCs by GC/MS Fuel Additives Plus BTEX [8260FAB];Volatile Organic Compounds by GC/MS [SW8260B];Volatile Organic Compounds EPA Method 624 [E624];Purgeables by GC/MS [E624.1];Data Unavailable [DU]"]
[null,null,null,null,null,null,null,null,null,null,null,"DCP13T","trans-1,3-Dichloropropene",null,null,null,null,null,null,null,null,"trans-Nonachlor","kg/L,g/L,mg/L,ppth,ug/L,ng/L,pg/L,mg/cm2,g/day,g/year,kg/day,kg/month,kg/year,lb/day,lbs/week,lbs/month,lbs/year,mg/day,mg/kg,ug/kg,ng/g,ulbs/day,ug/day,t/day","Extractable Priority Pollutants [E625];GC Determ. of Butyltins in Water (Chemosphere, Vol. 15, No. 4) [BTSN];GC/MS SIM Method [SIM];Organochlorine Pesticides and PCBs [E608];Organochlorine Pesticides and PCBs by GC/HSD [E608.3];Data Unavailable [DU]"]
[null,null,null,null,null,null,null,null,null,null,null,"NCT","trans-Nonachlor",null,null,null,null,null,null,null,null,"Transparency, Secchi Disc","Feet,inches,meters","Data Unavailable [DU]"]
[null,null,null,null,null,null,null,null,null,null,null,"TRANSPAR","Transparency, Secchi Disc",null,null,null,null,null,null,null,null,"Tributyltin (TBT)",{"$f":"$AG$8","v":"kg/L,g/L,mg/L,ppth,ug/L,ng/L,pg/L,mg/cm2,g/day,g/year,kg/day,kg/month,kg/year,lb/day,lbs/week,lbs/month,lbs/year,mg/day,mg/kg,ug/kg,ng/g,ulbs/day,ug/day,t/day"},"Determination of DIMP and DMMP in Soil by GC/FPD [ULK09];Extractable Priority Pollutants [E625];Extractable Priority Pollutants by GC/MS SIM [E625SIM];GC Determ. of Butyltins in Water (Chemosphere, Vol. 15, No. 4) [BTSN];GC/MS SIM Method [SIM];Halogenated Volatile Organics by Headspace [3810HVO];Organochlorine Pesticides and PCBs [E608];Total Butyltins [BTSNTOT];Volatile Organic Compounds by GC/MS [SW8260B];Volatile Organic Compounds EPA Method 624 [E624];Data Unavailable [DU]"]
[null,null,null,null,null,null,null,null,null,null,null,"TBTSN","Tributyltin (TBT)",null,null,null,null,null,null,null,null,"Trichloroacetic Acid","kg/L,g/L,mg/L,ppth,ug/L,ng/L,pg/L,mg/cm2,g/day,g/year,kg/day,kg/month,kg/year,lb/day,lbs/week,lbs/month,lbs/year,mg/day,mg/kg,ug/kg,ng/g,ulbs/day,ug/day,t/day","Data Unavailable [DU]"]
[null,null,null,null,null,null,null,null,null,null,null,"TCAA ","Trichloroacetic Acid",null,null,null,null,null,null,null,null,"Trichloroethene","kg/L,g/L,mg/L,ppth,ug/L,ng/L,pg/L,mg/cm2,g/day,g/year,kg/day,kg/month,kg/year,lb/day,lbs/week,lbs/month,lbs/year,mg/day,mg/kg,ug/kg,ng/g,ulbs/day,ug/day,t/day","Extractable Priority Pollutants [E625];Extractable Priority Pollutants by GC/MS SIM [E625SIM];GC/MS SIM Method [SIM];HISTORICAL: Volatile Organic Compounds by GC/MS [SW8260];Organochlorine Pesticides and PCBs [E608];Organochlorine Pesticides by Gas Chromatography [SW8081A];Semivolatile Organic Compounds by GC/MS [SW8270C];VOCs by GC/MS Fuel Additives Plus BTEX [8260FAB];Volatile Organic Compounds by GC/MS - Open Scan [8260BOS];Volatile Organic Compounds by GC/MS [SW8260B];Volatile Organic Compounds by GC/MS SIM [8260SIM];Volatile Organic Compounds by Purge and Trap [E524.2];Volatile Organic Compounds EPA Method 624 [E624];Purgeables by GC/MS [E624.1];Data Unavailable [DU]"]
[null,null,null,null,null,null,null,null,null,null,null,"TCE","Trichloroethene",null,null,null,null,null,null,null,null,"Trichlorofluoromethane","kg/L,g/L,mg/L,ppth,ug/L,ng/L,pg/L,mg/cm2,g/day,g/year,kg/day,kg/month,kg/year,lb/day,lbs/week,lbs/month,lbs/year,mg/day,mg/kg,ug/kg,ng/g,ulbs/day,ug/day,t/day","GC/MS SIM Method [SIM];HISTORICAL: Volatile Organic Compounds by GC/MS [SW8260];Semivolatile Organic Compounds by GC/MS [SW8270C];VOCs by GC/MS Fuel Additives Plus BTEX [8260FAB];Volatile Organic Compounds by GC/MS [SW8260B];Volatile Organic Compounds by Purge and Trap [E524.2];Volatile Organic Compounds EPA Method 624 [E624];Purgeables by GC/MS [E624.1];Data Unavailable [DU]"]
[null,null,null,null,null,null,null,null,null,null,null,"FC11","Trichlorofluoromethane",null,null,null,null,null,null,null,null,"Trichloronate","kg/L,g/L,mg/L,ppth,ug/L,ng/L,pg/L,mg/cm2,g/day,g/year,kg/day,kg/month,kg/year,lb/day,lbs/week,lbs/month,lbs/year,mg/day,mg/kg,ug/kg,ng/g,ulbs/day,ug/day,t/day","Extractable Priority Pollutants [E625];Data Unavailable [DU]"]
[null,null,null,null,null,null,null,null,null,null,null,"CL3NATE","Trichloronate",null,null,null,null,null,null,null,null,"Trichlorotrifluoroethane","kg/L,g/L,mg/L,ppth,ug/L,ng/L,pg/L,mg/cm2,g/day,g/year,kg/day,kg/month,kg/year,lb/day,lbs/week,lbs/month,lbs/year,mg/day,mg/kg,ug/kg,ng/g,ulbs/day,ug/day,t/day","GC/MS SIM Method [SIM];Volatile Organic Compounds by GC/MS [SW8260B];Volatile Organic Compounds EPA Method 624 [E624];Data Unavailable [DU]"]
[null,null,null,null,null,null,null,null,null,null,null,"3CLFLETHANE","Trichlorotrifluoroethane",null,null,null,null,null,null,null,null,"Triclopyr","kg/L,g/L,mg/L,ppth,ug/L,ng/L,pg/L,mg/cm2,g/day,g/year,kg/day,kg/month,kg/year,lb/day,lbs/week,lbs/month,lbs/year,mg/day,mg/kg,ug/kg,ng/g,ulbs/day,ug/day,t/day","Data Unavailable [DU]"]
[null,null,null,null,null,null,null,null,null,null,null,"TRICLOPYR","Triclopyr",null,null,null,null,null,null,null,null,"Triethylene Glycol","mg/L","Non-Halogenated Organics Using GC/FID [SW8015B];Data Unavailable [DU]"]
[null,null,null,null,null,null,null,null,null,null,null,"ET3GLY","Triethylene Glycol",null,null,null,null,null,null,null,null,"Tritium","PCi/L","Tritium in Drinking Water [E906.0];Data Unavailable [DU]"]
[null,null,null,null,null,null,null,null,null,null,null,"H-3","Tritium",null,null,null,null,null,null,null,null,"Turbidity","JTU,NTU","Standard Method (19th) 2130 B: Turbidity by Nephelometric Method [A2130B];Turbidity (Nephelometric) [E180.1];Data Unavailable [DU]"]
[null,null,null,null,null,null,null,null,null,null,null,"TURB","Turbidity",null,null,null,null,null,null,null,null,"Uranium","PCi/L","Inductively Coupled Plasma/Mass Spectroscopy [E200.8];Tritium in Drinking Water [E906.0];Uranium in Drinking Water - Radiochemical Method [E908.0];Data Unavailable [DU]"]
[null,null,null,null,null,null,null,null,null,null,null,"U","Uranium",null,null,null,null,null,null,null,null,"Urea",{"$f":"$AG$8","v":"kg/L,g/L,mg/L,ppth,ug/L,ng/L,pg/L,mg/cm2,g/day,g/year,kg/day,kg/month,kg/year,lb/day,lbs/week,lbs/month,lbs/year,mg/day,mg/kg,ug/kg,ng/g,ulbs/day,ug/day,t/day"},"Data Unavailable [DU]"]
[null,null,null,null,null,null,null,null,null,null,null,"UREA","Urea",null,null,null,null,null,null,null,null,"UV Banks in Operation","banks","Data Unavailable [DU]"]
[null,null,null,null,null,null,null,null,null,null,null,"NUMUV","UV Banks in Operation",null,null,null,null,null,null,null,null,"UV Dose","mJ/cm2,mWs/cm2,uJ/cm2","Data Unavailable [DU]"]
[null,null,null,null,null,null,null,null,null,null,null,"UVLITDOS","UV Dose",null,null,null,null,null,null,null,null,"UV Intensity","mW/cm2","Data Unavailable [DU]"]
[null,null,null,null,null,null,null,null,null,null,null,"UVLI","UV Intensity",null,null,null,null,null,null,null,null,"UV Power","%","Data Unavailable [DU]"]
[null,null,null,null,null,null,null,null,null,null,null,"UVPOWER","UV Power",null,null,null,null,null,null,null,null,"UV Transmittance","%","Data Unavailable [DU]"]
[null,null,null,null,null,null,null,null,null,null,null,"UVLT","UV Transmittance",null,null,null,null,null,null,null,null,"Vanadium, Dissolved",{"$f":"$AG$8","v":"kg/L,g/L,mg/L,ppth,ug/L,ng/L,pg/L,mg/cm2,g/day,g/year,kg/day,kg/month,kg/year,lb/day,lbs/week,lbs/month,lbs/year,mg/day,mg/kg,ug/kg,ng/g,ulbs/day,ug/day,t/day"},"Inductively Coupled Plasma Emission [E200.7];Inductively Coupled Plasma/Mass Spectroscopy [E200.8];Inductively Coupled Plasma-Atomic Emission Spectroscopy [SW6010B];Inductively Coupled Plasma-Mass Spectrometry [SW6020];Vanadium (AA, Direct Aspiration) [E286.1];Vanadium (AA, Furnace Technique) [E286.2];HISTORICAL: Inductively Coupled Plasma-Emission [SW6010];Data Unavailable [DU]"]
[null,null,null,null,null,null,null,null,null,null,"L","V","Vanadium, Dissolved",null,null,null,null,null,null,null,null,"Vanadium, Total","kg/L,g/L,mg/L,ppth,ug/L,ng/L,pg/L,mg/cm2,g/day,g/year,kg/day,kg/month,kg/year,lb/day,lbs/week,lbs/month,lbs/year,mg/day,mg/kg,ug/kg,ng/g,ulbs/day,ug/day,t/day","Inductively Coupled Plasma Emission [E200.7];Inductively Coupled Plasma/Mass Spectroscopy [E200.8];Inductively Coupled Plasma-Atomic Emission Spectroscopy [SW6010B];Inductively Coupled Plasma-Mass Spectrometry [SW6020];Vanadium (AA, Direct Aspiration) [E286.1];Vanadium (AA, Furnace Technique) [E286.2];HISTORICAL: Inductively Coupled Plasma-Emission [SW6010];Data Unavailable [DU]"]
[null,null,null,null,null,null,null,null,null,null,null,"V","Vanadium, Total",null,null,null,null,null,null,null,null,"Vanadium, Total Recoverable","kg/L,g/L,mg/L,ppth,ug/L,ng/L,pg/L,mg/cm2,g/day,g/year,kg/day,kg/month,kg/year,lb/day,lbs/week,lbs/month,lbs/year,mg/day,mg/kg,ug/kg,ng/g,ulbs/day,ug/day,t/day","Inductively Coupled Plasma Emission [E200.7];Inductively Coupled Plasma/Mass Spectroscopy [E200.8];Inductively Coupled Plasma-Atomic Emission Spectroscopy [SW6010B];Inductively Coupled Plasma-Mass Spectrometry [SW6020];Vanadium (AA, Direct Aspiration) [E286.1];Vanadium (AA, Furnace Technique) [E286.2];HISTORICAL: Inductively Coupled Plasma-Emission [SW6010];Data Unavailable [DU]"]
[null,null,null,null,null,null,null,null,null,null,"N","V","Vanadium, Total Recoverable",null,null,null,null,null,null,null,null,"Vinyl acetate","kg/L,g/L,mg/L,ppth,ug/L,ng/L,pg/L,mg/cm2,g/day,g/year,kg/day,kg/month,kg/year,lb/day,lbs/week,lbs/month,lbs/year,mg/day,mg/kg,ug/kg,ng/g,ulbs/day,ug/day,t/day","Volatile Organic Compounds by GC/MS [SW8260B];Data Unavailable [DU]"]
[null,null,null,null,null,null,null,null,null,null,null,"VA","Vinyl acetate",null,null,null,null,null,null,null,null,"Vinyl Chloride","kg/L,g/L,mg/L,ppth,ug/L,ng/L,pg/L,mg/cm2,g/day,g/year,kg/day,kg/month,kg/year,lb/day,lbs/week,lbs/month,lbs/year,mg/day,mg/kg,ug/kg,ng/g,ulbs/day,ug/day,t/day","Chloride (as Cl) [E325.1];Extractable Priority Pollutants [E625];Extractable Priority Pollutants by GC/MS SIM [E625SIM];GC/MS SIM Method [SIM];HISTORICAL: Volatile Organic Compounds by GC/MS [SW8260];Organochlorine Pesticides and PCBs [E608];Organochlorine Pesticides by Gas Chromatography [SW8081A];Semivolatile Organic Compounds by GC/MS [SW8270C];VOCs by GC/MS Fuel Additives Plus BTEX [8260FAB];Volatile Organic Compounds by GC/MS - Open Scan [8260BOS];Volatile Organic Compounds by GC/MS [SW8260B];Volatile Organic Compounds by GC/MS SIM [8260SIM];Volatile Organic Compounds by Purge and Trap [E524.2];Volatile Organic Compounds EPA Method 624 [E624];Zinc (AA, Furnace) [E289.2];Purgeables by GC/MS [E624.1];Data Unavailable [DU]"]
[null,null,null,null,null,null,null,null,null,null,null,"VC","Vinyl Chloride",null,null,null,null,null,null,null,null,"Volatile Suspended Solids (VSS)","kg/L,g/L,mg/L,ppth,ug/L,ng/L,pg/L,mg/cm2,g/day,g/year,kg/day,kg/month,kg/year,lb/day,lbs/week,lbs/month,lbs/year,mg/day,mg/kg,ug/kg,ng/g,ulbs/day,ug/day,t/day","Residue, Volatile (Gravimetric, Ignition at 550 Degrees) [E160.4];Residue, Volatile (Gravimetric, Ignition) Modified [E160.4M];Standard Method (19th) 2540 D: Tot. Sus. Solids Dried 103-105C [A2540D];Standard Method (19th) 2540 E: Fixd/Volatile Solids Ignited [A2540E];Data Unavailable [DU]"]
[null,null,null,null,null,null,null,null,null,null,null,"VSS","Volatile Suspended Solids (VSS)",null,null,null,null,null,null,null,null,"Xylenes, Total","kg/L,g/L,mg/L,ppth,ug/L,ng/L,pg/L,mg/cm2,g/day,g/year,kg/day,kg/month,kg/year,lb/day,lbs/week,lbs/month,lbs/year,mg/day,mg/kg,ug/kg,ng/g,ulbs/day,ug/day,t/day","Extractable Priority Pollutants [E625];GC/MS SIM Method [SIM];HISTORICAL: Volatile Organic Compounds by GC/MS [SW8260];Semivolatile Organic Compounds by GC/MS [SW8270C];Volatile Organic Compounds by GC/MS [SW8260B];Volatile Organic Compounds by GC/MS plus Oxygenates [8260+OX];Volatile Organic Compounds by Purge and Trap [E524.2];Volatile Organic Compounds EPA Method 624 [E624];Data Unavailable [DU]"]
[null,null,null,null,null,null,null,null,null,null,null,"XYLENES","Xylenes, Total",null,null,null,null,null,null,null,null,"Zinc Impact Ratio","%","Trace Elements in Ambient Waters by ICP-MS [E1638];Trace Elements in Water by Preconcentration and ICP-MS [E1640];Inductively Coupled Plasma Emission - modified for CLP [CL200.7];Inductively Coupled Plasma Emission [E200.7];Inductively Coupled Plasma/Mass Spectroscopy [E200.8];Inductively Coupled Plasma-Atomic Emission Spectroscopy [SW6010B];Inductively Coupled Plasma-Mass Spectrometry [SW6020];Metals by Atomic Absorption [E200.0];Standard Method (19th) 3111 B: Metals, Direct Air-Acetylene Flame [A3111B];Trace Elements in Ambient Waters by Stabilized [E1639];Zinc (AA, Direct Aspiration) [E289.1];Zinc (AA, Furnace Technique) [SW7951];Zinc (AA, Furnace) [E289.2];HISTORICAL: Inductively Coupled Plasma-Emission [SW6010];Data Unavailable [DU]"]
[null,null,null,null,null,null,null,null,null,null,null,"ZNIMRATIO","Zinc Impact Ratio",null,null,null,null,null,null,null,null,"Zinc, Dissolved",{"$f":"$AG$8","v":"kg/L,g/L,mg/L,ppth,ug/L,ng/L,pg/L,mg/cm2,g/day,g/year,kg/day,kg/month,kg/year,lb/day,lbs/week,lbs/month,lbs/year,mg/day,mg/kg,ug/kg,ng/g,ulbs/day,ug/day,t/day"},"Trace Elements in Ambient Waters by ICP-MS [E1638];Trace Elements in Water by Preconcentration and ICP-MS [E1640];Inductively Coupled Plasma Emission - modified for CLP [CL200.7];Inductively Coupled Plasma Emission [E200.7];Inductively Coupled Plasma/Mass Spectroscopy [E200.8];Inductively Coupled Plasma-Atomic Emission Spectroscopy [SW6010B];Inductively Coupled Plasma-Mass Spectrometry [SW6020];Metals by Atomic Absorption [E200.0];Standard Method (19th) 3111 B: Metals, Direct Air-Acetylene Flame [A3111B];Trace Elements in Ambient Waters by Stabilized [E1639];Zinc (AA, Direct Aspiration) [E289.1];Zinc (AA, Furnace Technique) [SW7951];Zinc (AA, Furnace) [E289.2];HISTORICAL: Inductively Coupled Plasma-Emission [SW6010];Data Unavailable [DU]"]
[null,null,null,null,null,null,null,null,null,null,"L","ZN","Zinc, Dissolved",null,null,null,null,null,null,null,null,"Zinc, Filtered",{"$f":"$AG$8","v":"kg/L,g/L,mg/L,ppth,ug/L,ng/L,pg/L,mg/cm2,g/day,g/year,kg/day,kg/month,kg/year,lb/day,lbs/week,lbs/month,lbs/year,mg/day,mg/kg,ug/kg,ng/g,ulbs/day,ug/day,t/day"},"Trace Elements in Ambient Waters by ICP-MS [E1638];Trace Elements in Water by Preconcentration and ICP-MS [E1640];Inductively Coupled Plasma Emission - modified for CLP [CL200.7];Inductively Coupled Plasma Emission [E200.7];Inductively Coupled Plasma/Mass Spectroscopy [E200.8];Inductively Coupled Plasma-Atomic Emission Spectroscopy [SW6010B];Inductively Coupled Plasma-Mass Spectrometry [SW6020];Metals by Atomic Absorption [E200.0];Standard Method (19th) 3111 B: Metals, Direct Air-Acetylene Flame [A3111B];Trace Elements in Ambient Waters by Stabilized [E1639];Zinc (AA, Direct Aspiration) [E289.1];Zinc (AA, Furnace Technique) [SW7951];Zinc (AA, Furnace) [E289.2];HISTORICAL: Inductively Coupled Plasma-Emission [SW6010];Data Unavailable [DU]"]
[null,null,null,null,null,null,null,null,null,null,"F","ZN","Zinc, Filtered",null,null,null,null,null,null,null,null,"Zinc, Total",{"$f":"$AG$8","v":"kg/L,g/L,mg/L,ppth,ug/L,ng/L,pg/L,mg/cm2,g/day,g/year,kg/day,kg/month,kg/year,lb/day,lbs/week,lbs/month,lbs/year,mg/day,mg/kg,ug/kg,ng/g,ulbs/day,ug/day,t/day"},"Trace Elements in Ambient Waters by ICP-MS [E1638];Trace Elements in Water by Preconcentration and ICP-MS [E1640];Inductively Coupled Plasma Emission - modified for CLP [CL200.7];Inductively Coupled Plasma Emission [E200.7];Inductively Coupled Plasma/Mass Spectroscopy [E200.8];Inductively Coupled Plasma-Atomic Emission Spectroscopy [SW6010B];Inductively Coupled Plasma-Mass Spectrometry [SW6020];Metals by Atomic Absorption [E200.0];Standard Method (19th) 3111 B: Metals, Direct Air-Acetylene Flame [A3111B];Trace Elements in Ambient Waters by Stabilized [E1639];Zinc (AA, Direct Aspiration) [E289.1];Zinc (AA, Furnace Technique) [SW7951];Zinc (AA, Furnace) [E289.2];HISTORICAL: Inductively Coupled Plasma-Emission [SW6010];Data Unavailable [DU]"]
[null,null,null,null,null,null,null,null,null,null,null,"ZN","Zinc, Total",null,null,null,null,null,null,null,null,"Zinc, Total Recoverable",{"$f":"$AG$8","v":"kg/L,g/L,mg/L,ppth,ug/L,ng/L,pg/L,mg/cm2,g/day,g/year,kg/day,kg/month,kg/year,lb/day,lbs/week,lbs/month,lbs/year,mg/day,mg/kg,ug/kg,ng/g,ulbs/day,ug/day,t/day"},"Trace Elements in Ambient Waters by ICP-MS [E1638];Trace Elements in Water by Preconcentration and ICP-MS [E1640];Inductively Coupled Plasma Emission - modified for CLP [CL200.7];Inductively Coupled Plasma Emission [E200.7];Inductively Coupled Plasma/Mass Spectroscopy [E200.8];Inductively Coupled Plasma-Atomic Emission Spectroscopy [SW6010B];Inductively Coupled Plasma-Mass Spectrometry [SW6020];Metals by Atomic Absorption [E200.0];Standard Method (19th) 3111 B: Metals, Direct Air-Acetylene Flame [A3111B];Trace Elements in Ambient Waters by Stabilized [E1639];Zinc (AA, Direct Aspiration) [E289.1];Zinc (AA, Furnace Technique) [SW7951];Zinc (AA, Furnace) [E289.2];HISTORICAL: Inductively Coupled Plasma-Emission [SW6010];Data Unavailable [DU]"]
[null,null,null,null,null,null,null,null,null,null,"N","ZN","Zinc, Total Recoverable",null,null,null,null,null,null,null,null,"Zirconium, Total","mg/L","Inductively Coupled Plasma Emission [E200.7];Data Unavailable [DU]"]
[null,null,null,null,null,null,null,null,null,null,null,"ZR","Zirconium, Total"]

{"sheet":"Conversion","index":3,"n_rows":9,"n_cols":59,"rows_kept":9,"cut":false,"hidden":false,"merged":[]}
["FIELD_PT_NAME","LOGDATE","LOGTIME","LOGCODE","SAMPID","MATRIX","PROJNAME","LABWO","GLOBAL_ID","LABCODE","LABSAMPID","QCCODE","ANMCODE","MODPARTLIS","EXMCODE","LABLOTCTL","LABMETH","ANADATE","EXTDATE","RUN_NUMBER","RECDATE","COCNUM","BASIS","PRESCODE","SUB","REP_DATE","LAB_REPNO","APPRVD","TLNOTE","PVCCODE","PARLABEL","PARVAL","PARVQ","LABDL","REPDL","REPDLVQ","PARUN","UNITS","RT","DILFAC","CLREVDATE","SRM","LABREFID","EXPECTED","RLNOTE","USER_ADMIN_ID","COC_MATRIX","DQO_ID","REQ_METHOD_GRP","PROCEDURE_NAME","METH_DESIGN_ID","LAB_METH_GRP","CLEANUP","RES_FF_1","RES_FF_2","RES_FF_3","RES_FF_4","RES_FF_5","TMP_PK_FIELD_OPTIONAL"]
[{"$f":"'Data Entry'!A1","v":"Monitoring Point"},{"$f":"IF('Data Entry'!F1<>\"\",TEXT('Data Entry'!F1,\"YYYYMMDD\"),\"\")","v":"Collection \nDate"},{"$f":"TEXT('Data Entry'!G1,\"HHMM\")","v":"Collection Time"},"N/A","N/A","W",null,null,null,null,null,null,{"$f":"LOOKUP('Data Entry'!E1,ANMDESC,ANMCODE)","v":"CSGAS"},null,null,null,null,{"$f":"IF('Data Entry'!H1<>\"\",TEXT('Data Entry'!H1,\"YYYYMMDD\"),\"\")","v":"Analysis \nDate"},null,{"$f":"COUNTIF(BG2:$BG$2,BG2)","v":1},null,null,{"$f":"IF(LOOKUP('Data Entry'!B1,PARDESC,BASISCODE)=0,\"\",LOOKUP('Data Entry'!B1,PARDESC,BASISCODE))","v":""},null,null,null,null,null,null,{"$f":"'Lookup Codes'!$I$3","v":"PR"},{"$f":"LOOKUP('Data Entry'!B1,PARDESC,PARCODE)","v":"O3RES"},{"$f":"'Data Entry'!J1","v":"Result"},{"$f":"IF('Data Entry'!I1<>\"\",'Data Entry'!I1,\"\")","v":"Qualifier"},{"$f":"IF('Data Entry'!L1<>\"\",'Data Entry'!L1,\"\")","v":"MDL"},{"$f":"IF('Data Entry'!M1<>\"\",'Data Entry'!M1,\"\")","v":"ML"},{"$f":"IF(AI2<>\"\",\"MRL\",\"\")","v":"MRL"},null,{"$f":"LOOKUP('Data Entry'!K1,UNITDESC,UNITCODE)","v":"UMHOS/CM"},null,null,null,null,null,null,{"$f":"IF(ISNA(LOOKUP('Data Entry'!P1,QA_DESC,QA_CODE)),\"\",LOOKUP('Data Entry'!P1,QA_DESC,QA_CODE))","v":"HR"},{"$f":"IF(LEN('Data Entry'!O1)>0,'Data Entry'!O1,\"\")","v":"Scenario ID"},null,null,null,null,null,null,null,{"$f":"IF('Data Entry'!N1<>\"\",'Data Entry'!N1,\"\")","v":"RL"},{"$f":"IF('Data Entry'!R1<>\"\",'Data Entry'!R1,\"\")","v":"Comment"},{"$f":"IF('Data Entry'!C1<>\"\",'Data Entry'!C1,\"\")","v":"Data Type"},{"$f":"IF(ISNA(LOOKUP('Data Entry'!Q1,PRIORITY_REVIEW_DESC,PRIORITY_REVIEW_CODE)),\"\",LOOKUP('Data Entry'!Q1,PRIORITY_REVIEW_DESC,PRIORITY_REVIEW_CODE))","v":"N"},null,{"$f":"A2&AE2&BD2&B2&C2&R2&AF2&AL2","v":"Monitoring PointO3RESData TypeCollection \nDateCollection TimeAnalysis \nDateResultUMHOS/CM"}]
[{"$f":"'Data Entry'!A2","v":"EFF-001"},{"$f":"IF('Data Entry'!F2<>\"\",TEXT('Data Entry'!F2,\"YYYYMMDD\"),\"\")","v":"20240501"},{"$f":"TEXT('Data Entry'!G2,\"HHMM\")","v":"1000"},"N/A","N/A","W",null,null,null,null,null,null,{"$f":"LOOKUP('Data Entry'!E2,ANMDESC,ANMCODE)","v":"DU"},null,null,null,null,{"$f":"IF('Data Entry'!H2<>\"\",TEXT('Data Entry'!H2,\"YYYYMMDD\"),\"\")","v":"20240501"},null,{"$f":"COUNTIF(BG$2:$BG3,BG3)","v":1},null,null,{"$f":"IF(LOOKUP('Data Entry'!B2,PARDESC,BASISCODE)=0,\"\",LOOKUP('Data Entry'!B2,PARDESC,BASISCODE))","v":""},null,null,null,null,null,null,{"$f":"'Lookup Codes'!$I$3","v":"PR"},{"$f":"LOOKUP('Data Entry'!B2,PARDESC,PARCODE)","v":"TC1112"},{"$f":"'Data Entry'!J2","v":1},{"$f":"IF('Data Entry'!I2<>\"\",'Data Entry'!I2,\"\")","v":"="},{"$f":"IF('Data Entry'!L2<>\"\",'Data Entry'!L2,\"\")","v":""},{"$f":"IF('Data Entry'!M2<>\"\",'Data Entry'!M2,\"\")","v":""},{"$f":"IF(AI3<>\"\",\"MRL\",\"\")","v":""},null,{"$f":"LOOKUP('Data Entry'!K2,UNITDESC,UNITCODE)","v":"MG/L"},null,null,null,null,null,null,{"$f":"IF(ISNA(LOOKUP('Data Entry'!P2,QA_DESC,QA_CODE)),\"\",LOOKUP('Data Entry'!P2,QA_DESC,QA_CODE))","v":"D"},{"$f":"IF(LEN('Data Entry'!O2)>0,'Data Entry'!O2,\"\")","v":""},null,null,null,null,null,null,null,{"$f":"IF('Data Entry'!N2<>\"\",'Data Entry'!N2,\"\")","v":""},{"$f":"IF('Data Entry'!R2<>\"\",'Data Entry'!R2,\"\")","v":""},{"$f":"IF('Data Entry'!C2<>\"\",'Data Entry'!C2,\"\")","v":"Single"},{"$f":"IF(ISNA(LOOKUP('Data Entry'!Q2,PRIORITY_REVIEW_DESC,PRIORITY_REVIEW_CODE)),\"\",LOOKUP('Data Entry'!Q2,PRIORITY_REVIEW_DESC,PRIORITY_REVIEW_CODE))","v":""},null,{"$f":"A3&AE3&BD3&B3&C3&R3&AF3&AL3","v":"EFF-001TC1112Single202405011000202405011MG/L"}]
[{"$f":"'Data Entry'!A3","v":"EFF-001"},{"$f":"IF('Data Entry'!F3<>\"\",TEXT('Data Entry'!F3,\"YYYYMMDD\"),\"\")","v":"20240501"},{"$f":"TEXT('Data Entry'!G3,\"HHMM\")","v":"1000"},"N/A","N/A","W",null,null,null,null,null,null,{"$f":"LOOKUP('Data Entry'!E3,ANMDESC,ANMCODE)","v":"DU"},null,null,null,null,{"$f":"IF('Data Entry'!H3<>\"\",TEXT('Data Entry'!H3,\"YYYYMMDD\"),\"\")","v":"20240501"},null,{"$f":"COUNTIF(BG$2:$BG4,BG4)","v":1},null,null,{"$f":"IF(LOOKUP('Data Entry'!B3,PARDESC,BASISCODE)=0,\"\",LOOKUP('Data Entry'!B3,PARDESC,BASISCODE))","v":""},null,null,null,null,null,null,{"$f":"'Lookup Codes'!$I$3","v":"PR"},{"$f":"LOOKUP('Data Entry'!B3,PARDESC,PARCODE)","v":"TCA111"},{"$f":"'Data Entry'!J3","v":1},{"$f":"IF('Data Entry'!I3<>\"\",'Data Entry'!I3,\"\")","v":"="},{"$f":"IF('Data Entry'!L3<>\"\",'Data Entry'!L3,\"\")","v":""},{"$f":"IF('Data Entry'!M3<>\"\",'Data Entry'!M3,\"\")","v":""},"",null,{"$f":"LOOKUP('Data Entry'!K3,UNITDESC,UNITCODE)","v":"MG/L"},null,null,null,null,null,null,{"$f":"IF(ISNA(LOOKUP('Data Entry'!P3,QA_DESC,QA_CODE)),\"\",LOOKUP('Data Entry'!P3,QA_DESC,QA_CODE))","v":"FO"},{"$f":"IF(LEN('Data Entry'!O3)>0,'Data Entry'!O3,\"\")","v":""},null,null,null,null,null,null,null,{"$f":"IF('Data Entry'!N3<>\"\",'Data Entry'!N3,\"\")","v":""},{"$f":"IF('Data Entry'!R3<>\"\",'Data Entry'!R3,\"\")","v":""},{"$f":"IF('Data Entry'!C3<>\"\",'Data Entry'!C3,\"\")","v":"Single"},{"$f":"IF(ISNA(LOOKUP('Data Entry'!Q3,PRIORITY_REVIEW_DESC,PRIORITY_REVIEW_CODE)),\"\",LOOKUP('Data Entry'!Q3,PRIORITY_REVIEW_DESC,PRIORITY_REVIEW_CODE))","v":""},null,"EFF-001TCA111Single202405011000202405011MG/L"]
[{"$f":"'Data Entry'!A4","v":0},{"$f":"IF('Data Entry'!F4<>\"\",TEXT('Data Entry'!F4,\"YYYYMMDD\"),\"\")","v":""},{"$f":"TEXT('Data Entry'!G4,\"HHMM\")","v":"0000"},"N/A","N/A","W",null,null,null,null,null,null,{"$f":"LOOKUP('Data Entry'!E4,ANMDESC,ANMCODE)","v":{"$error":"#N/A"}},null,null,null,null,{"$f":"IF('Data Entry'!H4<>\"\",TEXT('Data Entry'!H4,\"YYYYMMDD\"),\"\")","v":""},null,{"$f":"COUNTIF(BG$2:$BG5,BG5)","v":1},null,null,{"$f":"IF(LOOKUP('Data Entry'!B4,PARDESC,BASISCODE)=0,\"\",LOOKUP('Data Entry'!B4,PARDESC,BASISCODE))","v":{"$error":"#N/A"}},null,null,null,null,null,null,{"$f":"'Lookup Codes'!$I$3","v":"PR"},{"$f":"LOOKUP('Data Entry'!B4,PARDESC,PARCODE)","v":{"$error":"#N/A"}},{"$f":"'Data Entry'!J4","v":0},{"$f":"IF('Data Entry'!I4<>\"\",'Data Entry'!I4,\"\")","v":""},{"$f":"IF('Data Entry'!L4<>\"\",'Data Entry'!L4,\"\")","v":""},{"$f":"IF('Data Entry'!M4<>\"\",'Data Entry'!M4,\"\")","v":""},"",null,{"$f":"LOOKUP('Data Entry'!K4,UNITDESC,UNITCODE)","v":{"$error":"#N/A"}},null,null,null,null,null,null,{"$f":"IF(ISNA(LOOKUP('Data Entry'!P4,QA_DESC,QA_CODE)),\"\",LOOKUP('Data Entry'!P4,QA_DESC,QA_CODE))","v":""},{"$f":"IF(LEN('Data Entry'!O4)>0,'Data Entry'!O4,\"\")","v":""},null,null,null,null,null,null,null,{"$f":"IF('Data Entry'!N4<>\"\",'Data Entry'!N4,\"\")","v":""},{"$f":"IF('Data Entry'!R4<>\"\",'Data Entry'!R4,\"\")","v":""},{"$f":"IF('Data Entry'!C4<>\"\",'Data Entry'!C4,\"\")","v":""},{"$f":"IF(ISNA(LOOKUP('Data Entry'!Q4,PRIORITY_REVIEW_DESC,PRIORITY_REVIEW_CODE)),\"\",LOOKUP('Data Entry'!Q4,PRIORITY_REVIEW_DESC,PRIORITY_REVIEW_CODE))","v":""},null,{"$error":"#N/A"}]
[{"$f":"'Data Entry'!A5","v":0},{"$f":"IF('Data Entry'!F5<>\"\",TEXT('Data Entry'!F5,\"YYYYMMDD\"),\"\")","v":""},{"$f":"TEXT('Data Entry'!G5,\"HHMM\")","v":"0000"},"N/A","N/A","W",null,null,null,null,null,null,{"$f":"LOOKUP('Data Entry'!E5,ANMDESC,ANMCODE)","v":{"$error":"#N/A"}},null,null,null,null,{"$f":"IF('Data Entry'!H5<>\"\",TEXT('Data Entry'!H5,\"YYYYMMDD\"),\"\")","v":""},null,{"$f":"COUNTIF(BG$2:$BG6,BG6)","v":2},null,null,{"$f":"IF(LOOKUP('Data Entry'!B5,PARDESC,BASISCODE)=0,\"\",LOOKUP('Data Entry'!B5,PARDESC,BASISCODE))","v":{"$error":"#N/A"}},null,null,null,null,null,null,{"$f":"'Lookup Codes'!$I$3","v":"PR"},{"$f":"LOOKUP('Data Entry'!B5,PARDESC,PARCODE)","v":{"$error":"#N/A"}},{"$f":"'Data Entry'!J5","v":0},{"$f":"IF('Data Entry'!I5<>\"\",'Data Entry'!I5,\"\")","v":""},{"$f":"IF('Data Entry'!L5<>\"\",'Data Entry'!L5,\"\")","v":""},{"$f":"IF('Data Entry'!M5<>\"\",'Data Entry'!M5,\"\")","v":""},"",null,{"$f":"LOOKUP('Data Entry'!K5,UNITDESC,UNITCODE)","v":{"$error":"#N/A"}},null,null,null,null,null,null,{"$f":"IF(ISNA(LOOKUP('Data Entry'!P5,QA_DESC,QA_CODE)),\"\",LOOKUP('Data Entry'!P5,QA_DESC,QA_CODE))","v":""},{"$f":"IF(LEN('Data Entry'!O5)>0,'Data Entry'!O5,\"\")","v":""},null,null,null,null,null,null,null,{"$f":"IF('Data Entry'!N5<>\"\",'Data Entry'!N5,\"\")","v":""},{"$f":"IF('Data Entry'!R5<>\"\",'Data Entry'!R5,\"\")","v":""},{"$f":"IF('Data Entry'!C5<>\"\",'Data Entry'!C5,\"\")","v":""},{"$f":"IF(ISNA(LOOKUP('Data Entry'!Q5,PRIORITY_REVIEW_DESC,PRIORITY_REVIEW_CODE)),\"\",LOOKUP('Data Entry'!Q5,PRIORITY_REVIEW_DESC,PRIORITY_REVIEW_CODE))","v":""},null,{"$error":"#N/A"}]
[{"$f":"'Data Entry'!A6","v":0},{"$f":"IF('Data Entry'!F6<>\"\",TEXT('Data Entry'!F6,\"YYYYMMDD\"),\"\")","v":""},{"$f":"TEXT('Data Entry'!G6,\"HHMM\")","v":"0000"},"N/A","N/A","W",null,null,null,null,null,null,{"$f":"LOOKUP('Data Entry'!E6,ANMDESC,ANMCODE)","v":{"$error":"#N/A"}},null,null,null,null,{"$f":"IF('Data Entry'!H6<>\"\",TEXT('Data Entry'!H6,\"YYYYMMDD\"),\"\")","v":""},null,{"$f":"COUNTIF(BG$2:$BG7,BG7)","v":3},null,null,{"$f":"IF(LOOKUP('Data Entry'!B6,PARDESC,BASISCODE)=0,\"\",LOOKUP('Data Entry'!B6,PARDESC,BASISCODE))","v":{"$error":"#N/A"}},null,null,null,null,null,null,{"$f":"'Lookup Codes'!$I$3","v":"PR"},{"$f":"LOOKUP('Data Entry'!B6,PARDESC,PARCODE)","v":{"$error":"#N/A"}},{"$f":"'Data Entry'!J6","v":0},{"$f":"IF('Data Entry'!I6<>\"\",'Data Entry'!I6,\"\")","v":""},{"$f":"IF('Data Entry'!L6<>\"\",'Data Entry'!L6,\"\")","v":""},{"$f":"IF('Data Entry'!M6<>\"\",'Data Entry'!M6,\"\")","v":""},"",null,{"$f":"LOOKUP('Data Entry'!K6,UNITDESC,UNITCODE)","v":{"$error":"#N/A"}},null,null,null,null,null,null,{"$f":"IF(ISNA(LOOKUP('Data Entry'!P6,QA_DESC,QA_CODE)),\"\",LOOKUP('Data Entry'!P6,QA_DESC,QA_CODE))","v":""},{"$f":"IF(LEN('Data Entry'!O6)>0,'Data Entry'!O6,\"\")","v":""},null,null,null,null,null,null,null,{"$f":"IF('Data Entry'!N6<>\"\",'Data Entry'!N6,\"\")","v":""},{"$f":"IF('Data Entry'!R6<>\"\",'Data Entry'!R6,\"\")","v":""},{"$f":"IF('Data Entry'!C6<>\"\",'Data Entry'!C6,\"\")","v":""},{"$f":"IF(ISNA(LOOKUP('Data Entry'!Q6,PRIORITY_REVIEW_DESC,PRIORITY_REVIEW_CODE)),\"\",LOOKUP('Data Entry'!Q6,PRIORITY_REVIEW_DESC,PRIORITY_REVIEW_CODE))","v":""},null,{"$error":"#N/A"}]
[{"$f":"'Data Entry'!A7","v":0},{"$f":"IF('Data Entry'!F7<>\"\",TEXT('Data Entry'!F7,\"YYYYMMDD\"),\"\")","v":""},{"$f":"TEXT('Data Entry'!G7,\"HHMM\")","v":"0000"},"N/A","N/A","W",null,null,null,null,null,null,{"$f":"LOOKUP('Data Entry'!E7,ANMDESC,ANMCODE)","v":{"$error":"#N/A"}},null,null,null,null,{"$f":"IF('Data Entry'!H7<>\"\",TEXT('Data Entry'!H7,\"YYYYMMDD\"),\"\")","v":""},null,{"$f":"COUNTIF(BG$2:$BG8,BG8)","v":4},null,null,{"$f":"IF(LOOKUP('Data Entry'!B7,PARDESC,BASISCODE)=0,\"\",LOOKUP('Data Entry'!B7,PARDESC,BASISCODE))","v":{"$error":"#N/A"}},null,null,null,null,null,null,{"$f":"'Lookup Codes'!$I$3","v":"PR"},{"$f":"LOOKUP('Data Entry'!B7,PARDESC,PARCODE)","v":{"$error":"#N/A"}},{"$f":"'Data Entry'!J7","v":0},{"$f":"IF('Data Entry'!I7<>\"\",'Data Entry'!I7,\"\")","v":""},{"$f":"IF('Data Entry'!L7<>\"\",'Data Entry'!L7,\"\")","v":""},{"$f":"IF('Data Entry'!M7<>\"\",'Data Entry'!M7,\"\")","v":""},"",null,{"$f":"LOOKUP('Data Entry'!K7,UNITDESC,UNITCODE)","v":{"$error":"#N/A"}},null,null,null,null,null,null,{"$f":"IF(ISNA(LOOKUP('Data Entry'!P7,QA_DESC,QA_CODE)),\"\",LOOKUP('Data Entry'!P7,QA_DESC,QA_CODE))","v":""},{"$f":"IF(LEN('Data Entry'!O7)>0,'Data Entry'!O7,\"\")","v":""},null,null,null,null,null,null,null,{"$f":"IF('Data Entry'!N7<>\"\",'Data Entry'!N7,\"\")","v":""},{"$f":"IF('Data Entry'!R7<>\"\",'Data Entry'!R7,\"\")","v":""},{"$f":"IF('Data Entry'!C7<>\"\",'Data Entry'!C7,\"\")","v":""},{"$f":"IF(ISNA(LOOKUP('Data Entry'!Q7,PRIORITY_REVIEW_DESC,PRIORITY_REVIEW_CODE)),\"\",LOOKUP('Data Entry'!Q7,PRIORITY_REVIEW_DESC,PRIORITY_REVIEW_CODE))","v":""},null,{"$error":"#N/A"}]
[{"$f":"'Data Entry'!A8","v":0},{"$f":"IF('Data Entry'!F8<>\"\",TEXT('Data Entry'!F8,\"YYYYMMDD\"),\"\")","v":""},{"$f":"TEXT('Data Entry'!G8,\"HHMM\")","v":"0000"},"N/A","N/A","W",null,null,null,null,null,null,{"$f":"LOOKUP('Data Entry'!E8,ANMDESC,ANMCODE)","v":{"$error":"#N/A"}},null,null,null,null,{"$f":"IF('Data Entry'!H8<>\"\",TEXT('Data Entry'!H8,\"YYYYMMDD\"),\"\")","v":""},null,{"$f":"COUNTIF(BG$2:$BG9,BG9)","v":5},null,null,{"$f":"IF(LOOKUP('Data Entry'!B8,PARDESC,BASISCODE)=0,\"\",LOOKUP('Data Entry'!B8,PARDESC,BASISCODE))","v":{"$error":"#N/A"}},null,null,null,null,null,null,{"$f":"'Lookup Codes'!$I$3","v":"PR"},{"$f":"LOOKUP('Data Entry'!B8,PARDESC,PARCODE)","v":{"$error":"#N/A"}},{"$f":"'Data Entry'!J8","v":0},{"$f":"IF('Data Entry'!I8<>\"\",'Data Entry'!I8,\"\")","v":""},{"$f":"IF('Data Entry'!L8<>\"\",'Data Entry'!L8,\"\")","v":""},{"$f":"IF('Data Entry'!M8<>\"\",'Data Entry'!M8,\"\")","v":""},"",null,{"$f":"LOOKUP('Data Entry'!K8,UNITDESC,UNITCODE)","v":{"$error":"#N/A"}},null,null,null,null,null,null,{"$f":"IF(ISNA(LOOKUP('Data Entry'!P8,QA_DESC,QA_CODE)),\"\",LOOKUP('Data Entry'!P8,QA_DESC,QA_CODE))","v":""},{"$f":"IF(LEN('Data Entry'!O8)>0,'Data Entry'!O8,\"\")","v":""},null,null,null,null,null,null,null,{"$f":"IF('Data Entry'!N8<>\"\",'Data Entry'!N8,\"\")","v":""},{"$f":"IF('Data Entry'!R8<>\"\",'Data Entry'!R8,\"\")","v":""},{"$f":"IF('Data Entry'!C8<>\"\",'Data Entry'!C8,\"\")","v":""},{"$f":"IF(ISNA(LOOKUP('Data Entry'!Q8,PRIORITY_REVIEW_DESC,PRIORITY_REVIEW_CODE)),\"\",LOOKUP('Data Entry'!Q8,PRIORITY_REVIEW_DESC,PRIORITY_REVIEW_CODE))","v":""},null,{"$error":"#N/A"}]