{"text_format":"1","workbook":"xlsx","n_sheets":7,"sheets":["Instructions","Updates","Example","Calculator","TST Summary Sheet","Statistics","Formulas"],"not_rendered":{"charts":0,"images":0,"macros":1,"external_links":0,"defined_names":1,"comments":1,"pivot_tables":0},"unopened":[],"bounds":{"document_bytes":16777216,"sheet_cells":100000,"rows_first":2000,"rows_last":500,"rows_between":2000,"halvings":0,"cell_chars":16384,"cell_head_chars":4096},"cells_cut":0,"cells_raw":0,"read":"whole","date_system":"1900"}

{"sheet":"Instructions","index":0,"n_rows":60,"n_cols":1,"rows_kept":60,"cut":false,"hidden":false,"merged":[]}
["TST Spreadsheet Tool v1.9"]
[]
["TST Summary"]
["The Test of Significant Toxicity (TST) is a new statistical approach that assesses the whole effluent toxicity (WET) measurement of wastewater effects on specific test organisms’ ability to survive, grow, and reproduce developed by the U.S. EPA.  TST uses hypothesis testing techniques which examines whether a sample, at the critical concentration (e.g., in-stream waste concentration or IWC), and the control within a WET test differ by an unacceptable amount (the amount that would have a measured adverse effect on the ability of aquatic organisms to thrive and survive).  A sample can be either an effluent, stormwater, or receiving water.  Once the WET test has been conducted, the TST approach can be used to analyze valid WET test data to assess whether the sample is toxic.  The TST approach is designed to be used for a two concentration data analysis of the sample's critical concentration (e.g., IWC or a receiving water concentration) as compared to a control concentration."]
["TST Spreadsheet Tool"]
["This tool was created for several of the EPA WET test methods for the West Coast marine species (USEPA 1995) and the 2002 EPA WET test methods (USEPA 2002a, 2002b, 2002c) for other species."]
[]
["For questions, please contact:"]
["Jaime Gilliam"]
["Tetra Tech, Inc."]
["410-356-8993"]
[]
["The update from version 1.8 to 1.9 was performed by:"]
["John Wheeler"]
["Division of Water Quality"]
["State Water Resources Control Board"]
["John.Wheeler@waterboards.ca.gov"]
[]
["Instructions "]
["Before using this program, Macros must be enabled and the security certificate must be accepted. "]
[]
["For Excel 2007:"]
["1. Click the “Office Button” (big Office logo in the upper left), and select “Excel Options” (lower right)"]
["2. Click \"Trust Center\" on the left menu"]
["3. Click \"Trust Center Settings\" (lower right)"]
["4. Click \"Macro Settings\""]
["5. Click \"Enable all macros\" (last option)"]
["6. Click \"ok\" buttons to clear all open windows"]
["7. Exit program and re-open the file to use"]
[]
{"$rows_left_out":31}
{"sheet":"Updates","index":1,"n_rows":11,"n_cols":1,"rows_kept":11,"cut":false,"hidden":false,"merged":[]}
["TST Calculator v1.9 Updates (performed April 2021):"]
["The calculator was expanded to allow the user to input data for up to 40 replicates, instead of 20."]
["Minor formatting changes were made, in order to make the spreadsheet tool more accessible to individuals with disabilities (e.g. removed merged cells)."]
["The \"TST Summary Sheet\" sheet was rearranged to allow data from up to 40 replicates to fit on one printed page."]
["Screen tips were added to the \"Calculator\" sheet, to provide instructions when the data input cells are selected. "]
["The VBA code and hidden sheets were updated to work properly with the updated \"Calculator\" tab."]
["Certain terms used in the spreadsheet were slightly changed."]
["The \"Example\" sheet was updated in order to match the updated \"Calculator\" sheet."]
[]
["TST Calculator v1.8 Updates:"]
["TST Calculator v1.7 was updated to include space for a lab and client name, as well as making cells larger for test information input."]

{"sheet":"Example","index":2,"n_rows":64,"n_cols":22,"rows_kept":64,"cut":false,"hidden":false,"merged":[]}
[null,null,null,null,null,null,null,null,null,null,"Click to choose from menu","Click to choose from menu","Click to choose from menu",null,null,null,null,null,null,"Conduct WET Test"]
[null,null,null,null,null,null,null,null,null,null,"Fertilization","A. affinis (topsmelt)","Acute",null,null,null,null,null,null,"↓"]
[null,null,null,null,null,null,null,null,null,null,"Germination","A. bahia (mysid shrimp)","Chronic",null,null,null,null,null,null,"Apply arcsine square root transformation for percent data"]
["Lab Name","Example Laboratory",null,null,null,null,null,null,null,null,"Germ-Tube Length","A. punctulata (echinoderm)",null,null,null,null,null,null,null,"↓"]
["Client Name","Example Client",null,null,null,null,null,null,null,null,"Growth","C. dubia (water flea)",null,null,null,null,null,null,null,"Calculate t value using TST Welch’s test"]
["Test ID","Test_001",null,null,null,null,null,null,null,null,"Larval Development","C. gigas (oyster)",null,null,null,null,null,null,null,"↓"]
["Test Date","2020-04-14",null,null,null,null,null,null,null,null,"Reproduction","C. variegatus (sheepshead minnow)",null,null,null,null,null,null,null,"Calculated t-value > critical t-value?"]
["Test Duration","7 day",null,null,null,null,null,null,null,null,"Survival","D. excentricus (echinoderm)",null,null,null,null,null,null,"↓",null,"↓"]
["IWC","50% effluent",null,null,null,null,null,null,null,null,null,"D. magna (water flea)",null,null,null,null,null,null,"YES",null,"NO"]
[null,null,null,null,null,null,null,null,null,null,null,"D. pulex (water flea)",null,null,null,null,null,null,"\"PASS\"",null,"\"FAIL\""]
[null,"Control Data","Control Data","IWC (Instream Waste Concentration) Data","IWC (Instream Waste Concentration) Data",null,null,null,"Arcsine SqRt Transformation",null,null,"H. azteca (amphipod)",null,null,null,null,null,null,"Sample is NOT Toxic",null,"Sample is Toxic","If no variance in both the control and the IWC,  a % difference <25 for chronic, or <20 for acute is considered \"Passing\"."]
["Replicate Number","Number of Organisms Exposed or Counted","Response (Final Count, Weight, Length, etc.)","Number of Organisms Exposed or Counted","Response (Final Count, Weight, Length, etc.)","Control","IWC",null,"Control","Critical Conc. (IWC)",null,"H. costata (mysid)",null,null,null,null,null,null,null,null,null,{"$f":"IF(AND(S19=0,T19=0),((AVERAGE(C13:C52)-AVERAGE(E13:E52))/AVERAGE(C13:C52))*100,\"\")","v":""}]
[1,10,10,10,9,{"$f":"IF(AND(ISNUMBER(C13),$C$60=\"Yes\"),C13/B13,\"\")","v":1},{"$f":"IF(AND(ISNUMBER(E13),$C$60=\"Yes\"),E13/D13,\"\")","v":0.9},null,{"$f":"IF(AND($C$60=\"Yes\",ISNUMBER(F13),F13=0),ASIN(SQRT(1/(4*B13))),IF(AND($C$60=\"Yes\",ISNUMBER(F13),F13=1),ASIN(SQRT(1-(1/(4*B13)))),IF(AND($C$60=\"Yes\",ISNUMBER(F13)),ASIN(SQRT(F13)),\"\")))","v":1.4120161121491357},{"$f":"IF(AND($C$60=\"Yes\",ISNUMBER(G13),G13=0),ASIN(SQRT(1/(4*D13))),IF(AND($C$60=\"Yes\",ISNUMBER(G13),G13=1),ASIN(SQRT(1-(1/(4*D13)))),IF(AND($C$60=\"Yes\",ISNUMBER(G13)),ASIN(SQRT(G13)),\"\")))","v":1.2490457723982542},null,"H. rufescens (red abalone)"]
[2,10,9,10,8,{"$f":"IF(AND(ISNUMBER(C14),$C$60=\"Yes\"),C14/B14,\"\")","v":0.9},{"$f":"IF(AND(ISNUMBER(E14),$C$60=\"Yes\"),E14/D14,\"\")","v":0.8},null,1.2490457723982542,1.1071487177940904,null,"M. berryllina (inland silverside)"]
[3,10,10,10,9,1,0.9,null,1.4120161121491357,1.2490457723982542,null,"M. menidia (atlantic silverside)"]
[4,10,10,10,8,1,0.8,null,1.4120161121491357,1.1071487177940904,null,"M. peninsulae (tidewater silverside)",null,null,null,null,null,"Statistic","Control","IWC"]
[5,null,null,null,null,"","",null,"","",null,"M. pyrifera (giant kelp)",null,null,null,null,null,{"$f":"IF(AND($C$60=\"No\",ISNUMBER(C13)), \"Mean of Raw Data\",IF(AND($C$60=\"Yes\",ISNUMBER(C13)),\"Percent Mean of Raw Data\",\"\"))","v":"Percent Mean of Raw Data"},{"$f":"IF(AND($C$60=\"No\",ISNUMBER(C13)), AVERAGE(C13:C52),IF(AND($C$60=\"Yes\",ISNUMBER(C13)),AVERAGE(C13:C52)/AVERAGE(B13:B52),\"\"))","v":0.97499999999999998},{"$f":"IF(AND($C$60=\"No\",ISNUMBER(E13)), AVERAGE(E13:E52),IF(AND($C$60=\"Yes\",ISNUMBER(E13)),AVERAGE(E13:E52)/AVERAGE(D13:D52),\"\"))","v":0.85}]
[6,null,null,null,null,"","",null,"","",null,"Mytilus sp. (mussel)",null,null,null,null,null,{"$f":"IF(AND($C$60=\"No\",ISNUMBER(C13)), \"Mean used in Calculation (non-transformed)\",IF(AND($C$60=\"Yes\",ISNUMBER(C13)),\"Mean used in Calcuation (transformed)\",\"\"))","v":"Mean used in Calcuation (transformed)"},{"$f":"IF(C60=\"NO\",AVERAGE(C13:C52), IF(C60=\"YES\",AVERAGE(I13:I52),\"\"))","v":1.3712735272114154},{"$f":"IF(C60=\"NO\",AVERAGE(E13:E52), IF(C60=\"YES\",AVERAGE(J13:J52),\"\"))","v":1.1780972450961724}]
[7,null,null,null,null,"","",null,"","",null,"O. mykiss (rainbow trout)",null,null,null,null,null,{"$f":"IF(AND($C$60=\"No\",ISNUMBER(C13)), \"Variance used in Calculation (non-transformed)\",IF(AND($C$60=\"Yes\",ISNUMBER(C13)),\"Variance used in Calcuation (transformed)\",\"\"))","v":"Variance used in Calcuation (transformed)"},{"$f":"IF(C60=\"NO\",VAR(C13:C52),IF(C60=\"YES\",VAR(I13:I52),\"\"))","v":6.6398329096294352E-3},{"$f":"IF(C60=\"NO\",VAR(E13:E52),IF(C60=\"YES\",VAR(J13:J52),\"\"))","v":6.7115913684456805E-3}]
[8,null,null,null,null,"","",null,"","",null,"P. promelas (fathead minnow)",null,null,null,null,null,{"$f":"IF(AND($C$60=\"No\",ISNUMBER(C13)), \"Standard Deviation of Raw Data\",IF(AND($C$60=\"Yes\",ISNUMBER(C13)),\"Standard Deviation of Transformed Data\",\"\"))","v":"Standard Deviation of Transformed Data"},{"$f":"IF(ISNUMBER(S19),SQRT(S19),\"\")","v":8.1485169875440744E-2},{"$f":"IF(ISNUMBER(T19),SQRT(T19),\"\")","v":8.1924302672928995E-2}]
[9,null,null,null,null,"","",null,"","",null,"S. capricornutum (green algae)",null,null,null,null,null,{"$f":"IF(AND($C$60=\"No\",ISNUMBER(C13)), \"CV of Raw Data\",IF(AND($C$60=\"Yes\",ISNUMBER(C13)),\"CV of Transformed Data\",\"\"))","v":"CV of Transformed Data"},{"$f":"IF(ISNUMBER(S18),S20/S18,\"\")","v":5.9422987652322561E-2},{"$f":"IF(ISNUMBER(T18),T20/T18,\"\")","v":6.9539507892017197E-2}]
[10,null,null,null,null,"","",null,"","",null,"S. fontinalis (brook trout)",null,null,null,null,null,{"$f":"IF(ISNUMBER(S22),\"n\",\"\")","v":"n"},{"$f":"IF($C$60=\"NO\",COUNT(C13:C52),IF($C$60=\"YES\",COUNT(I13:I52),\"\"))","v":4},{"$f":"IF($C$60=\"NO\",COUNT(E13:E52),IF($C$60=\"YES\",COUNT(J13:J52),\"\"))","v":4}]
[11,null,null,null,null,"","",null,"","",null,"S. purpuratus (echinoderm)"]
[12,null,null,null,null,"","",null,"","",null,"T. gratilla (echinoderm)",null,null,null,null,null,"Mean % Effect at IWC",{"$f":"IF(AND(ISNUMBER(S17),ISNUMBER(T17)),((S17-T17)/S17)*100,\"\")","v":12.820512820512823}]
[13,null,null,null,null,"","",null,"",""]
[14,null,null,null,null,"","",null,"","",null,null,null,null,null,null,null,"Calculated t-value=",{"$f":"IF(OR(ISTEXT(C62),ISTEXT(C64),C58=\"Click to choose from menu\"),\"\",(T18-(C62*S18))/SQRT((T19/T22)+(((C62^2)*S19)/S22)))","v":1.5488470354765529}]
[15,null,null,null,null,"","",null,"","",null,null,null,null,null,null,null,"Degrees of Freedom (ν)=",{"$f":"IF(OR(ISTEXT(C62),ISTEXT(C64),C58=\"Click to choose from menu\"),\"\",INT(((((T19/T22)+((((C62)^2)*S19)/S22))^2))/((((T19/T22)^2)/(T22-1))+((((((C62^2)*S19)/S22)^2)/(S22-1))))))","v":5}]
[16,null,null,null,null,"","",null,"","",null,null,null,null,null,null,null,"Critical t-value=",{"$f":"IF(OR(ISTEXT(C62),ISTEXT(C64),C58=\"Click to choose from menu\"),\"\",TINV((2*C64),S27))","v":1.4758840488244813}]
[17,null,null,null,null,"","",null,"",""]
[18,null,null,null,null,"","",null,"",""]
{"$rows_left_out":35}
{"sheet":"Calculator","index":3,"n_rows":64,"n_cols":22,"rows_kept":64,"cut":false,"hidden":false,"merged":[]}
[null,null,null,null,null,null,null,null,null,null,"Click to choose from menu","Click to choose from menu","Click to choose from menu",null,null,null,null,null,null,"Conduct WET Test"]
[null,null,null,null,null,null,null,null,null,null,"Fertilization","A. affinis (topsmelt)","Acute",null,null,null,null,null,null,"↓"]
[null,null,null,null,null,null,null,null,null,null,"Germination","A. bahia (mysid shrimp)","Chronic",null,null,null,null,null,null,"Apply arcsine square root transformation for percent data"]
["Lab Name",null,null,null,null,null,null,null,null,null,"Germ-Tube Length","A. punctulata (echinoderm)",null,null,null,null,null,null,null,"↓"]
["Client Name",null,null,null,null,null,null,null,null,null,"Growth","C. dubia (water flea)",null,null,null,null,null,null,null,"Calculate t value using TST Welch’s test"]
["Test ID",null,null,null,null,null,null,null,null,null,"Larval Development","C. gigas (oyster)",null,null,null,null,null,null,null,"↓"]
["Test Date",null,null,null,null,null,null,null,null,null,"Reproduction","C. variegatus (sheepshead minnow)",null,null,null,null,null,null,null,"Calculated t-value > critical t-value?"]
["Test Duration",null,null,null,null,null,null,null,null,null,"Survival","D. excentricus (echinoderm)",null,null,null,null,null,null,"↓",null,"↓"]
["IWC",null,null,null,null,null,null,null,null,null,null,"D. magna (water flea)",null,null,null,null,null,null,"YES",null,"NO"]
[null,null,null,null,null,null,null,null,null,null,null,"D. pulex (water flea)",null,null,null,null,null,null,"\"PASS\"",null,"\"FAIL\""]
[null,"Control Data","Control Data","IWC (Instream Waste Concentration) Data","IWC (Instream Waste Concentration) Data",null,null,null,"Arcsine SqRt Transformation",null,null,"H. azteca (amphipod)",null,null,null,null,null,null,"Sample is NOT Toxic",null,"Sample is Toxic","If no variance in both the control and the IWC,  a % difference <25 for chronic, or <20 for acute is considered \"Passing\"."]
["Replicate Number","Number of Organisms Exposed or Counted","Response (Final Count, Weight, Length, etc.)","Number of Organisms Exposed or Counted","Response (Final Count, Weight, Length, etc.)","Control","IWC",null,"Control","Critical Conc. (IWC)",null,"H. costata (mysid)",null,null,null,null,null,null,null,null,null,{"$f":"IF(AND(S19=0,T19=0),((AVERAGE(C13:C52)-AVERAGE(E13:E52))/AVERAGE(C13:C52))*100,\"\")","v":""}]
[1,null,null,null,null,{"$f":"IF(AND(ISNUMBER(C13),$C$60=\"Yes\"),C13/B13,\"\")","v":""},{"$f":"IF(AND(ISNUMBER(E13),$C$60=\"Yes\"),E13/D13,\"\")","v":""},null,{"$f":"IF(AND($C$60=\"Yes\",ISNUMBER(F13),F13=0),ASIN(SQRT(1/(4*B13))),IF(AND($C$60=\"Yes\",ISNUMBER(F13),F13=1),ASIN(SQRT(1-(1/(4*B13)))),IF(AND($C$60=\"Yes\",ISNUMBER(F13)),ASIN(SQRT(F13)),\"\")))","v":""},{"$f":"IF(AND($C$60=\"Yes\",ISNUMBER(G13),G13=0),ASIN(SQRT(1/(4*D13))),IF(AND($C$60=\"Yes\",ISNUMBER(G13),G13=1),ASIN(SQRT(1-(1/(4*D13)))),IF(AND($C$60=\"Yes\",ISNUMBER(G13)),ASIN(SQRT(G13)),\"\")))","v":""},null,"H. rufescens (red abalone)"]
[2,null,null,null,null,{"$f":"IF(AND(ISNUMBER(C14),$C$60=\"Yes\"),C14/B14,\"\")","v":""},{"$f":"IF(AND(ISNUMBER(E14),$C$60=\"Yes\"),E14/D14,\"\")","v":""},null,"","",null,"M. berryllina (inland silverside)"]
[3,null,null,null,null,"","",null,"","",null,"M. menidia (atlantic silverside)"]
[4,null,null,null,null,"","",null,"","",null,"M. peninsulae (tidewater silverside)",null,null,null,null,null,"Statistic","Control","IWC"]
[5,null,null,null,null,"","",null,"","",null,"M. pyrifera (giant kelp)",null,null,null,null,null,{"$f":"IF(AND($C$60=\"No\",ISNUMBER(C13)), \"Mean of Raw Data\",IF(AND($C$60=\"Yes\",ISNUMBER(C13)),\"Percent Mean of Raw Data\",\"\"))","v":""},{"$f":"IF(AND($C$60=\"No\",ISNUMBER(C13)), AVERAGE(C13:C52),IF(AND($C$60=\"Yes\",ISNUMBER(C13)),AVERAGE(C13:C52)/AVERAGE(B13:B52),\"\"))","v":""},{"$f":"IF(AND($C$60=\"No\",ISNUMBER(E13)), AVERAGE(E13:E52),IF(AND($C$60=\"Yes\",ISNUMBER(E13)),AVERAGE(E13:E52)/AVERAGE(D13:D52),\"\"))","v":""}]
[6,null,null,null,null,"","",null,"","",null,"Mytilus sp. (mussel)",null,null,null,null,null,{"$f":"IF(AND($C$60=\"No\",ISNUMBER(C13)), \"Mean used in Calculation (non-transformed)\",IF(AND($C$60=\"Yes\",ISNUMBER(C13)),\"Mean used in Calcuation (transformed)\",\"\"))","v":""},{"$f":"IF(C60=\"NO\",AVERAGE(C13:C52), IF(C60=\"YES\",AVERAGE(I13:I52),\"\"))","v":""},{"$f":"IF(C60=\"NO\",AVERAGE(E13:E52), IF(C60=\"YES\",AVERAGE(J13:J52),\"\"))","v":""}]
[7,null,null,null,null,"","",null,"","",null,"O. mykiss (rainbow trout)",null,null,null,null,null,{"$f":"IF(AND($C$60=\"No\",ISNUMBER(C13)), \"Variance used in Calculation (non-transformed)\",IF(AND($C$60=\"Yes\",ISNUMBER(C13)),\"Variance used in Calcuation (transformed)\",\"\"))","v":""},{"$f":"IF(C60=\"NO\",VAR(C13:C52),IF(C60=\"YES\",VAR(I13:I52),\"\"))","v":""},{"$f":"IF(C60=\"NO\",VAR(E13:E52),IF(C60=\"YES\",VAR(J13:J52),\"\"))","v":""}]
[8,null,null,null,null,"","",null,"","",null,"P. promelas (fathead minnow)",null,null,null,null,null,{"$f":"IF(AND($C$60=\"No\",ISNUMBER(C13)), \"Standard Deviation of Raw Data\",IF(AND($C$60=\"Yes\",ISNUMBER(C13)),\"Standard Deviation of Transformed Data\",\"\"))","v":""},{"$f":"IF(ISNUMBER(S19),SQRT(S19),\"\")","v":""},{"$f":"IF(ISNUMBER(T19),SQRT(T19),\"\")","v":""}]
[9,null,null,null,null,"","",null,"","",null,"S. capricornutum (green algae)",null,null,null,null,null,{"$f":"IF(AND($C$60=\"No\",ISNUMBER(C13)), \"CV of Raw Data\",IF(AND($C$60=\"Yes\",ISNUMBER(C13)),\"CV of Transformed Data\",\"\"))","v":""},{"$f":"IF(ISNUMBER(S18),S20/S18,\"\")","v":""},{"$f":"IF(ISNUMBER(T18),T20/T18,\"\")","v":""}]
[10,null,null,null,null,"","",null,"","",null,"S. fontinalis (brook trout)",null,null,null,null,null,{"$f":"IF(ISNUMBER(S22),\"n\",\"\")","v":""},{"$f":"IF($C$60=\"NO\",COUNT(C13:C52),IF($C$60=\"YES\",COUNT(I13:I52),\"\"))","v":""},{"$f":"IF($C$60=\"NO\",COUNT(E13:E52),IF($C$60=\"YES\",COUNT(J13:J52),\"\"))","v":""}]
[11,null,null,null,null,"","",null,"","",null,"S. purpuratus (echinoderm)"]
[12,null,null,null,null,"","",null,"","",null,"T. gratilla (echinoderm)",null,null,null,null,null,"Mean % Effect at IWC",{"$f":"IF(AND(ISNUMBER(S17),ISNUMBER(T17)),((S17-T17)/S17)*100,\"\")","v":""}]
[13,null,null,null,null,"","",null,"",""]
[14,null,null,null,null,"","",null,{"$f":"IF(AND($C$60=\"Yes\",ISNUMBER(F26),F26=0),ASIN(SQRT(1/(4*B26))),IF(AND($C$60=\"Yes\",ISNUMBER(F26),F26=1),ASIN(SQRT(1-(1/(4*B26)))),IF(AND($C$60=\"Yes\",ISNUMBER(F26)),ASIN(SQRT(F26)),\"\")))","v":""},{"$f":"IF(AND($C$60=\"Yes\",ISNUMBER(G26),G26=0),ASIN(SQRT(1/(4*D26))),IF(AND($C$60=\"Yes\",ISNUMBER(G26),G26=1),ASIN(SQRT(1-(1/(4*D26)))),IF(AND($C$60=\"Yes\",ISNUMBER(G26)),ASIN(SQRT(G26)),\"\")))","v":""},null,null,null,null,null,null,null,"Calculated t-value=",{"$f":"IF(OR(ISTEXT(C62),ISTEXT(C64),C58=\"Click to choose from menu\"),\"\",(T18-(C62*S18))/SQRT((T19/T22)+(((C62^2)*S19)/S22)))","v":""}]
[15,null,null,null,null,"","",null,"","",null,null,null,null,null,null,null,"Degrees of Freedom (ν)=",{"$f":"IF(OR(ISTEXT(C62),ISTEXT(C64),C58=\"Click to choose from menu\"),\"\",INT(((((T19/T22)+((((C62)^2)*S19)/S22))^2))/((((T19/T22)^2)/(T22-1))+((((((C62^2)*S19)/S22)^2)/(S22-1))))))","v":""}]
[16,null,null,null,null,"","",null,"","",null,null,null,null,null,null,null,"Critical t-value=",{"$f":"IF(OR(ISTEXT(C62),ISTEXT(C64),C58=\"Click to choose from menu\"),\"\",TINV((2*C64),S27))","v":""}]
[17,null,null,null,null,"","",null,"",""]
[18,null,null,null,null,"","",null,"",""]
{"$rows_left_out":35}
{"sheet":"TST Summary Sheet","index":4,"n_rows":54,"n_cols":9,"rows_kept":54,"cut":false,"hidden":false,"merged":[]}
["Lab Name",{"$f":"IF(Calculator!B4=\"\",\"\",Calculator!B4)","v":""},null,null,"Client Name",null,{"$f":"IF(Calculator!B5=\"\",\"\",Calculator!B5)","v":""}]
[]
["Test ID",{"$f":"IF(Calculator!B6=\"\",\"\",Calculator!B6)","v":""},null,null,"Test Species",null,{"$f":"IF(Calculator!C54=\"Click to Choose from Menu\",\"\",Calculator!C54)","v":""}]
[]
["Test Date",{"$f":"IF(Calculator!B7=\"\",\"\",Calculator!B7)","v":""},null,null,"Test Type",null,{"$f":"IF(Calculator!C56=\"Click to Choose from Menu\",\"\",Calculator!C56)","v":""}]
[]
["Duration",{"$f":"IF(Calculator!B8=\"\",\"\",Calculator!B8)","v":""},null,null,"Endpoint",null,{"$f":"IF(Calculator!C58=\"Click to Choose from Menu\",\"\",Calculator!C58)","v":""}]
[]
["IWC",{"$f":"IF(Calculator!B9=\"\",\"\",Calculator!B9)","v":""}]
[]
[]
["Statistic",null,null,null,"Control",null,"Instream Waste Concentration (IWC)"]
[{"$f":"IF(Calculator!R17=\"\",\"\",Calculator!R17)","v":""},null,null,null,{"$f":"IF(Calculator!S17=\"\",\"\",Calculator!S17)","v":""},null,{"$f":"IF(Calculator!T17=\"\",\"\",Calculator!T17)","v":""}]
[{"$f":"IF(Calculator!R18=\"\",\"\",Calculator!R18)","v":""},null,null,null,{"$f":"IF(Calculator!S18=\"\",\"\",Calculator!S18)","v":""},null,{"$f":"IF(Calculator!T18=\"\",\"\",Calculator!T18)","v":""}]
[{"$f":"IF(Calculator!R19=\"\",\"\",Calculator!R19)","v":""},null,null,null,{"$f":"IF(Calculator!S19=\"\",\"\",Calculator!S19)","v":""},null,{"$f":"IF(Calculator!T19=\"\",\"\",Calculator!T19)","v":""}]
[{"$f":"IF(Calculator!R20=\"\",\"\",Calculator!R20)","v":""},null,null,null,{"$f":"IF(Calculator!S20=\"\",\"\",Calculator!S20)","v":""},null,{"$f":"IF(Calculator!T20=\"\",\"\",Calculator!T20)","v":""}]
[{"$f":"IF(Calculator!R21=\"\",\"\",Calculator!R21)","v":""},null,null,null,{"$f":"IF(Calculator!S21=\"\",\"\",Calculator!S21)","v":""},null,{"$f":"IF(Calculator!T21=\"\",\"\",Calculator!T21)","v":""}]
[{"$f":"IF(Calculator!R22=\"\",\"\",Calculator!R22)","v":""},null,null,null,{"$f":"IF(Calculator!S22=\"\",\"\",Calculator!S22)","v":""},null,{"$f":"IF(Calculator!T22=\"\",\"\",Calculator!T22)","v":""}]
[]
[]
["Mean Percent Effect at the IWC"]
[{"$f":"IF(Calculator!S24=\"\",\"\",Calculator!S24)","v":""}]
[]
["Calculated t-value",null,"Degrees of Freedom",null,"Critical t-value",null,"Percent Effect (if no variance)"]
[{"$f":"IF(ISNUMBER(Calculator!S26),Calculator!S26,\"\")","v":""},null,{"$f":"IF(ISNUMBER(Calculator!S27),Calculator!S27,\"\")","v":""},null,{"$f":"IF(ISNUMBER(Calculator!S28),Calculator!S28,\"\")","v":""},null,{"$f":"IF(Calculator!V12=\"\",\"\",Calculator!V12)","v":""}]
[]
["Results"]
[{"$f":"IF(A25<E25,\"Fail\",IF(A25>E25,\"Pass\",IF(AND(G5=\"Acute\",G25>=20),\"Fail\",IF(AND(G5=\"Acute\",G25<20),\"Pass\",IF(AND(G5=\"Chronic\",G25>=25),\"Fail\",IF(AND(G5=\"Chronic\",G25<25),\"Pass\",\"\"))))))","v":""},null,{"$f":"IF(D28=\"\",\"\",\"Sample is \")","v":""},{"$f":"IF(A25<E25,\"Toxic\",IF(A25>E25,\"Non-toxic\",IF(AND(G5=\"Acute\",G25>=20),\"Toxic\",IF(AND(G5=\"Acute\",G25<20),\"Non-toxic\",IF(AND(G5=\"Chronic\",G25>=25),\"Toxic\",IF(AND(G5=\"Chronic\",G25<25),\"Non-toxic\",\"\"))))))","v":""}]
[]
["Raw Data"]
{"$rows_left_out":25}
{"sheet":"Statistics","index":5,"n_rows":1,"n_cols":15,"rows_kept":1,"cut":false,"hidden":false,"merged":[]}
["Lab Name","Client Name","Test ID","Test Date","Test Duration","IWC","Test Species","Chronic or Acute","Endpoint","Mean % Effect at IWC","Calculated t-value","Critical t-value","Percent Difference","Pass or Fail","Toxic or Non-toxic"]

{"sheet":"Formulas","index":6,"n_rows":7,"n_cols":15,"rows_kept":7,"cut":false,"hidden":true,"merged":[]}
[{"$f":"Statistics!A1","v":"Lab Name"},{"$f":"Statistics!B1","v":"Client Name"},{"$f":"Statistics!C1","v":"Test ID"},{"$f":"Statistics!D1","v":"Test Date"},{"$f":"Statistics!E1","v":"Test Duration"},"Critical Conc.",{"$f":"Statistics!G1","v":"Test Species"},{"$f":"Statistics!H1","v":"Chronic or Acute"},{"$f":"Statistics!I1","v":"Endpoint"},"Mean % Effect at Critical Conc.",{"$f":"Statistics!K1","v":"Calculated t-value"},{"$f":"Statistics!L1","v":"Critical t-value"},{"$f":"Statistics!M1","v":"Percent Difference"},{"$f":"Statistics!N1","v":"Pass or Fail"},{"$f":"Statistics!O1","v":"Toxic or Non-toxic"}]
[{"$f":"IF(Calculator!B4=\"\",\"\",Calculator!B4)","v":""},{"$f":"IF(Calculator!B5=\"\",\"\",Calculator!B5)","v":""},{"$f":"IF(Calculator!B6=\"\",\"\",Calculator!B6)","v":""},{"$f":"IF(Calculator!B7=\"\",\"\",Calculator!B7)","v":""},{"$f":"IF(Calculator!B8=\"\",\"\",Calculator!B8)","v":""},{"$f":"IF(Calculator!B9=\"\",\"\",Calculator!B9)","v":""},{"$f":"IF(Calculator!C54=\"Click to Choose from Menu\",\"\",Calculator!C54)","v":""},{"$f":"IF(Calculator!C56=\"Click to Choose from Menu\",\"\",Calculator!C56)","v":""},{"$f":"IF(Calculator!C58=\"Click to Choose from menu\",\"\",Calculator!C58)","v":""},{"$f":"IF(ISNUMBER(Calculator!S24),Calculator!S24,\"\")","v":""},{"$f":"IF(ISNUMBER(Calculator!S26),Calculator!S26,\"\")","v":""},{"$f":"IF(ISNUMBER(Calculator!S28),Calculator!S28,\"\")","v":""},{"$f":"IF(AND(Calculator!S19=0,Calculator!T19=0),((AVERAGE(Calculator!C13:C52)-AVERAGE(Calculator!E13:E52))/AVERAGE(Calculator!C13:C52))*100,\"\")","v":""},{"$f":"IF(K2<L2,\"Fail\",IF(K2>L2,\"Pass\",IF(AND(H2=\"Acute\",M2>=20),\"Fail\",IF(AND(H2=\"Acute\",M2<20),\"Pass\",IF(AND(H2=\"Chronic\",M2>=25),\"Fail\",IF(AND(H2=\"Chronic\",M2<25),\"Pass\",\"\"))))))","v":""},{"$f":"IF(K2<L2,\"Toxic\",IF(K2>L2,\"Non-toxic\",IF(AND(H2=\"Acute\",M2>=20),\"Toxic\",IF(AND(H2=\"Acute\",M2<20),\"Non-toxic\",IF(AND(H2=\"Chronic\",M2>=25),\"Toxic\",IF(AND(H2=\"Chronic\",M2<25),\"Non-toxic\",\"\"))))))","v":""}]
[]
[]
["Formulas on this page (in Row 1) are used to copy data from Calculator worksheet to the Statistics worksheet."]
["PasteSpecial-Values"]
["PasteSpecial-Formulas"]