{"text_format":"1","workbook":"xlsx","n_sheets":12,"sheets":["Instructions for PEP","Cover Page (Auto Populates)","Summary Page","Multi-Year Budget Plan","1.0 Project Management","2.0 Site Assessment","3.0 GW Monitoring","4.0 Remedy Selection","5.0 Remediation Installation","6.0 Remedial System O&M","7.0 Post Remediation Closure","Valid Values"],"not_rendered":{"charts":0,"images":11,"macros":1,"external_links":1,"defined_names":85,"comments":3,"pivot_tables":0},"unopened":[],"bounds":{"document_bytes":16777216,"sheet_cells":100000,"rows_first":2000,"rows_last":500,"rows_between":2000,"halvings":0,"cell_chars":16384,"cell_head_chars":4096},"cells_cut":0,"cells_raw":0,"read":"whole","date_system":"1900"}

{"sheet":"Instructions for PEP","index":0,"n_rows":141,"n_cols":5,"rows_kept":141,"cut":false,"hidden":false,"merged":[]}
[]
[]
[]
[]
[]
[]
[]
[]
[]
[]
{"$rows_left_out":132}
{"sheet":"Cover Page (Auto Populates)","index":1,"n_rows":26,"n_cols":9,"rows_kept":26,"cut":false,"hidden":false,"merged":[[10,0,10,2],[17,0,17,1],[20,3,20,4],[22,3,22,4],[19,0,19,8],[20,0,20,2],[22,0,22,2],[21,3,21,4],[21,7,25,8],[20,7,20,8],[25,0,25,3],[23,0,24,3],[23,4,24,5],[25,4,25,5],[23,6,24,6],[5,6,5,8],[16,0,16,8],[15,0,15,3],[1,2,1,5],[2,2,2,5],[3,2,3,5],[4,0,4,5],[12,0,12,2],[12,3,12,5],[14,0,14,8],[6,3,6,5],[7,3,7,5],[11,3,11,5],[8,0,8,2],[8,3,8,5],[11,0,11,2],[3,7,3,8],[10,3,10,5],[9,0,9,2],[9,3,9,5],[0,0,0,5],[0,6,0,8],[6,0,6,2],[7,0,7,2],[1,0,1,1],[2,7,2,8],[4,7,4,8],[2,0,2,1],[3,0,3,1],[5,0,5,2],[5,3,5,5],[1,7,1,8]]}
["Project/Site Information",null,null,null,null,null,"Additional Site Information"]
["Claim No. (s):",null,{"$f":"IF('Summary Page'!F7=\"\", \" (auto-fill from Summary Page)\", 'Summary Page'!F7)","v":" (auto-fill from Summary Page)"},null,null,null,"Total Amount Reimbursed To Date:",{"$f":"IF('Summary Page'!I24=\"\", \"(auto-fill from Summary Page) \", 'Summary Page'!I24)","v":"(auto-fill from Summary Page) "}]
["Project or Site Name:",null,{"$f":"IF('Summary Page'!E6=\"\", \"(auto-fill from Summary Page) \", 'Summary Page'!E6)","v":"(auto-fill from Summary Page) "},null,null,null,"Total Submitted Costs (not reimbursed yet):",{"$f":"IF('Summary Page'!I25=\"\", \"(auto-fill from Summary Page) \", 'Summary Page'!I25)","v":"(auto-fill from Summary Page) "}]
["Project or Site Address:",null,{"$f":"IF('Summary Page'!T6=\"\", \"(auto-fill from Summary Page) \", 'Summary Page'!T6)","v":"(auto-fill from Summary Page) "},null,null,null,"Total Unsubmitted Costs:",{"$f":"IF('Summary Page'!I26=\"\", \"(auto-fill from Summary Page) \", 'Summary Page'!I26)","v":"(auto-fill from Summary Page) "}]
["Contact Information",null,null,null,null,null,"Claim within ECAP",{"$f":"IF('Summary Page'!H8=\"(Select from Pull-Down Menu)\", \"(auto-fill from Summary Page) \", 'Summary Page'!H8)","v":"(auto-fill from Summary Page) "}]
["Claimant/Grantee Name:",null,null,{"$f":"IF('Summary Page'!H9=\"\", \"(auto-fill from Summary Page) \", 'Summary Page'!H9)","v":"(auto-fill from Summary Page) "},null,null,"Budget Information"]
["Claimant/Grantee Contact Name:",null,null,{"$f":"IF('Summary Page'!W9=\"\", \"(auto-fill from Summary Page) \", 'Summary Page'!W9)","v":"(auto-fill from Summary Page) "},null,null,"Fiscal Year Start Date","Budget Category","Projected Cost for Fiscal Year"]
["Claimant/Grantee  Email Address:",null,null,{"$f":"IF('Summary Page'!W10=\"\", \"(auto-fill from Summary Page) \", 'Summary Page'!W10)","v":"(auto-fill from Summary Page) "},null,null,{"$f":"'Multi-Year Budget Plan'!D5","v":"2023-07-01"},{"$f":"IF('Multi-Year Budget Plan'!D7=\"(Select from Pull-Down)\", \"(auto-fill from Budget Plan) \", 'Multi-Year Budget Plan'!D7)","v":"(auto-fill from Budget Plan) "},{"$f":"'Multi-Year Budget Plan'!D48","v":0}]
["Claimant/Grantee  Phone Number:",null,null,{"$f":"IF('Summary Page'!H10=\"\", \"(auto-fill from Summary Page) \", 'Summary Page'!H10)","v":"(auto-fill from Summary Page) "},null,null,{"$f":"'Multi-Year Budget Plan'!F5","v":"2024-07-01"},{"$f":"IF('Multi-Year Budget Plan'!F7=\"(Select from Pull-Down)\", \"(auto-fill from Budget Plan) \", 'Multi-Year Budget Plan'!F7)","v":"(auto-fill from Budget Plan) "},{"$f":"'Multi-Year Budget Plan'!F48","v":0}]
["Fund Staff Name and Email Address:",null,null,{"$f":"IF('Summary Page'!H11=\"\", \"(auto-fill from Summary Page) \", 'Summary Page'!H11)","v":"(auto-fill from Summary Page) "}]
{"$rows_left_out":17}
{"sheet":"Summary Page","index":2,"n_rows":71,"n_cols":29,"rows_kept":71,"cut":false,"hidden":false,"merged":[[25,19,25,22],[25,12,25,15],[25,16,25,18],[12,22,12,30],[13,22,13,30],[14,22,14,30],[16,3,16,30],[15,22,15,30],[15,16,15,21],[14,16,14,21],[13,16,13,21],[15,0,15,6],[15,7,15,15],[14,7,14,15],[14,0,14,6],[12,16,12,21],[2,24,2,27],[6,0,6,4],[6,5,6,7],[6,19,6,23],[11,22,11,30],[5,0,5,3],[8,0,8,6],[9,0,9,6],[8,16,8,21],[8,22,8,30],[9,22,9,30],[10,22,10,30],[9,16,9,21],[10,16,10,21],[10,7,10,15],[6,28,6,30],[6,8,6,11],[6,24,6,27],[3,11,3,15],[3,16,3,23],[6,12,6,15],[6,16,6,18],[5,4,5,13],[5,14,5,18],[5,19,5,30],[3,5,3,10],[9,7,9,15],[8,7,8,15],[13,0,13,6],[13,7,13,15],[12,0,12,6],[12,7,12,15],[11,0,11,6],[10,0,10,6],[11,7,11,15],[11,16,11,21],[16,0,16,2],[24,0,24,7],[25,23,25,30],[23,28,23,30],[24,28,24,30],[23,19,23,22],[24,19,24,22],[23,12,23,18],[24,12,24,18],[22,12,22,22],[23,0,23,7],[25,0,25,7],[22,0,22,11],[23,8,23,11],[24,8,24,11],[25,8,25,11],[7,0,7,6],[7,7,7,15],[7,16,7,30],[0,0,0,4],[0,5,0,9],[1,0,1,30],[2,11,2,13],[3,24,3,27],[2,14,2,23],[3,28,3,30],[2,0,2,2],[2,28,2,30],[3,0,3,4],[2,3,2,10],[4,0,4,30],[21,0,21,6],[21,7,21,15],[20,0,20,6],[20,7,20,15],[18,0,18,6],[18,7,18,15],[19,0,19,6],[19,7,19,15]]}
["Fiscal Year Start Date of PEP",null,null,null,null,"2023-07-01"]
["Section 1"]
["Reason for PEP",null,null,"(Select from Pull-Down Menu)",null,null,null,null,null,null,null,"Fund Program",null,null,"(Select from Pull-Down Menu)",null,null,null,null,null,null,null,null,null,"PEP Agreement Date"]
["Current FY Budget Amount",null,null,null,null,null,null,null,null,null,null,"Current FY Budget Category",null,null,null,null,"(Select from Pull-Down Menu)",null,null,null,null,null,null,null,"Revision No.",null,null,null,"(Select)"]
["Section 2"]
["Project or Site Name",null,null,null,null,null,null,null,null,null,null,null,null,null,"Project or Site Address"]
["Claim No.(s)",null,null,null,null,null,null,null," Global ID ",null,null,null,null,null,null,null,"Lead Agency",null,null,null,null,null,null,null,"Lead Agency Case No."]
["Claim is within ECAP (Yes or No)",null,null,null,null,null,null,"(Select from Pull-Down Menu)"]
["Claimant/Grantee Name",null,null,null,null,null,null,null,null,null,null,null,null,null,null,null,"Claimant/Grantee Contact Name"]
["Claimant/Grantee Contact Phone Number",null,null,null,null,null,null,null,null,null,null,null,null,null,null,null,"Claimant/Grantee  Email Address"]
{"$rows_left_out":62}
{"sheet":"Multi-Year Budget Plan","index":3,"n_rows":49,"n_cols":23,"rows_kept":49,"cut":false,"hidden":false,"merged":[[5,0,6,0],[5,1,6,1],[5,3,5,6],[5,2,6,2],[4,3,4,4],[7,4,10,4],[4,5,4,6],[7,6,10,6],[2,14,2,20],[12,6,15,6],[12,4,15,4],[34,4,39,4],[34,6,39,6],[41,4,45,4],[41,6,45,6],[17,4,20,4],[17,6,20,6],[22,4,26,4],[22,6,26,6],[28,4,32,4],[28,6,32,6]]}
["          Project or Site Name:",{"$f":"IF('Summary Page'!E6=\"\", \"(auto-fill from Summary Page) \", 'Summary Page'!E6)","v":"(auto-fill from Summary Page) "},null,null,null,"Claim No(s) or Project No(s):",{"$f":"IF('Summary Page'!F7=\"\", \"(auto-fill from Summary Page)\", 'Summary Page'!F7)","v":"(auto-fill from Summary Page)"}]
["Amendment No.:",{"$f":"IF('Summary Page'!AC4=\"(select)\", \"(auto-fill from Summary Page)\", 'Summary Page'!AC4)","v":"(auto-fill from Summary Page)"},null,null,null,"Date Agreement Reached:",{"$f":"IF('Summary Page'!AC3=\"\", \"(auto-fill from Summary Page) \", 'Summary Page'!AC3)","v":"(auto-fill from Summary Page) "}]
[null,null,null,null,null,null,null,null,null,null,null,null,null,null,"Enter percent of work to be completed each quarter\nMust total across to 100%"]
[]
["Shaded Cells are Unlocked",null,"Fiscal Year ",{"$f":"'Summary Page'!F1","v":"2023-07-01"},null,{"$f":"DATE(YEAR(D5)+1,MONTH(D5),DAY(D5))","v":"2024-07-01"},null,null,null,null,null,null,null,"Totals $$","1st Quarter\n(percent of total)","2st  Quarter","3rd  Quarter","4th\nQuarter","5th\nQuarter","6th\nQuarter","7th Quarter","8th Quarter","Total %"]
["Work Phase","Task","Total Costs Through Closure ","Budget Category by Fiscal Year"]
[null,null,null,"(Select from Pull-Down)","Brief Scope of Work","(Select from Pull-Down)","Brief Scope of Work"]
["     1.0 Project Management",{"$f":"'1.0 Project Management'!B3","v":"1.1 Electronic Technical Account Costs (ETAC)"},{"$f":"SUM(D8:G8)","v":0},{"$f":"'1.0 Project Management'!F8","v":0},null,{"$f":"'1.0 Project Management'!L8","v":0},null,null,null,null,null,null,2.1,8888,null,null,30,70]
[null,{"$f":"'1.0 Project Management'!B10","v":"1.2 Regulatory Technical Assistance Costs (RTAC)"},0,{"$f":"'1.0 Project Management'!F15","v":0},null,{"$f":"'1.0 Project Management'!L15","v":0}]
[null,{"$f":"'1.0 Project Management'!B17","v":"1.3  PEP/BCR"},0,{"$f":"'1.0 Project Management'!F22","v":0},null,{"$f":"'1.0 Project Management'!L22","v":0}]
{"$rows_left_out":40}
{"sheet":"1.0 Project Management","index":4,"n_rows":31,"n_cols":12,"rows_kept":31,"cut":false,"hidden":true,"merged":[[30,2,30,3],[30,8,30,9]]}
["FY",{"$f":"'Multi-Year Budget Plan'!D5","v":"2023-07-01"},null,null,null,null,null,{"$f":"'Multi-Year Budget Plan'!F5","v":"2024-07-01"}]
[]
[null,"1.1 Electronic Technical Account Costs (ETAC)",null,null,null,null,null,"1.1 Electronic Technical Account Costs (ETAC)"]
[null,"Staff Title/Classification ","Qty","Units","Rate","Total ",null,"Staff Title/Classification ","Qty","Units","Rate","Total "]
[null,"Project Manager",null,"hours",185,{"$f":"C5*E5","v":0},null,"Project Manager",null,"hours",185,{"$f":"I5*K5","v":0}]
[null,"Reimbursement Specialist",null,"hours",85,{"$f":"C6*E6","v":0},null,"Reimbursement Specialist",null,"hours",85,0]
[null,"Clerical",null,"hours",79,0,null,"Clerical",null,"hours",79,{"$f":"I7*K7","v":0}]
[null,"Totals",{"$f":"SUM(C5:C7)","v":0},null,null,{"$f":"SUM(F5:F7)","v":0},null,"Totals",{"$f":"SUM(I5:I7)","v":0},null,null,{"$f":"SUM(L5:L7)","v":0}]
[]
[null,"1.2 Regulatory Technical Assistance Costs (RTAC)",null,null,null,null,null,"1.2 Regulatory Technical Assistance Costs (RTAC)"]
{"$rows_left_out":22}
{"sheet":"2.0 Site Assessment","index":5,"n_rows":87,"n_cols":12,"rows_kept":87,"cut":false,"hidden":true,"merged":[[86,2,86,3],[86,8,86,9]]}
["FY",{"$f":"'Multi-Year Budget Plan'!D5","v":"2023-07-01"},null,null,null,null,null,{"$f":"'Multi-Year Budget Plan'!F5","v":"2024-07-01"}]
[]
[null,"2.1 Work Plan Preparation & Approval",null,null,null,null,null,"2.1 Work Plan Preparation & Approval"]
[null,"Staff Title/Classification ","Qty","Units","Rate","Total ",null,"Staff Title/Classification ","Qty","Units","Rate","Total "]
[null,"Principal Engineer/Geologist",null,"hours",222,{"$f":"C5*E5","v":0},null,"Principal Engineer/Geologist",null,"hours",222,{"$f":"I5*K5","v":0}]
[null,"Project Manager",null,"hours",185,{"$f":"C6*E6","v":0},null,"Project Manager",null,"hours",185,{"$f":"I6*K6","v":0}]
[null,"Senior Engineer/Geologist",null,"hours",185,0,null,"Senior Engineer/Geologist",null,"hours",185,0]
[null,"Project/Assoc Engineer/Geologist",null,"hours",160,0,null,"Project/Assoc Engineer/Geologist",null,"hours",160,0]
[null,"Staff Engineer/Geologist",null,"hours",133,0,null,"Staff Engineer/Geologist",null,"hours",133,0]
[null,"Drafts Person",null,"hours",97,0,null,"Drafts Person",null,"hours",97,0]
{"$rows_left_out":78}
{"sheet":"3.0 GW Monitoring","index":6,"n_rows":80,"n_cols":12,"rows_kept":80,"cut":false,"hidden":true,"merged":[[79,2,79,3],[79,8,79,9]]}
["FY",{"$f":"'Multi-Year Budget Plan'!D5","v":"2023-07-01"},null,null,null,null,null,{"$f":"'Multi-Year Budget Plan'!F5","v":"2024-07-01"}]
[]
[null,"3.1 Work Plan Preparation & Approval",null,null,null,null,null,"3.1 Work Plan Preparation & Approval"]
[null,"Staff Title/Classification ","Qty","Units","Rate","Total ",null,"Staff Title/Classification ","Qty","Units","Rate","Total "]
[null,"Principal Engineer/Geologist",null,"hours",222,{"$f":"C5*E5","v":0},null,"Principal Engineer/Geologist",null,"hours",222,{"$f":"I5*K5","v":0}]
[null,"Project Manager",null,"hours",185,{"$f":"C6*E6","v":0},null,"Project Manager",null,"hours",185,{"$f":"I6*K6","v":0}]
[null,"Senior Engineer/Geologist",null,"hours",185,0,null,"Senior Engineer/Geologist",null,"hours",185,0]
[null,"Project/Assoc Engineer/Geologist",null,"hours",160,0,null,"Project/Assoc Engineer/Geologist",null,"hours",160,0]
[null,"Staff Engineer/Geologist",null,"hours",133,0,null,"Staff Engineer/Geologist",null,"hours",133,0]
[null,"Drafts Person",null,"hours",97,0,null,"Drafts Person",null,"hours",97,0]
{"$rows_left_out":71}
{"sheet":"4.0 Remedy Selection","index":7,"n_rows":92,"n_cols":12,"rows_kept":92,"cut":false,"hidden":true,"merged":[[91,2,91,3],[91,8,91,9]]}
["FY",{"$f":"'Multi-Year Budget Plan'!D5","v":"2023-07-01"},null,null,null,null,null,{"$f":"'Multi-Year Budget Plan'!F5","v":"2024-07-01"}]
[]
[null,"4.1 Pilot Test/ Feasibility Study Work Plan",null,null,null,null,null,"4.1 Pilot Test/ Feasibility Study Work Plan"]
[null,"Staff Title/Classification ","Qty","Units","Rate","Total ",null,"Staff Title/Classification ","Qty","Units","Rate","Total "]
[null,"Principal Engineer/Geologist",null,"hours",222,{"$f":"C5*E5","v":0},null,"Principal Engineer/Geologist",null,"hours",222,{"$f":"I5*K5","v":0}]
[null,"Project Manager",null,"hours",185,{"$f":"C6*E6","v":0},null,"Project Manager",null,"hours",185,{"$f":"I6*K6","v":0}]
[null,"Senior Engineer/Geologist",null,"hours",185,0,null,"Senior Engineer/Geologist",null,"hours",185,0]
[null,"Project/Assoc Engineer/Geologist",null,"hours",160,0,null,"Project/Assoc Engineer/Geologist",null,"hours",160,0]
[null,"Staff Engineer/Geologist",null,"hours",133,0,null,"Staff Engineer/Geologist",null,"hours",133,0]
[null,"Drafts Person",null,"hours",97,0,null,"Drafts Person",null,"hours",97,0]
{"$rows_left_out":83}
{"sheet":"5.0 Remediation Installation","index":8,"n_rows":95,"n_cols":12,"rows_kept":95,"cut":false,"hidden":true,"merged":[[94,2,94,3],[94,8,94,9]]}
["FY",{"$f":"'Multi-Year Budget Plan'!D5","v":"2023-07-01"},null,null,null,null,null,{"$f":"'Multi-Year Budget Plan'!F5","v":"2024-07-01"}]
[]
[]
[null,"5.1 System Installation/Construction/Permitting",null,null,null,null,null,"5.1 System Installation/Construction/Permitting"]
[null,"Staff Title/Classification ","Qty","Units","Rate","Total ",null,"Staff Title/Classification ","Qty","Units","Rate","Total "]
[null,"Principal Engineer/Geologist",null,"hours",222,{"$f":"C6*E6","v":0},null,"Principal Engineer/Geologist",null,"hours",222,{"$f":"I6*K6","v":0}]
[null,"Project Manager",null,"hours",185,{"$f":"C7*E7","v":0},null,"Project Manager",null,"hours",185,{"$f":"I7*K7","v":0}]
[null,"Senior Engineer/Geologist",null,"hours",185,0,null,"Senior Engineer/Geologist",null,"hours",185,0]
[null,"Project/Assoc Engineer/Geologist",null,"hours",160,0,null,"Project/Assoc Engineer/Geologist",null,"hours",160,0]
[null,"Staff Engineer/Geologist",null,"hours",133,0,null,"Staff Engineer/Geologist",null,"hours",133,0]
{"$rows_left_out":86}
{"sheet":"6.0 Remedial System O&M","index":9,"n_rows":83,"n_cols":12,"rows_kept":83,"cut":false,"hidden":true,"merged":[[82,2,82,3],[82,8,82,9]]}
["FY",{"$f":"'Multi-Year Budget Plan'!D5","v":"2023-07-01"},null,null,null,null,null,{"$f":"'Multi-Year Budget Plan'!F5","v":"2024-07-01"}]
[]
[null,"6.1  System Performance Monitoring & Repairs",null,null,null,null,null,"6.1  System Performance Monitoring & Repairs"]
[null,"Staff Title/Classification ","Qty","Units","Rate","Total ",null,"Staff Title/Classification ","Qty","Units","Rate","Total "]
[null,"Project Manager",null,"hours",185,{"$f":"C5*E5","v":0},null,"Project Manager",null,"hours",185,{"$f":"I5*K5","v":0}]
[null,"Senior Engineer/Geologist",null,"hours",185,0,null,"Senior Engineer/Geologist",null,"hours",185,0]
[null,"Project/Assoc Engineer/Geologist",null,"hours",160,0,null,"Project/Assoc Engineer/Geologist",null,"hours",160,0]
[null,"Staff Engineer/Geologist",null,"hours",133,0,null,"Staff Engineer/Geologist",null,"hours",133,0]
[null,"Senior Technician",null,"hours",124,0,null,"Senior Technician",null,"hours",124,0]
[null,"Technician",null,"hours",106,0,null,"Technician",null,"hours",106,0]
{"$rows_left_out":74}
{"sheet":"7.0 Post Remediation Closure","index":10,"n_rows":90,"n_cols":12,"rows_kept":90,"cut":false,"hidden":true,"merged":[[2,1,2,5],[2,7,2,11],[89,2,89,3],[89,8,89,9]]}
["FY",{"$f":"'Multi-Year Budget Plan'!D5","v":"2023-07-01"},null,null,null,null,null,{"$f":"'Multi-Year Budget Plan'!F5","v":"2024-07-01"}]
[]
[null,"7.1  LTCP Evaluation & Well Destruction Work Plan Preparation (if directed)",null,null,null,null,null,"7.1  LTCP Evaluation & Well Destruction Work Plan Preparation (if directed)"]
[null,"Staff Title/Classification ","Qty","Units","Rate","Total ",null,"Staff Title/Classification ","Qty","Units","Rate","Total "]
[null,"Principal Engineer/Geologist",null,"hours",222,{"$f":"C5*E5","v":0},null,"Principal Engineer/Geologist",null,"hours",222,{"$f":"I5*K5","v":0}]
[null,"Project Manager",null,"hours",185,{"$f":"C6*E6","v":0},null,"Project Manager",null,"hours",185,{"$f":"I6*K6","v":0}]
[null,"Senior Engineer/Geologist",null,"hours",185,0,null,"Senior Engineer/Geologist",null,"hours",185,0]
[null,"Project/Assoc Engineer/Geologist",null,"hours",160,0,null,"Project/Assoc Engineer/Geologist",null,"hours",160,0]
[null,"Staff Engineer/Geologist",null,"hours",133,0,null,"Staff Engineer/Geologist",null,"hours",133,0]
[null,"Drafts Person",null,"hours",97,0,null,"Drafts Person",null,"hours",97,0]
{"$rows_left_out":81}
{"sheet":"Valid Values","index":11,"n_rows":123,"n_cols":22,"rows_kept":123,"cut":false,"hidden":true,"merged":[]}
["Program","Amendment Number","Amendment Reason","Document Type","Criteria Not Met","GW Class","GW Monitoring Frequency","Task Description","Project Phase","Explanation of Metrics (Reason for Difference in Budget/Schedule)","Proposed SOW","SCUFIIS Budget Categories","Fiscal Year","Budget Categories","Projected Duration","Borings/Wells","Remediation Information -Plan","Remediation Information -Technology","Remediation Inf -Substances Released","Remediation Information -Non-Petroleum Substances Released","Remediation Information -Type of Unit","Remediation Information -Remediation Unit Owner"]
["(Select from Pull-Down Menu)","(Select)","(Select from Pull-Down Menu)","(Select Type of Document)","(Select from Pull-Down Menu)","(Select appropriate Class)","(Select from Pull-Down Menu)","(Select from Pull-Down Menu)","(Select from Pull-Down Menu)","(Select from Pull-Down Menu)","(Select from Pull-Down Menu)","(Select from Pull-Down Menu)","(Select from Pull-Down Menu)","(Select from Pull-Down)","(Select from Pull-Down Menu)","(Select from Pull-Down Menu)","(Select from Pull-Down)","(Select from Pull-Down)","(Select from Pull-Down)","(Select from Pull-Down)","(Select from Pull-Down)","(Select from Pull-Down)"]
["Claims EAR - Emergency, Abandoned and Recalcitrant","N/A","N/A","13267 Requirement","General Criteria a. ","Class 1","Monthly","PM - ETAC","1.0 - Project Management","RR Documentation Missing","SWI - Soil and Groundwater Investigation","SWI - Soil and Groundwater Investigation","2016-07-01","SWI",1,0,"CAP - Corrective Action Plan","SVE","Benzene","Tetrachloroethylene (PCE)","Fixed","Claimant/Grantee"]
["Claims ECAP - Expedited Claim Account Program",1,"Additional Scope of Work","CAP - Corrective Action Plan","General Criteria b. ","Class 2","Quarterly","PM - RTAC","2.0 - Site Assessment","Consultant WP Implementation > 90 Days","RS/IRA - Remedial Selection/Interim Remedial Activities","RS/IRA - Remedial Selection/Interim Remedial Activities","2017-07-01","RS/IRA",2,1,"GW - Groundwater","GW P&T","Toluene","Trichloroethylene (TCE)","Mobile","Consultant"]
["Claims OSCF - Orphan Site Cleanup Fund",2,"Shift in Schedule","CSM - Conceptual Site Model","General Criteria c. ","Class 3","Semi-annually","PM - PEP/BCR","3.0 - Groundwater Monitoring","Off-Site Access Delay","CAP/REM - Corrective Action Plan/Remediation","CAP/REM - Corrective Action Plan/Remediation","2018-07-01","CAP/REM",3,2,"CSM - Conceptual Site Model","AS","Ethylbenzene","Vinyl Chloride",null,"Other"]
["Claims RSR -  Case Closure Review Summary Report",3,"Cost Overages","GW - Groundwater","General Criteria d. ","Class 4","Annually","SA - Site Assessment Workplan Preparation & Approval","4.0 - Interim Remedial Action","Fund Payment < 90 Days","VM - Verification Monitoring","VM - Verification Monitoring","2019-07-01","VM",4,3,"RAP - Remedial Action Plan","Excavation","Total Xylenes","Perchlorate"]
["Claims SCAP - Site Cleanup Subaccount Program",4,null,"IRA- Interim Remediation Action Plan","General Criteria e. ","Class 5",null,"SA - Soil/Groundwater Sampling","5.0 - Remedy Selection","Fund Payment > 90 Days","SC - Site Closure","SC - Site Closure","2020-07-01","SC",5,4,"WP - Work Plan","ISCO","Methyl Tert-Butyl Ether (MTBE)","Nitrate"]
["Other",5,null,"Other Report / Document","General Criteria f. ",null,null,"SA - Drilling Subcontractor","6.0 - Remedial Implementation","Lead Agency Report Review < 45 Days",null,"For Fund Staff Use Only","2021-07-01",null,6,5,null,"DPE","Ethyl Tert-Butyl Ether (ETBE),","2,3,7,8-TCDD (Dioxin)"]
[null,6,null,"Remedial Progress Report","General Criteria g.",null,"Vapor Intrusionto Indoor Air","SA - Soil Boring/Monitoring Well Installation","7.0 - Remedial System O & M","Lead Agency WP Concurrence < 60 Days",null,null,"2022-07-01",null,7,6,null,"MPE","Tertiary Butyl Alcohol (TBA),","Carbofuran"]
["Reason for PEP",7,null,"RAP - Remedial Action Plan","General Criteria h. ",null,"(Select Impediment)","SA - Soil Gas Survey","8.0 - Post Remediation/Closure","Consultant Reporting > 60 Days",null,null,"2023-07-01",null,8,7,null,null,"Di-isopropyl Ether (DIPE),","Other"]
{"$rows_left_out":113}